{"text_format":"1","workbook":"xlsx","n_sheets":7,"sheets":["Identificación","Tratamiento","Resultados","Informe","AYUDA","DATOS","Hoja1"],"not_rendered":{"charts":2,"images":14,"macros":1,"external_links":5,"defined_names":24,"comments":3,"pivot_tables":0},"unopened":[],"bounds":{"document_bytes":16777216,"sheet_cells":100000,"rows_first":2000,"rows_last":500,"rows_between":2000,"halvings":0,"cell_chars":16384,"cell_head_chars":4096},"cells_cut":0,"cells_raw":0,"read":"whole","date_system":"1900"}

{"sheet":"Identificación","index":0,"n_rows":103,"n_cols":47,"rows_kept":103,"cut":false,"hidden":false,"merged":[[0,0,6,1],[7,0,7,46],[4,45,6,46],[2,46,3,46],[2,45,3,45],[0,46,1,46],[0,45,1,45],[0,2,3,44],[4,2,6,44],[102,0,103,46],[8,46,11,46],[8,44,11,44],[8,45,11,45],[8,41,9,43],[8,0,9,17],[8,18,9,22],[8,23,9,40]]}
[null,null,"PROCESO \nMEJORA E INNOVACIÓN",null,null,null,null,null,null,null,null,null,null,null,null,null,null,null,null,null,null,null,null,null,null,null,null,null,null,null,null,null,null,null,null,null,null,null,null,null,null,null,null,null,null,"F3.G3.MI","2025-04-10"]
[]
[null,null,null,null,null,null,null,null,null,null,null,null,null,null,null,null,null,null,null,null,null,null,null,null,null,null,null,null,null,null,null,null,null,null,null,null,null,null,null,null,null,null,null,null,null,"Versión 9","Pagina 1 de 4"]
[]
[null,null,"FORMATO MATRIZ DE RIESGOS DE SEGURIDAD DE LA INFORMACIÓN",null,null,null,null,null,null,null,null,null,null,null,null,null,null,null,null,null,null,null,null,null,null,null,null,null,null,null,null,null,null,null,null,null,null,null,null,null,null,null,null,null,null,"Clasificación de la Información\nCLASIFICADA"]
[]
[]
[]
["1. IDENTIFICACIÓN",null,null,null,null,null,null,null,null,null,null,null,null,null,null,null,null,null,"2. ANÁLISIS",null,null,null,null,"3. VALORACIÓN",null,null,null,null,null,null,null,null,null,null,null,null,null,null,null,null,null,"4. MANEJO",null,null,"MATERIALIZACIÓN","OBSERVACIONES","PRECEDE"]
[]
{"$rows_left_out":94}
{"sheet":"Tratamiento","index":1,"n_rows":116,"n_cols":15,"rows_kept":116,"cut":false,"hidden":false,"merged":[[8,7,9,7],[8,8,9,8],[8,9,9,9],[8,3,9,3],[0,0,5,2],[7,0,7,2],[8,6,9,6],[6,0,6,14],[7,3,7,10],[115,0,115,14],[7,11,7,14],[0,13,1,13],[2,13,3,13],[8,5,9,5],[4,13,5,14],[0,3,1,12],[2,3,5,12],[2,14,3,14],[0,14,1,14],[8,10,9,10],[8,0,9,0],[8,1,9,1],[8,4,9,4],[8,2,9,2],[8,11,8,14]]}
[null,null,null,"PROCESO \nMEJORA E INNOVACIÓN",null,null,null,null,null,null,null,null,null,"F3.G3.MI","2025-04-10"]
[]
[null,null,null,"FORMATO MATRIZ DE RIESGOS DE SEGURIDAD DE LA INFORMACIÓN",null,null,null,null,null,null,null,null,null,"Versión 9","Pagina 2 de 4"]
[]
[null,null,null,null,null,null,null,null,null,null,null,null,null,"Clasificación de la Información\nCLASIFICADA"]
[]
[]
["1. RIESGO",null,null,"2. TRATAMIENTO",null,null,null,null,null,null,null,"3. SEGUIMIENTO AL TRATAMIENTO DEL RIESGO"]
["ID","PROCESO Y RIESGO IDENTIFICADO ","NIVEL RIESGO","CONTROLES MAS EFECTIVOS A IMPLEMENTAR","RIESGO EMERGENTE","ACTIVIDADES","EVIDENCIAS","FECHA\nINICIO","FECHA\nTERMINACIÓN","RESPONSABLE","ESTADO","Año: _____"]
[null,null,null,null,null,null,null,null,null,null,null,"CUATRIMESTRE\n(ENERO-ABRIL)","CUATRIMESTRE\n(MAYO-AGOSTO)","CUATRIMESTRE \n(SEPTIEMBRE-DICIEMBRE)","OBSERVACIONES"]
{"$rows_left_out":107}
{"sheet":"Resultados","index":2,"n_rows":102,"n_cols":20,"rows_kept":102,"cut":false,"hidden":false,"merged":[[5,3,5,18],[6,3,6,10],[5,0,5,2],[2,18,3,19],[0,0,3,1],[1,2,3,17],[0,2,0,17],[4,0,4,19],[86,0,87,19],[6,2,7,2],[6,1,7,1],[6,0,7,0],[6,18,7,18],[6,19,7,19],[7,12,7,14],[7,15,7,17]]}
[null,null,"PROCESO \nMEJORA E INNOVACIÓN",null,null,null,null,null,null,null,null,null,null,null,null,null,null,null,"F3.G3.MI","2025-04-10"]
[null,null,"FORMATO MATRIZ DE RIESGOS DE SEGURIDAD DE LA INFORMACIÓN",null,null,null,null,null,null,null,null,null,null,null,null,null,null,null,"Versión 9","Pagina 3 de 4"]
[null,null,null,null,null,null,null,null,null,null,null,null,null,null,null,null,null,null,"Clasificación de la Información\nCLASIFICADA"]
[]
[]
["1. RIESGO",null,null,"2. EVALUACIÓN RIESGO RESIDUAL",null,null,null,null,null,null,null,null,null,null,null,null,null,null,null,"3. OPORTUNIDAD"]
["ID","PROCESO Y RIESGO IDENTIFICADO ","NIVEL DESPUÉS DE CONTROLES","EVALUACIÓN CONTROL IMPLEMENTADO MEDIANTE EL TRATAMIENTO",null,null,null,null,null,null,null,null,null,null,null,null,null,null,"NIVEL DEL RIESGO FINALIZADO EL TRATAMIENTO","OPORTUNIDAD"]
[null,null,null,"Diseño",null,"Ejecución",null,"Efectividad","El control ayuda a disminuir la\nprobabilidad",null,"El control\nayuda a disminuir\nel impacto","IMPACTO X CONTROL","VALOR PROBABILIDAD",null,null,"VALOR IMPACTO"]
[null,{"$f":"IFERROR(CONCATENATE(VLOOKUP(A9,RIESGOS,4,FALSE),CHAR(10),CHAR(10),VLOOKUP(A9,RIESGOS,14,FALSE)),\"\")","v":"\n\n"},{"$f":"IFERROR(IF(COUNTIF($A$7:A9,A10)=0,VLOOKUP(A9,RIESGOS,41,FALSE),VLOOKUP(A9,RESULTADO,10,FALSE)),0)","v":0},null,{"$f":"VLOOKUP(D9,DATOS!D$104:E$106,2,0)","v":{"$error":"#N/A"}},null,{"$f":"VLOOKUP(F9,DATOS!F$104:G$106,2,0)","v":{"$error":"#N/A"}},{"$f":"IF(E9=\"\",\"\",INDEX(DATOS!$G$111:$I$113,E9,G9))","v":{"$error":"#N/A"}},null,{"$f":"IF(AND(H9=\"Efectivo\",I9=\"Directamente\"),2,IF(AND(H9=\"Efectivo\",I9=\"No disminuye\"),0,IF(AND(H9=\"Moderadamente efectivo\",I9=\"Directamente\"),1,IF(AND(H9=\"Moderadamente efectivo\",I9=\"No disminuye\"),0,IF(H9=\"Poco efectivo\",0,\"Por favor diligencia el diseño, ejecuión y determine si el control afecta la probabilidad\")))))","v":{"$error":"#N/A"}},null,{"$f":"IF(AND(H9=\"Efectivo\",K9=\"Directamente\"),2,IF(AND(H9=\"Efectivo\",K9=\"Indirectamente\"),1,IF(AND(H9=\"Efectivo\",K9=\"No disminuye\"),0,IF(AND(H9=\"Moderadamente efectivo\",K9=\"Directamente\"),1,IF(AND(H9=\"Moderadamente efectivo\",K9=\"Indirectamente\"),0,IF(AND(H9=\"Moderadamente efectivo\",K9=\"No disminuye\"),0,IF(H9=\"Poco efectivo\",0,\"Por favor diligencia el diseño, ejecución y determine si el control afecta el impacto\")))))))","v":{"$error":"#N/A"}},{"$f":"IFERROR(IF(COUNTIF($A$7:A9,A10)=0,VLOOKUP(A9,RIESGOS,35,FALSE),VLOOKUP(A9,RESULTADO,10,FALSE)),0)","v":0},{"$f":"IF(AND(H9=\"Efectivo\",I9=\"Directamente\"),2,IF(AND(H9=\"Efectivo\",I9=\"No disminuye\"),0,IF(AND(H9=\"Moderadamente efectivo\",I9=\"Directamente\"),1,IF(AND(H9=\"Moderadamente efectivo\",I9=\"No disminuye\"),0,0))))","v":{"$error":"#N/A"}},{"$f":"IF(NOT(J9=\"Poco Efectivo\"),IF(AND(N9=2,M9<=2),1,IF(AND(N9=2,M9>2),M9-N9,IF(AND(N9=1,M9<=2),1,IF(AND(N9=1,M9>2),M9-N9,M9)))),M9)","v":{"$error":"#N/A"}},{"$f":"IFERROR(IF(COUNTIF($A$7:A9,A10)=0,VLOOKUP(A9,RIESGOS,39,FALSE),VLOOKUP(A9,RESULTADO,10,FALSE)),0)","v":0},{"$f":"IF(AND(H9=\"Efectivo\",K9=\"Directamente\"),2,IF(AND(H9=\"Efectivo\",K9=\"No disminuye\"),0,IF(AND(H9=\"Efectivo\",K9=\"Indirectamente\"),1,IF(AND(H9=\"Moderadamente efectivo\",K9=\"Directamente\"),1,IF(AND(H9=\"Moderadamente efectivo\",K9=\"No disminuye\"),0,0)))))","v":{"$error":"#N/A"}},{"$f":"IF(NOT(J9=\"Poco Efectivo\"),IF(AND(Q9=2,P9<=2),1,IF(AND(Q9=2,P9>2),P9-Q9,IF(AND(Q9=1,P9<=2),1,IF(AND(Q9=1,P9>2),P9-Q9,P9)))),P9)","v":{"$error":"#N/A"}},{"$f":"IF(M9=\"\",\"\",INDEX(MATRIZ_RIESGOS,O9,R9))","v":{"$error":"#N/A"}}]
[null,"\n\n",{"$f":"IFERROR(IF(COUNTIF($A$7:A10,A11)=0,VLOOKUP(A10,RIESGOS,41,FALSE),VLOOKUP(A10,RESULTADO,10,FALSE)),0)","v":0},null,{"$f":"VLOOKUP(D10,DATOS!D$104:E$106,2,0)","v":{"$error":"#N/A"}},null,{"$f":"VLOOKUP(F10,DATOS!F$104:G$106,2,0)","v":{"$error":"#N/A"}},{"$f":"IF(E10=\"\",\"\",INDEX(DATOS!$G$111:$I$113,E10,G10))","v":{"$error":"#N/A"}},null,{"$f":"IF(AND(H10=\"Efectivo\",I10=\"Directamente\"),2,IF(AND(H10=\"Efectivo\",I10=\"No disminuye\"),0,IF(AND(H10=\"Moderadamente efectivo\",I10=\"Directamente\"),1,IF(AND(H10=\"Moderadamente efectivo\",I10=\"No disminuye\"),0,IF(H10=\"Poco efectivo\",0,\"Por favor diligencia el diseño, ejecuión y determine si el control afecta la probabilidad\")))))","v":{"$error":"#N/A"}},null,{"$f":"IF(AND(H10=\"Efectivo\",K10=\"Directamente\"),2,IF(AND(H10=\"Efectivo\",K10=\"Indirectamente\"),1,IF(AND(H10=\"Efectivo\",K10=\"No disminuye\"),0,IF(AND(H10=\"Moderadamente efectivo\",K10=\"Directamente\"),1,IF(AND(H10=\"Moderadamente efectivo\",K10=\"Indirectamente\"),0,IF(AND(H10=\"Moderadamente efectivo\",K10=\"No disminuye\"),0,IF(H10=\"Poco efectivo\",0,\"Por favor diligencia el diseño, ejecución y determine si el control afecta el impacto\")))))))","v":{"$error":"#N/A"}},{"$f":"IFERROR(IF(COUNTIF($A$7:A10,A11)=0,VLOOKUP(A10,RIESGOS,35,FALSE),VLOOKUP(A10,RESULTADO,10,FALSE)),0)","v":0},{"$f":"IF(AND(H10=\"Efectivo\",I10=\"Directamente\"),2,IF(AND(H10=\"Efectivo\",I10=\"No disminuye\"),0,IF(AND(H10=\"Moderadamente efectivo\",I10=\"Directamente\"),1,IF(AND(H10=\"Moderadamente efectivo\",I10=\"No disminuye\"),0,0))))","v":{"$error":"#N/A"}},{"$f":"IF(NOT(J10=\"Poco Efectivo\"),IF(AND(N10=2,M10<=2),1,IF(AND(N10=2,M10>2),M10-N10,IF(AND(N10=1,M10<=2),1,IF(AND(N10=1,M10>2),M10-N10,M10)))),M10)","v":{"$error":"#N/A"}},{"$f":"IFERROR(IF(COUNTIF($A$7:A10,A11)=0,VLOOKUP(A10,RIESGOS,39,FALSE),VLOOKUP(A10,RESULTADO,10,FALSE)),0)","v":0},{"$f":"IF(AND(H10=\"Efectivo\",K10=\"Directamente\"),2,IF(AND(H10=\"Efectivo\",K10=\"No disminuye\"),0,IF(AND(H10=\"Efectivo\",K10=\"Indirectamente\"),1,IF(AND(H10=\"Moderadamente efectivo\",K10=\"Directamente\"),1,IF(AND(H10=\"Moderadamente efectivo\",K10=\"No disminuye\"),0,0)))))","v":{"$error":"#N/A"}},{"$f":"IF(NOT(J10=\"Poco Efectivo\"),IF(AND(Q10=2,P10<=2),1,IF(AND(Q10=2,P10>2),P10-Q10,IF(AND(Q10=1,P10<=2),1,IF(AND(Q10=1,P10>2),P10-Q10,P10)))),P10)","v":{"$error":"#N/A"}},{"$error":"#N/A"}]
{"$rows_left_out":93}
{"sheet":"Informe","index":3,"n_rows":27,"n_cols":20,"rows_kept":27,"cut":false,"hidden":false,"merged":[[26,0,27,19],[0,0,3,1],[0,2,0,17],[1,2,3,17],[2,18,3,19]]}
[null,null,"PROCESO \nMEJORA E INNOVACIÓN",null,null,null,null,null,null,null,null,null,null,null,null,null,null,null,"F3.G3.MI","2025-04-10"]
[null,null,"FORMATO MATRIZ DE RIESGOS DE SEGURIDAD DE LA INFORMACIÓN",null,null,null,null,null,null,null,null,null,null,null,null,null,null,null,"Versión 9","Pagina 4 de 4"]
[null,null,null,null,null,null,null,null,null,null,null,null,null,null,null,null,null,null,"Clasificación de la Información\nCLASIFICADA"]
[]
[]
[]
[]
[null,null,null,null,"INHERENTE","RESIDUAL",null,null,null,"Estado de Riesgos"]
[null,null,null,"BAJO",{"$f":"COUNTIF(Resultados!C7:C86,CONCATENATE(D9,\"*\"))","v":0},{"$f":"COUNTIF(Resultados!$S$9:$S$86,CONCATENATE(D9,\"*\"))","v":0},null,null,null,"EN PROCESO",{"$f":"COUNTIF(Tratamiento!$K$11:$K$115,\"EN PROCESO\")","v":0}]
[null,null,null,"MODERADO",{"$f":"COUNTIF(Resultados!C8:C86,CONCATENATE(D10,\"*\"))","v":0},{"$f":"COUNTIF(Resultados!$S$9:$S$86,CONCATENATE(D10,\"*\"))","v":0},null,null,null,"ATRASADOS",{"$f":"COUNTIF(Tratamiento!$K$11:$K$115,\"ATRASADO\")","v":0}]
{"$rows_left_out":18}
{"sheet":"AYUDA","index":4,"n_rows":178,"n_cols":17,"rows_kept":178,"cut":false,"hidden":true,"merged":[[4,13,4,15],[8,2,8,5],[4,3,4,4],[2,7,2,8],[3,7,3,8],[1,13,1,16],[3,13,3,15],[2,13,2,15],[2,3,2,4],[3,3,3,4],[3,11,3,12],[2,11,2,12],[4,7,4,8],[4,11,4,12],[9,2,9,5],[1,1,1,4],[1,5,1,8],[1,9,1,12]]}
[]
["OPCIONES\nTRATAMIENTO \nRIESGO","Evitar el riesgo \nTomar las medidas encaminadas a prevenir su materialización. Es siempre la primera alternativa a considerar, se logra cuando al interior de los procesos se genera cambios sustanciales por mejoramiento, rediseño o eliminación, resultado de unos adecuados controles y acciones emprendidas, y se debe elaborar planes de contingencia para su manejo. Un ejemplo de esto puede ser el control de calidad, manejo de los insumos, mantenimiento preventivo de los equipos, desarrollo tecnológico, etc.\n\nCONTROL: UNO\nRESPONSABLE: Director Regional\nFRECUENCIA: Diaria\nTIPO DE CONTROL: Correctivo\nNATURALEZA DEL CONTROL: Automático\nCONTROL DOCUMENTADO: SÍ\nCALIFICACIÓN DEL CONTROLES: No existen controles.\n\nCONTROL: UNO\nRESPONSABLE: Director Regional\nFRECUENCIA: Diaria\nTIPO DE CONTROL: Correctivo\nNATURALEZA DEL CONTROL: Automático\nCONTROL DOCUMENTADO: SÍ\nCALIFICACIÓN DEL CONTROLES: Los controles son efectivos y están documentados",null,null,null,"Reducir el riesgo\n implica tomar medidas encaminadas a disminuir tanto la probabilidad (medidas de prevención), como el impacto (medidas de protección). La reducción del riesgo es probablemente el método más sencillo y económico para superar las debilidades antes de aplicar medidas más costosas y difíciles. Se consigue mediante la optimización de los procedimientos y la implementación de controles.",null,null,null,"Compartir o Transferir el riesgo\n reduce su efecto a través del traspaso de las pérdidas a otras organizaciones, como en el caso de los contratos de seguros o a través de otros medios que permiten distribuir una porción del riesgo con otra Organización, como en los contratos a riesgo compartido. Es así como por ejemplo, la información de gran importancia se puede duplicar y almacenar en un lugar distante y de ubicación segura, en vez de dejarla concentrada en un solo lugar.",null,null,null,"Asumir o Aceptar un riesgo\nluego de que el riesgo ha sido reducido o transferido puede quedar un riesgo residual que se mantiene, en este caso el dueño del proceso simplemente acepta la pérdida residual probable"]
["CALIFICACIÓN DEL \nRIESGO","EXTREMO","ALTO","MODERADO",null,"EXTREMO","ALTO","MODERADO",null,"EXTREMO","ALTO","MODERADO",null,"MODERADO",null,null,"BAJO"]
["ACCIÓN A\n REALIZAR","Planes de contingencia para su manejo bajo el ciclo PHVA.","Plan tratamiento Riesgo bajo el ciclo PHVA.","Plan tratamiento Riesgo bajo el ciclo PHVA.",null,"Planes de contingencia para su manejo bajo el ciclo PHVA.","Plan tratamiento Riesgo bajo el ciclo PHVA.","Plan tratamiento Riesgo bajo el ciclo PHVA.",null,"Se requiere hacer un Plan de Acción. Se debe elaborar planes de contingencia para su manejo. ","Plan tratamiento Riesgo bajo el ciclo PHVA.","Plan tratamiento Riesgo bajo el ciclo PHVA.",null,"No requiere hacer tratamiento de Riesgos,  pero se debe describir la justificacion del porque se asume o acepta el riesgo",null,null,"No requiere hacer tratamiento de Riesgos. "]
["APLICA \nOPORTUNIDAD\nDE MEJORA","No aplica oportunidad de mejora","No aplica oportunidad de mejora","No aplica oportunidad de mejora",null,"No aplica oportunidad de mejora","No aplica oportunidad de mejora","No aplica oportunidad de mejora",null,"No aplica oportunidad de mejora","No aplica oportunidad de mejora","No aplica oportunidad de mejora",null,"No aplica oportunidad de mejora",null,null,"Aplica Oportunidad de mejora en ISOLUCION (Mejoramiento/Notas de Mejora) es decir en este campo ingresamos el Numero Generado por ISOLUCIÖN, bajo ciclo PHVA y el tiempo lo determina el dueño del riesgo."]
[]
[null,null,"TRIMESTRE 1","TRIMESTRE 2","TRIMESTRE 3","TRIMESTRE 4"]
[null,"INICIO Y TERMINACIÓN TRATAMIENTOS RIESGOS","Enero-Marzo","Abril-Junio","Julio-Septiembre","Octubre-Diciembre"]
[null,"RESPONSABLE","REGIONAL/ÁREA/CARGO"]
[null,"CONTROL Y REVISION\nEVIDENCIAS PHVA","\\\\172.16.9.31\\ArchivosICBF\\SharePoint\\SGSI\\RIESGO-2015"]
{"$rows_left_out":169}
{"sheet":"DATOS","index":5,"n_rows":133,"n_cols":14,"rows_kept":133,"cut":false,"hidden":true,"merged":[[21,3,21,7],[24,0,28,0],[113,6,113,8],[109,3,111,3],[110,4,112,4],[102,3,102,4],[102,5,102,6]]}
[]
["PROBABILIDAD","Columna1","Columna2","SÍ/NO",null,"Tipo de Activo"]
["Muy Baja",1,"Muy Baja","SÍ",null,"INFORMACIÓN FÍSICA"]
["Baja",2,"Baja","NO",null,"INFORMACIÓN DIGITAL"]
["Media",3,"Media",null,null,"RECURSO HUMANO PLANTA"]
["Alta",4,"Alta",null,null,"RECURSO HUMANO CONTRATISTA"]
["Muy Alta",5,"Muy Alta",null,null,"SERVICIO"]
[null,null,null,"FINALIZADO",null,"HARDWARE"]
[null,null,null,"ATRASADO",null,"SOFTWARE"]
[null,null,null,"EN PROCESO",null,"SOPORTE"]
{"$rows_left_out":124}
{"sheet":"Hoja1","index":6,"n_rows":17,"n_cols":5,"rows_kept":17,"cut":false,"hidden":true,"merged":[]}
[null,"PROCESO","OBJETIVO CARGADO","OBJETIVO PORTAL 10 FEBRERO 2020","OBJETIVO PORTAL 30 AGOSTO 2024"]
[1,"Comunicación Estratégica","Asesorar, diseñar e implementar estrategias de comunicación para la movilidad y pedagogía social en la promoción de la garantía de derechos de las niñas, niños, adolescentes y las familias, así como divulgar la gestión del ICBF y posicionar su imagen.","Asesorar, diseñar e implementar estrategias de comunicación para la movilidad y pedagogía social en la promoción de la garantía de derechos de las niñas, niños, adolescentes y las familias, así como divulgar la gestión del ICBF y posicionar su imagen.","Asesorar, diseñar e implementar estrategias, acciones e iniciativas de comunicación para la movilidad y pedagogía social en la promoción de la garantía de derechos y la prevención de vulneraciones de derechos de las niñas, niños, adolescentes y el fortalecimiento de las familias; así como divulgar la gestión del ICBF y gestionar el posicionamiento de su imagen como la entidad líder en la protección de la niñez en Colombia."]
[2,"Coordinación y Articulación del SNBF y Agentes","Coordinar a los agentes e instancias del Sistema Nacional de Bienestar Familiar, para lograr la protección integral de Niños, Niñas, Adolecentes y el fortalecimiento familiar con enfoque diferencial en todo el territorio nacional.","Coordinar a los agentes e instancias del Sistema Nacional de Bienestar Familiar para lograr la protección integral de Niños, Niñas, adolescentes y el fortalecimiento familiar, con enfoque diferencial en todo el territorio nacional y gestionar alianzas para apoyar los programas y proyectos del ICBF","Coordinar y fortalecer técnicamente a los agentes e instancias del Sistema Nacional de Bienestar Familiar para lograr la protección integral de niños, niñas, adolescentes y el fortalecimiento familiar, con enfoque diferencial en todo el territorio nacional y gestionar alianzas para apoyar los programas y proyectos del ICBF."]
[3,"Direccionamiento Estratégico","Orientar a la entidad en la definición, formulación y evaluación de las políticas, planes, programas, lineamientos y proyectos para lograr el cumplimiento de la misión institucional y responsabilidades asignadas al instituto.","Orientar a la entidad en la definición, formulación y evaluación de las políticas, planes, programas, lineamientos y proyectos para lograr el cumplimiento de la misión institucional y responsabilidades asignadas al Instituto.","Coordinar la definición, formulación, seguimiento y evaluación de las políticas, planes, lineamientos, manuales, estrategias y proyectos para lograr en articulación con las dependencias de la Sede de la Dirección General y las regionales el cumplimiento de la plataforma estratégica, la operación eficiente y las responsabilidades asignadas al Instituto, para la protección integral, promoción de derechos y prevención de vulneraciones en los niños, niñas, adolescentes y las familias, desde una perspectiva diferencial de derechos."]
[4,"Gestión de la Tecnología e Información","Orientar las gestiones de la tecnología de la información y las comunicaciones TIC articuladas con las estrategias de negocio generando valor en el marco de las políticas y lineamientos establecidos por la autoridad competente.","Orientar la gestión de las Tecnologías de la Información y las Comunicaciones – TIC - articulada con la estrategia de negocio, generando valor en el marco de las políticas y lineamientos establecidos por la autoridad competente.","Orientar la gestión de las Tecnologías de la Información y las Comunicaciones – TIC - articulada con la estrategia de negocio, generando valor en el marco de las políticas y lineamientos establecidos por la autoridad competente."]
[5,"Mejora e Innovación","Incrementar la eficacia, eficiencia y efectividad de la gestión y la excelencia en la prestación de los servicios del ICBF con un enfoque de gestión por procesos y orientado al resultado de los objetivos institucionales","Liderar la implementación del Sistema de Gestión y fomentar la cultura de la calidad, a través de la generación de estrategias, metodologías y planes, con un enfoque de gestión por procesos y pensamiento basado en riesgos que conduzcan a la mejora continua, innovación, gestión del conocimiento y excelencia en la prestación del Servicio.","Liderar la implementación del Modelo de Planeación y Sistema Integrado de Gestión y fomentar la cultura de la calidad, mediante la generación de planes, estrategias y metodologías, con un enfoque de gestión por procesos y pensamiento basado en riesgos que conduzcan a la mejora continua a través de la modernización, la innovación, gestión del conocimiento y excelencia en la prestación del Servicio."]
[6,"Promoción y Prevención","Liderar el diseño y desarrollo de planes, programas, proyectos, modalidades de la promoción de derechos y la prevención de vulneraciones en el marco de un enfoque integral para la población objetivo del ICBF","Liderar de manera articulada el diseño y desarrollo de planes, programas, proyectos y modalidades para la promoción de derechos y la prevención de vulneraciones en el marco de un enfoque integral para la población objetivo del ICBF","Liderar de manera articulada el diseño y desarrollo de planes, proyectos, modalidades y estrategias, para la promoción de derechos humanos y la prevención de vulneraciones en el marco de la protección integral, con enfoque diferencial para los usuarios de los servicios del ICBF."]
[7,"Protección","Liderar el diseño y desarrollo de planes ,programas , proyectos y modalidades, asegurando actuaciones oportunas y con calidad, que restablezcan los derechos de los niños ,las niñas y los adolecentes en situación de inobservancia, amenaza o vulneración","Liderar el diseño, actualización y desarrollo de planes, programas, proyectos y modalidades, asegurando actuaciones oportunas y con calidad, que restablezcan los derechos de los niños, niñas, adolescentes y jóvenes en situación de inobservancia, amenaza, vulneración o en conflicto con la ley","Liderar el diseño, actualización y desarrollo de politicas, planes, programas, proyectos, lineamientos y demás documentos para la prestación de los servicios de protección, asegurando actuaciones oportunas y con calidad que restablezcan los derechos de los niños, niñas, adolescentes y jóvenes en situación de amenaza, vulneración o en conflicto con la ley basados en el cumplimiento de los principios del interés superior y prevalencia de sus derechos."]
[8,"Relación con el Ciudadano","Acercar el ICBF a la ciudadanía, facilitando el acceso a la información y a los servicios y promoviendo la participación ciudadana ","Acercar el ICBF a la ciudadanía, a través del acceso a la información, los servicios y el impulso a la participación ciudadana","Acercar el ICBF a la ciudadanía, a través del acceso a la información, los servicios de la entidad y el impulso a la estrategia de participación ciudadana y control social."]
[9,"Adquisición de Bienes y Servicios","Adquirir los bienes y servicios que requiere al Entidad para el cumplimiento de su misión institucional, con criterios de calidad, eficiencia, oportunidad y bajo los parámetros legales establecidos","Adquirir los Bienes y servicios que requiere la entidad para el cumplimiento de su misión institucional, con criterios de calidad, eficiencia y oportunidad bajo los parámetros de ley establecidos.","Adquirir los bienes, servicios y contratación de obras que requiere la entidad para el cumplimiento de su misión institucional, con criterios de calidad, eficiencia, oportunidad y transparencia bajo los parámetros de ley establecidos."]
{"$rows_left_out":7}