{"text_format":"1","workbook":"xlsx","n_sheets":8,"sheets":["AMENAZAS Y CONSECUENCIAS ","VALORACION GRAVEDAD (2)","1. IDENTIFICACION DE AMENAZAS","2. MATRIZ DE RIESGOS","3. ELEMENTOS EN GESTIÓN S.S.T","4. ELEMENTOS AMBIENTALES","5. CARACTERISTICAS DE ÁREAS","FORMATO DE EVALUACIÓN"],"not_rendered":{"charts":0,"images":14,"macros":1,"external_links":0,"defined_names":8,"comments":4,"pivot_tables":0},"unopened":[],"bounds":{"document_bytes":16777216,"sheet_cells":100000,"rows_first":2000,"rows_last":500,"rows_between":2000,"halvings":0,"cell_chars":16384,"cell_head_chars":4096},"cells_cut":0,"cells_raw":0,"read":"whole","date_system":"1900"}

{"sheet":"AMENAZAS Y CONSECUENCIAS ","index":0,"n_rows":26,"n_cols":3,"rows_kept":26,"cut":false,"hidden":true,"merged":[[0,0,0,1],[1,0,2,0],[1,1,2,1]]}
["PLANES DE EMERGENCIA Y CONTINGENCIA - LISTADO DE AMENAZAS "]
["AMENAZA","CONSECUENCIAS"]
[]
["SEQUIAS","Escases de agua\nAparición de incendios \nDesplazamiento de fauna \nIncremento de vectores \nDesabastecimiento de alimentos \nIncremento de contaminación \nPérdidas Económicas\nEnfermedades\nSuspensión de suministro de redes físicas (Energía, gas, agua e Internet)\n"]
["INUNDACIONES","Agua en las instalaciones\nDeterioro en la infraestructura\nEnfermedades\nLesiones\nPérdidas Humanas\nAfectación directa de los registros documentales por deterioro o pérdida\nPérdida de Comunicación\nCortos circuitos\nDaño probable en equipos de oficina y muebles\nIncremento de vectores \nIncremento de contaminación \nIncremento de volúmenes de residuos\nInterrupción de Operación o servicio\nPérdidas Económicas\nSuspensión de suministro de redes físicas (Energía, gas, agua e Internet)\n"]
["AVALANCHAS ","Agua en las instalaciones\nMaterial de arrastre en las Instalaciones\nAfectación directa de los registros documentales por deterioro o pérdida\nCortos circuitos\nPérdida de Comunicación\nPérdida estructural\nEnfermedades\nLesiones\nPérdidas Humanas\nDaño probable en equipos de oficina y muebles\nIncremento de vectores \nIncremento de contaminación \nIncremento de volúmenes de residuos\nPérdidas Económicas\nInterrupción de Operación o servicio\nSuspensión de suministro de redes físicas (Energía, gas, agua e Internet)\n"]
["DESLIZAMIENTOS ","Agua en las instalaciones\nMaterial de arrastre en las Instalaciones\nAfectación directa de los registros documentales por deterioro o pérdida\nCortos circuitos\nPérdida de Comunicación\nPérdida estructural\nEnfermedades\nLesiones\nPérdidas Humanas\nDaño probable en equipos de oficina y muebles\nIncremento de vectores \nIncremento de contaminación \nIncremento de volúmenes de residuos\nPérdidas Económicas\nInterrupción de Operación o servicio\nSuspensión de suministro de redes físicas (Energía, gas, agua e Internet)\n"]
["ACTIVIDAD  VOLCÁNICA","Material de arrastre en las Instalaciones\nAfectacion directa de los registros documentales por deterioro o pérdida\nCortos circuitos\nPerdida de Comunicación\nPérdida estructural\nEnfermedades\nLesiones\nPerdidas Humanas\nDaño probable en equipos de oficina y muebles\nIncremento de contaminación\nIncremento de volumenes de residuos\nPérdidas Economicas\nInterrupción de Operación o servicio\nSuspensión de suministro de redes físicas (Energía, gas, agua e Internet)\nCaída de cenizas\nCaida de piroclastos"]
["ACTIVIDAD SISMICA ","Afectación directa de los registros documentales por deterioro o pérdida\nPérdida de Comunicación\nPérdida estructural\nEnfermedades\nLesiones\nPérdidas Humanas\nDaño probable en equipos de oficina y muebles\nIncremento de contaminación\nIncremento de volúmenes de residuos\nPérdidas Económicas\nInterrupción de operación o servicio\nSuspensión de suministro de redes físicas (Energía, gas, agua e Internet)\n"]
["TSUNAMI ","Agua en las instalaciones\nMaterial de arrastre en las Instalaciones\nAfectación directa de los registros documentales por deterioro o pérdida\nPerdida de Comunicación\nPérdida estructural\nEnfermedades\nLesiones\nPérdidas Humanas\nDaño probable en equipos de oficina y muebles\nIncremento de contaminación\nIncremento de volúmenes de residuos\nPérdidas Económicas\nInterrupción de operación o servicio\nSuspensión de suministro de redes físicas (Energía, gas, agua e Internet)\n"]
["VENDAVAL ","Pérdida de Comunicación\nPérdida estructural\nLesiones\nPérdidas Humanas\nDaño probable en equipos de oficina y muebles\nPérdidas Económicas\nInterrupción de operación o servicio\nSuspensión de suministro de redes físicas (Energía, gas, agua e Internet)\n"]
["HURACAN","Pérdida de Comunicación\nPérdida estructural\nLesiones\nPérdidas Humanas\nDaño probable en equipos de oficina y muebles\nPérdidas Económicas\nInterrupción de operación o servicio\nSuspensión de suministro de redes físicas (Energía, gas, agua e Internet)\n"]
["ALTAS PRECIPITACIONES","Agua en las instalaciones\nDeterioro en la infraestructura\nEnfermedades\nLesiones\nAfectacion directa de los registros documentales por deterioro o pérdida\nPerdida de Comunicación\nCortos circuitos\nDaño probable en equipos de oficina y muebles\nIncremento de vectores \nIncremento de contaminación \nIncremento de volumenes de residuos\nInterrupción de Operación o servicio\nPérdidas Economicas\nSuspensión de suministro de redes físicas (Energía, gas, agua e Internet)\n"]
["TORMENTA ELECTRICA","Enfermedades\nLesiones\nPérdidas humanas \nPerdida de Comunicación\nCortos circuitos\nDaño probable en equipos de oficina y muebles\nInterrupción de Operación o servicio\nPérdidas Economicas\nSuspensión de suministro de redes físicas (Energía, gas, agua e Internet)\n"]
["BROTES DE ENFERMEDADES EPIDEMICAS","Enfermedades\nLesiones \nPérdidas humanas\nPérdidas Económicas \nInterrupción de Operación o servicio\n"]
{"$rows_left_out":12}
{"sheet":"VALORACION GRAVEDAD (2)","index":1,"n_rows":39,"n_cols":19,"rows_kept":39,"cut":false,"hidden":true,"merged":[[23,1,23,2],[31,1,31,2],[9,13,9,17],[1,1,2,2],[1,5,1,8],[3,5,4,5],[3,6,3,8],[10,7,10,8],[11,1,12,2],[2,11,7,11]]}
[null,null,null,null,null,null,null,null,null,null,null,null,null,1,2,3,4,5]
[null,"Clasificación de consecuencias para la vida y la salud",null,null,null,"Clasificación de consecuencias para la propiedad según tamaño de la Organización",null,null,null,null,null,null,null,"A","B","C","D","E"]
[null,null,null,null,null,null,null,null,null,null,null,"PROBABILIDAD","Muy Probable",1,7,13,19,25,6]
[null,"Clase","Características",null,null," Clase","Costo total del daño ( SMMLV[1])",null,null,null,null,null,"Medianamente Probable ",2,8,14,20,26,5]
[1,"1. Poco importantes","Padecimientos ligeros durante un día o menos.",null,null,null,"Organización Pequeña\n≤ 50 ","Organización Mediana\n51 - 499","Organización Grande\n≥ 500",null,null,null,"Bastante Probable",3,9,15,21,27,4]
[2,"2. Limitadas","Lesiones menores, malestar que perdura por una semana o menos.",null,null,"1.      Poco importantes","<2","<4","<8",null,null,null,"Probable",4,10,16,22,28,3]
[3,"3. Graves","Algunas heridas graves, serias complicaciones.",null,null,"2.      Limitadas","2 – 5","4 – 10","8 – 20",null,null,null,"Poco Probable",5,11,17,23,29,2]
[4,"4. Muy graves","Muerte de al menos una persona, y/o varios heridos (10) de gravedad y/o hasta 50 evacuados.",null,null,"3.      Graves","5 – 10","10 – 20","20 – 40",null,null,null,"Improbable",6,12,18,24,30,1]
[5,"5. Catastróficas","Varias muertes,  ≥ 11 heridos graves y/o más de 50 evacuados.",null,null,"4.      Muy graves","10 – 20","20 – 40","40 – 80",null,null,null,null,"Poco\n Importante","Limitada","Graves","Muy Graves","Catastróficas"]
[null,null,null,null,null,"5.      Catastróficas",">20",">40",">80",null,null,null,null,"PONDERACION DE LAS CONSECUENCIAS "]
[null,null,null,null,null,null,null,"[1] Salario Mínimo Mensual Legal Vigente"]
[null,"Clasificación de consecuencias para el ambiente"]
[]
[null,"Clase","Características"]
[null,"1. Poco importantes","No hay contaminación"]
{"$rows_left_out":25}
{"sheet":"1. IDENTIFICACION DE AMENAZAS","index":2,"n_rows":393,"n_cols":24,"rows_kept":393,"cut":false,"hidden":false,"merged":[[376,11,392,11],[376,13,392,13],[357,11,363,11],[357,13,363,13],[364,11,370,11],[364,13,370,13],[371,11,375,11],[371,13,375,13],[324,11,339,11],[324,13,339,13],[340,11,344,11],[340,13,344,13],[345,11,356,11],[345,13,356,13],[295,11,308,11],[295,13,308,13],[309,11,317,11],[309,13,317,13],[318,11,323,11],[318,13,323,13],[262,11,267,11],[262,13,267,13],[268,11,281,11],[268,13,281,13],[282,11,294,11],[282,13,294,13],[229,11,244,11],[229,13,244,13],[245,11,255,11],[245,13,255,13],[256,11,261,11],[256,13,261,13],[194,11,209,11],[194,13,209,13],[210,11,218,11],[210,13,218,13],[219,11,228,11],[219,13,228,13],[144,11,161,11],[144,13,161,13],[162,11,179,11],[162,13,179,13],[180,11,193,11],[180,13,193,13],[126,11,143,11],[126,13,143,13],[3,19,5,19],[3,20,5,20],[3,21,5,21],[31,0,31,20],[99,11,108,11],[99,13,108,13],[109,11,125,11],[109,13,125,13],[2,19,2,20],[3,22,5,22],[3,23,5,23],[4,14,5,14],[4,15,5,15],[4,16,5,16],[4,17,5,17],[0,0,2,0],[0,1,2,18],[3,0,5,0],[3,1,5,1],[3,2,4,9],[3,10,5,10],[3,13,5,13],[3,14,3,17],[3,18,5,18]]}
[null,"PROCESO \nGESTIÓN DEL TALENTO HUMANO\n\nMATRIZ VALORACIÓN DE RIESGOS DE EMERGENCIA",null,null,null,null,null,null,null,null,null,null,null,null,null,null,null,null,null,"F2.P9.GTH","2026-04-28"]
[null,null,null,null,null,null,null,null,null,null,null,null,null,null,null,null,null,null,null,"Versión 10","Página 1 de 1"]
[null,null,null,null,null,null,null,null,null,null,null,null,null,null,null,null,null,null,null,"Clasificación de la Información \nPública"]
["1. CODIGO AMENAZA","2. AMENAZA\nEste campo se genera automáticamente al presionar el botón correspondiente","3. PISO\nMarque con una X ",null,null,null,null,null,null,null,"4. ÁREA / PROCESOS / DEPENDENCIAS\nRegistrar el área, proceso o dependencia específica donde se presenta la amenaza, de acuerdo con el piso seleccionado. ",null,null,"5. CONSECUENCIAS\nEste campo se genera automáticamente al presionar el botón correspondiente","6. GRAVEDAD \nEstas casillas se generan automáticamente al presionar  las opciones de los botones correspondiente",null,null,null,"7. PROBABILIDAD DE OCURRENCIA\nEste campo se genera automáticamente al presionar el botón correspondiente","8. PRIORIDAD\nEste campo se genera automáticamente al presionar el botón correspondiente","9. PONDERACIÓN DE LAS CONSECUENCIAS\nEste campo se genera automáticamente al presionar el botón correspondiente","Índice Ponderación de las Consecuencias","Índice Probabilidad","Índice Matriz"]
[null,null,null,null,null,null,null,null,null,null,null,null,null,null,"VIDA","AMBIENTE","PROPIEDAD","VELOCIDAD DE DESARROLLO"]
[null,null,1,2,3,4,5,6,7,8]
["A-1",null,null,null,null,null,null,null,null,null,null,null,null,{"$f":"IF(B7=\"\",\"\",VLOOKUP(B7,$L$100:$N$393,3,0))","v":""},null,null,null,null,null,{"$f":"IF((ROUNDDOWN((((O7*30)+(P7*30)+(Q7*20)+(R7*20))/80),0))=0,\"\",(ROUNDDOWN((((O7*30)+(P7*30)+(Q7*20)+(R7*20))/80),0)))","v":""},{"$f":"+IF(O7<>\"\",IF(T7=5,\"E\",IF(T7=4,\"D\",IF(T7=3,\"C\",IF(T7=2,\"B\",\"A\")))),IF(P7<>\"\",IF(T7=5,\"E\",IF(T7=4,\"D\",IF(T7=3,\"C\",IF(T7=2,\"B\",\"A\")))),IF(Q7<>\"\",IF(T7=5,\"E\",IF(T7=4,\"D\",IF(T7=3,\"C\",IF(T7=2,\"B\",\"A\")))),IF(R7<>\"\",IF(T7=5,\"E\",IF(T7=4,\"D\",IF(T7=3,\"C\",IF(T7=2,\"B\",\"A\")))),IF(S7<>\"\",IF(T7=5,\"E\",IF(T7=4,\"D\",IF(T7=3,\"C\",IF(T7=2,\"B\",\"A\")))),IF(T7<>\"\",IF(T7=5,\"E\",IF(T7=4,\"D\",IF(T7=3,\"C\",IF(T7=2,\"B\",\"A\")))),\"\"))))))","v":""},{"$f":"+IF(U7=\"A\",1,IF(U7=\"B\",2,IF(U7=\"C\",3,IF(U7=\"D\",4,IF(U7=\"E\",5,\"\")))))","v":""},{"$f":"+IF(S7=6,1, IF(S7=5,2,IF(S7=4,3,IF(S7=3,4,IF(S7=2,5,IF(S7=1,6,\"\"))))))","v":""},{"$f":"IFERROR(+INDEX('VALORACION GRAVEDAD (2)'!$N$3:$R$8,W7,'1. IDENTIFICACION DE AMENAZAS'!V7),\"\")","v":""}]
["A-2",null,null,null,null,null,null,null,null,null,null,null,null,"",null,null,null,null,null,"","","","",{"$f":"IFERROR(+INDEX('VALORACION GRAVEDAD (2)'!$N$3:$R$8,W8,'1. IDENTIFICACION DE AMENAZAS'!V8),\"\")","v":""}]
["A-3",null,null,null,null,null,null,null,null,null,null,null,null,{"$f":"IF(B9=\"\",\"\",VLOOKUP(B9,$L$100:$N$393,3,0))","v":""},null,null,null,null,null,"","","","",{"$f":"IFERROR(+INDEX('VALORACION GRAVEDAD (2)'!$N$3:$R$8,W9,'1. IDENTIFICACION DE AMENAZAS'!V9),\"\")","v":""}]
["A-4",null,null,null,null,null,null,null,null,null,null,null,null,"",null,null,null,null,null,"","","","",{"$f":"IFERROR(+INDEX('VALORACION GRAVEDAD (2)'!$N$3:$R$8,W10,'1. IDENTIFICACION DE AMENAZAS'!V10),\"\")","v":""}]
["A-5",null,null,null,null,null,null,null,null,null,null,null,null,"",null,null,null,null,null,"","","","",{"$f":"IFERROR(+INDEX('VALORACION GRAVEDAD (2)'!$N$3:$R$8,W11,'1. IDENTIFICACION DE AMENAZAS'!V11),\"\")","v":""}]
["A-6",null,null,null,null,null,null,null,null,null,null,null,null,"",null,null,null,null,null,"","","","",{"$f":"IFERROR(+INDEX('VALORACION GRAVEDAD (2)'!$N$3:$R$8,W12,'1. IDENTIFICACION DE AMENAZAS'!V12),\"\")","v":""}]
["A-7",null,null,null,null,null,null,null,null,null,null,null,null,"",null,null,null,null,null,"","","","",{"$f":"IFERROR(+INDEX('VALORACION GRAVEDAD (2)'!$N$3:$R$8,W13,'1. IDENTIFICACION DE AMENAZAS'!V13),\"\")","v":""}]
["A-8",null,null,null,null,null,null,null,null,null,null,null,null,"",null,null,null,null,null,"","","","",{"$f":"IFERROR(+INDEX('VALORACION GRAVEDAD (2)'!$N$3:$R$8,W14,'1. IDENTIFICACION DE AMENAZAS'!V14),\"\")","v":""}]
["A-9",null,null,null,null,null,null,null,null,null,null,null,null,"",null,null,null,null,null,"","","","",{"$f":"IFERROR(+INDEX('VALORACION GRAVEDAD (2)'!$N$3:$R$8,W15,'1. IDENTIFICACION DE AMENAZAS'!V15),\"\")","v":""}]
{"$rows_left_out":379}
{"sheet":"2. MATRIZ DE RIESGOS","index":3,"n_rows":16,"n_cols":21,"rows_kept":16,"cut":false,"hidden":false,"merged":[[0,1,2,1],[0,2,2,6],[2,7,2,8],[15,1,18,2],[12,1,12,8],[4,1,9,1],[11,3,11,7],[10,1,10,2]]}
[null,null,"PROCESO \nGESTIÓN DEL TALENTO HUMANO\n\nMATRIZ VALORACIÓN DE RIESGOS DE EMERGENCIA",null,null,null,null,"F2.P9.GTH","2026-04-28"]
[null,null,null,null,null,null,null,"Versión 10","Página 1 de 1"]
[null,null,null,null,null,null,null,"Clasificación de la Información \nPública",null,null,null,null,null,null,null,null,null,null,null,"Versión 1 \n\n\n","Página 1 de 1"]
[null,null,null,"A","B","C","D","E"]
[null,"PROBABILIDAD","Muy Probable",{"$f":"concatenateif('1. IDENTIFICACION DE AMENAZAS'!$X$7:$X$31,'VALORACION GRAVEDAD (2)'!N3,'1. IDENTIFICACION DE AMENAZAS'!$A$7:$A$31,\", \")","v":""},{"$f":"concatenateif('1. IDENTIFICACION DE AMENAZAS'!$X$7:$X$31,'VALORACION GRAVEDAD (2)'!O3,'1. IDENTIFICACION DE AMENAZAS'!$A$7:$A$31,\", \")","v":""},{"$f":"concatenateif('1. IDENTIFICACION DE AMENAZAS'!$X$7:$X$31,'VALORACION GRAVEDAD (2)'!P3,'1. IDENTIFICACION DE AMENAZAS'!$A$7:$A$31,\", \")","v":""},{"$f":"concatenateif('1. IDENTIFICACION DE AMENAZAS'!$X$7:$X$31,'VALORACION GRAVEDAD (2)'!Q3,'1. IDENTIFICACION DE AMENAZAS'!$A$7:$A$31,\", \")","v":""},{"$f":"concatenateif('1. IDENTIFICACION DE AMENAZAS'!$X$7:$X$31,'VALORACION GRAVEDAD (2)'!R3,'1. IDENTIFICACION DE AMENAZAS'!$A$7:$A$31,\", \")","v":""},6]
[null,null,"Bastante Probable ",{"$f":"concatenateif('1. IDENTIFICACION DE AMENAZAS'!$X$7:$X$31,'VALORACION GRAVEDAD (2)'!N4,'1. IDENTIFICACION DE AMENAZAS'!$A$7:$A$31,\", \")","v":""},{"$f":"concatenateif('1. IDENTIFICACION DE AMENAZAS'!$X$7:$X$31,'VALORACION GRAVEDAD (2)'!O4,'1. IDENTIFICACION DE AMENAZAS'!$A$7:$A$31,\", \")","v":""},{"$f":"concatenateif('1. IDENTIFICACION DE AMENAZAS'!$X$7:$X$31,'VALORACION GRAVEDAD (2)'!P4,'1. IDENTIFICACION DE AMENAZAS'!$A$7:$A$31,\", \")","v":""},{"$f":"concatenateif('1. IDENTIFICACION DE AMENAZAS'!$X$7:$X$31,'VALORACION GRAVEDAD (2)'!Q4,'1. IDENTIFICACION DE AMENAZAS'!$A$7:$A$31,\", \")","v":""},{"$f":"concatenateif('1. IDENTIFICACION DE AMENAZAS'!$X$7:$X$31,'VALORACION GRAVEDAD (2)'!R4,'1. IDENTIFICACION DE AMENAZAS'!$A$7:$A$31,\", \")","v":""},5]
[null,null,"Medianamente Probable",{"$f":"concatenateif('1. IDENTIFICACION DE AMENAZAS'!$X$7:$X$31,'VALORACION GRAVEDAD (2)'!N5,'1. IDENTIFICACION DE AMENAZAS'!$A$7:$A$31,\", \")","v":""},{"$f":"concatenateif('1. IDENTIFICACION DE AMENAZAS'!$X$7:$X$31,'VALORACION GRAVEDAD (2)'!O5,'1. IDENTIFICACION DE AMENAZAS'!$A$7:$A$31,\", \")","v":""},{"$f":"concatenateif('1. IDENTIFICACION DE AMENAZAS'!$X$7:$X$31,'VALORACION GRAVEDAD (2)'!P5,'1. IDENTIFICACION DE AMENAZAS'!$A$7:$A$31,\", \")","v":""},{"$f":"concatenateif('1. IDENTIFICACION DE AMENAZAS'!$X$7:$X$31,'VALORACION GRAVEDAD (2)'!Q5,'1. IDENTIFICACION DE AMENAZAS'!$A$7:$A$31,\", \")","v":""},{"$f":"concatenateif('1. IDENTIFICACION DE AMENAZAS'!$X$7:$X$31,'VALORACION GRAVEDAD (2)'!R5,'1. IDENTIFICACION DE AMENAZAS'!$A$7:$A$31,\", \")","v":""},4]
[null,null,"Probable",{"$f":"concatenateif('1. IDENTIFICACION DE AMENAZAS'!$X$7:$X$31,'VALORACION GRAVEDAD (2)'!N6,'1. IDENTIFICACION DE AMENAZAS'!$A$7:$A$31,\", \")","v":""},{"$f":"concatenateif('1. IDENTIFICACION DE AMENAZAS'!$X$7:$X$31,'VALORACION GRAVEDAD (2)'!O6,'1. IDENTIFICACION DE AMENAZAS'!$A$7:$A$31,\", \")","v":""},{"$f":"concatenateif('1. IDENTIFICACION DE AMENAZAS'!$X$7:$X$31,'VALORACION GRAVEDAD (2)'!P6,'1. IDENTIFICACION DE AMENAZAS'!$A$7:$A$31,\", \")","v":""},{"$f":"concatenateif('1. IDENTIFICACION DE AMENAZAS'!$X$7:$X$31,'VALORACION GRAVEDAD (2)'!Q6,'1. IDENTIFICACION DE AMENAZAS'!$A$7:$A$31,\", \")","v":""},{"$f":"concatenateif('1. IDENTIFICACION DE AMENAZAS'!$X$7:$X$31,'VALORACION GRAVEDAD (2)'!R6,'1. IDENTIFICACION DE AMENAZAS'!$A$7:$A$31,\", \")","v":""},3]
[null,null,"Poco Probable",{"$f":"concatenateif('1. IDENTIFICACION DE AMENAZAS'!$X$7:$X$31,'VALORACION GRAVEDAD (2)'!N7,'1. IDENTIFICACION DE AMENAZAS'!$A$7:$A$31,\", \")","v":""},{"$f":"concatenateif('1. IDENTIFICACION DE AMENAZAS'!$X$7:$X$31,'VALORACION GRAVEDAD (2)'!O7,'1. IDENTIFICACION DE AMENAZAS'!$A$7:$A$31,\", \")","v":""},{"$f":"concatenateif('1. IDENTIFICACION DE AMENAZAS'!$X$7:$X$31,'VALORACION GRAVEDAD (2)'!P7,'1. IDENTIFICACION DE AMENAZAS'!$A$7:$A$31,\", \")","v":""},{"$f":"concatenateif('1. IDENTIFICACION DE AMENAZAS'!$X$7:$X$31,'VALORACION GRAVEDAD (2)'!Q7,'1. IDENTIFICACION DE AMENAZAS'!$A$7:$A$31,\", \")","v":""},{"$f":"concatenateif('1. IDENTIFICACION DE AMENAZAS'!$X$7:$X$31,'VALORACION GRAVEDAD (2)'!R7,'1. IDENTIFICACION DE AMENAZAS'!$A$7:$A$31,\", \")","v":""},2]
[null,null,"Improbable",{"$f":"concatenateif('1. IDENTIFICACION DE AMENAZAS'!$X$7:$X$31,'VALORACION GRAVEDAD (2)'!N8,'1. IDENTIFICACION DE AMENAZAS'!$A$7:$A$31,\", \")","v":""},{"$f":"concatenateif('1. IDENTIFICACION DE AMENAZAS'!$X$7:$X$31,'VALORACION GRAVEDAD (2)'!O8,'1. IDENTIFICACION DE AMENAZAS'!$A$7:$A$31,\", \")","v":""},{"$f":"concatenateif('1. IDENTIFICACION DE AMENAZAS'!$X$7:$X$31,'VALORACION GRAVEDAD (2)'!P8,'1. IDENTIFICACION DE AMENAZAS'!$A$7:$A$31,\", \")","v":""},{"$f":"concatenateif('1. IDENTIFICACION DE AMENAZAS'!$X$7:$X$31,'VALORACION GRAVEDAD (2)'!Q8,'1. IDENTIFICACION DE AMENAZAS'!$A$7:$A$31,\", \")","v":""},{"$f":"concatenateif('1. IDENTIFICACION DE AMENAZAS'!$X$7:$X$31,'VALORACION GRAVEDAD (2)'!R8,'1. IDENTIFICACION DE AMENAZAS'!$A$7:$A$31,\", \")","v":""},1]
[null,"Calificación Matriz Riesgos",null,"Poco Importante","Limitada","Graves","Muy Graves","Catastróficas"]
[null,"Puntaje Obtenido \nPorcentaje ",null,"PONDERACIÓN DE LAS CONSECUENCIAS "]
[null,"\"Antes de imprimir este documento… piense en el medio ambiente!\nCualquier copia impresa de este documento se considera como COPIA NO CONTROLADA.\nLOS DATOS PROPORCIONADOS SERAN TRATADOS DE ACUERDO A LA POLITICA DE TRATAMIENTO DE DATOS PERSONALES DEL ICBF Y A LA LEY 1581 DE 2012\"                "]
[]
[]
{"$rows_left_out":2}
{"sheet":"3. ELEMENTOS EN GESTIÓN S.S.T","index":4,"n_rows":33,"n_cols":5,"rows_kept":33,"cut":false,"hidden":false,"merged":[[7,0,7,1],[8,0,8,1],[9,0,9,1],[28,0,28,1],[17,0,17,1],[18,0,18,1],[3,0,3,1],[0,1,2,2],[4,0,4,1],[5,0,5,1],[6,0,6,1],[32,0,32,4],[24,0,24,1],[27,0,27,1],[31,0,31,1],[25,0,25,1],[26,0,26,1],[31,2,31,4],[2,3,2,4],[30,0,30,1],[29,0,29,1],[19,0,19,1],[10,0,10,1],[20,0,20,1],[21,0,21,1],[22,0,22,1],[23,0,23,1],[16,0,16,1],[11,0,11,1],[12,0,12,1],[13,0,13,1],[14,0,14,1],[15,0,15,1],[0,0,2,0]]}
[null,"PROCESO \nGESTIÓN DEL TALENTO HUMANO\n\nMATRIZ VALORACIÓN DE RIESGOS DE EMERGENCIA",null,"F2.P9.GTH","2026-04-28"]
[null,null,null,"Versión 10","Página 1 de 1"]
[null,null,null,"Clasificación de la Información \nPública"]
["SEGURIDAD",null,"SI (0) ","PARCIALMENTE (0.5)","NO (1)"]
["1-Cuenta con un Sistema de Gestión de Seguridad y Salud en el Trabajo implementado sobre un 95% de los estadarés mínimos del SG-SST"]
["2-La Política de Seguridad, Salud en el Trabajo se encuentra documentada y divulgada entre colaboradores y partes interesadas."]
["3-Tiene identificados y evaluados los requisitos legales aplicables para Seguridad y Salud en el trabajo."]
["4-Se aplica el procedimiento de evaluación de la implementación Sistema de Gestión de Seguridad y Salud en el Trabajo."]
["5-Cuenta con canales que permitan recolectar inquietudes, oportundiades de mejora, felicitaciones y aportes de los colaboradores en materia de seguridad y salud en el trabajo."]
["6-Cuenta con la cartilla de prevención de desastres "]
["7-Aplica la metodología para la identificación y  valoración de los peligros en la sede."]
["8- Cuenta con planos detallados de la construcción, instalaciones eléctricas, aguas lluvias, aguas residuales."]
["9 -Cuenta con un procedimiento para el reporte e investigación de accidentes e incidentes de trabajo."]
["10 -Cuenta con un plan de emergencias y contingencias para responder a situaciones tales como la alteración de las condiciones normales de operación por amenazas de origen naturales, social y antrópicas no intencionales."]
["11-Tiene conformadas y en funcionamiento las brigadas de emergencia."]
{"$rows_left_out":19}
{"sheet":"4. ELEMENTOS AMBIENTALES","index":5,"n_rows":24,"n_cols":4,"rows_kept":24,"cut":false,"hidden":false,"merged":[[0,0,2,0],[21,0,21,1],[6,0,6,1],[12,0,12,1],[11,0,11,1],[10,0,10,1],[9,0,9,1],[8,0,8,1],[7,0,7,1],[2,2,2,3],[23,0,23,3],[22,2,22,3],[20,0,20,1],[0,1,2,1],[15,0,15,1],[16,0,16,1],[17,0,17,1],[18,0,18,1],[19,0,19,1],[14,0,14,1],[13,0,13,1],[22,0,22,1],[5,0,5,1],[4,0,4,1],[3,0,3,1]]}
[null,"PROCESO \nGESTIÓN DEL TALENTO HUMANO\n\nMATRIZ VALORACIÓN DE RIESGOS DE EMERGENCIA","F2.P9.GTH","2026-04-28"]
[null,null,"Versión 10","Página 1 de 1"]
[null,null,"Clasificación de la Información \nPública"]
["AMBIENTE",null,"ENUNCIADO VERDADERO (1)","ENUNCIADO FALSO (0)"]
["1- La Política Ambiental no se encuentra escrita y divulgada entre colaboradores, proveedores y otras partes interesadas."]
["2-No cuenta con un Plan de Gestión Ambiental de la sede. "]
["3-No tiene identificados los requisitos legales aplicables "]
["3 - La sede genera emisiones."]
["4 - La sede no cuenta con sistemas de tratamiento de las emisiones. "]
["5 - La sede genera vertimientos no domésticos "]
["6 - La sede no cuenta con red de alcantarillado público"]
["7 - Los residuos sólidos esperados contienen características peligrosas."]
["8 -  La sede  no realiza simulacros ambientales al menos una vez al año en artículación con el Sistema Integrado de Gestión  "]
["10 - La sede no realiza reducción en la fuente, reciclaje o reutilización."]
["11- La sede no realiza periódicamente mediciones de residuos."]
{"$rows_left_out":10}
{"sheet":"5. CARACTERISTICAS DE ÁREAS","index":6,"n_rows":31,"n_cols":5,"rows_kept":31,"cut":false,"hidden":false,"merged":[[27,3,27,4],[28,3,28,4],[29,3,29,4],[18,0,18,1],[19,0,19,2],[20,0,20,2],[21,0,21,4],[26,0,26,4],[22,0,22,2],[23,0,23,2],[24,0,24,2],[25,0,25,2],[22,3,22,4],[23,3,23,4],[24,3,24,4],[25,3,25,4],[18,3,18,4],[19,3,19,4],[20,3,20,4],[15,3,15,4],[14,0,14,4],[4,3,4,4],[5,3,5,4],[16,3,16,4],[6,3,6,4],[8,0,8,1],[9,0,9,1],[7,3,7,4],[8,3,8,4],[9,3,9,4],[10,3,10,4],[11,3,11,4],[10,0,10,1],[11,0,11,1],[13,0,13,2],[12,3,12,4],[13,3,13,4],[2,3,2,4],[30,0,30,4],[0,0,2,0],[0,1,2,2],[29,0,29,2],[27,0,27,2],[28,0,28,2],[15,0,15,1],[4,0,4,1],[5,0,5,1],[12,0,12,1],[3,0,3,4],[6,0,6,1],[7,0,7,1],[16,0,16,1],[17,0,17,1]]}
[null,"PROCESO \nGESTIÓN DEL TALENTO HUMANO\n\nMATRIZ VALORACIÓN DE RIESGOS DE EMERGENCIA",null,"F2.P9.GTH","2026-04-28"]
[null,null,null,"Versión 10","Página 1 de 1"]
[null,null,null,"Clasificación de la Información \nPública"]
["ÁREAS INSTALACIÓN "]
["ÁREA",null,"DESCRIPCIÓN","m2"]
[null,null,null,1]
[]
[]
[]
[]
[]
[]
[]
["ÁREA TOTAL INSTALACIÓN ",null,null,{"$f":"SUM(D6:E13)","v":1}]
["ÁREA AMORTIGUAMIENTO"]
{"$rows_left_out":17}
{"sheet":"FORMATO DE EVALUACIÓN","index":7,"n_rows":40,"n_cols":7,"rows_kept":40,"cut":false,"hidden":false,"merged":[[22,0,26,1],[27,0,31,1],[37,0,37,3],[32,0,34,1],[35,0,36,1],[3,0,3,4],[4,0,4,2],[12,2,12,3],[4,3,4,4],[5,3,5,4],[6,3,6,4],[7,3,7,4],[8,3,8,4],[9,3,9,4],[10,3,10,4],[5,0,5,2],[8,0,8,2],[9,0,9,2],[6,0,6,2],[7,0,7,2],[2,3,2,4],[39,0,39,4],[38,0,38,3],[10,0,10,2],[11,0,11,4],[12,0,12,1],[13,0,16,1],[17,0,21,1],[13,4,16,4],[17,4,21,4],[35,4,36,4],[22,4,26,4],[27,4,31,4],[32,4,34,4],[0,0,2,0],[0,1,2,2]]}
[null,"PROCESO \nGESTIÓN DEL TALENTO HUMANO\n\nMATRIZ VALORACIÓN DE RIESGOS DE EMERGENCIA",null,"F2.P9.GTH","2026-04-28"]
[null,null,null,"Versión 10","Página 1 de 1"]
[null,null,null,"Clasificación de la Información \nPública"]
["1. RESULTADOS OBTENIDOS  "]
["ASPECTO",null,null,"PUNTAJE OBTENIDO"]
["CLASIFICACIÓN EN LA MATRIZ DE RIESGOS ",null,null,{"$f":"'2. MATRIZ DE RIESGOS'!C12","v":0}]
["PUNTAJE OBTENIDO EN ELEMENTOS DE GESTIÓN EN SEGURIDAD Y SALUD EN EL TRABAJO",null,null,{"$f":"+'3. ELEMENTOS EN GESTIÓN S.S.T'!C32","v":0}]
["PUNTAJE OBTENIDO EN ELEMENTOS AMBIENTALES",null,null,{"$f":"'4. ELEMENTOS AMBIENTALES'!C23","v":0}]
["RELACIÓN ÁREAS DE AMORTIGUAMIENTO/ÁREA ESTABLECIMIENTO",null,null,{"$f":"+'5. CARACTERISTICAS DE ÁREAS'!D21:E21","v":0}]
["USO DEL SUELO SITIO DE UBICACIÓN ",null,null,{"$f":"'5. CARACTERISTICAS DE ÁREAS'!D26","v":0}]
["CUMPLIMIENTO DE LA NORMA NSR  98 / NSR 10",null,null,{"$f":"+'5. CARACTERISTICAS DE ÁREAS'!D30","v":0}]
["2. TABLA REFERENCIA "]
["ASPECTO ",null,"RANGO ",null,"ALCANZADO POR LA SEDE "]
["MATRIZ DE RIESGOS ",null,"CLASIFICACIONES D Y E ",0.4,{"$f":"D6","v":0}]
[null,null,"CLASIFICACIÓN C, 4B Y 5B ",0.2]
{"$rows_left_out":25}