{"text_format":"1","workbook":"xlsx","n_sheets":3,"sheets":["INSTRUCTIVO","ACTIVOS DE INFORMACIÓN","DATOS"],"not_rendered":{"charts":0,"images":7,"macros":1,"external_links":0,"defined_names":109,"comments":0,"pivot_tables":0},"unopened":[],"bounds":{"document_bytes":16777216,"sheet_cells":100000,"rows_first":2000,"rows_last":500,"rows_between":2000,"halvings":0,"cell_chars":16384,"cell_head_chars":4096},"cells_cut":0,"cells_raw":0,"read":"whole","date_system":"1900"}

{"sheet":"INSTRUCTIVO","index":0,"n_rows":134,"n_cols":5,"rows_kept":134,"cut":false,"hidden":false,"merged":[[133,0,133,38],[114,0,119,4],[120,0,120,4],[121,0,128,4],[129,0,129,4],[130,0,132,4],[0,0,2,1],[2,3,2,4],[3,0,3,4],[0,2,2,2],[113,0,113,4],[4,0,4,4],[5,0,5,4],[6,0,91,4],[92,0,92,4],[93,0,98,4],[99,0,99,4],[100,0,108,4],[109,0,109,4],[110,0,112,4]]}
[null,null,"PROCESO GESTIÓN DE LA TECNOLOGÍA E INFORMACIÓN \n\nFORMATO PARA LEVANTAMIENTO DE ACTIVOS DE INFORMACION","F1.G10.GTI","2026-02-20"]
[null,null,null,"Versión 10","Página 1 de 2"]
[null,null,null,"Clasificación de la Información: Clasificada"]
["INSTRUCCIONES PARA EL DILIGENCIAMIENTO DEL FORMATO"]
["A continuación, se detallan los campos que se establecen en el formato para el levantamiento de activos de Información:"]
["I.\tIDENTIFICADOR"]
["•\tID: Número que identifica al activo de información.  (Solo aplica para el actual formato)\n•\tSede - Regional: Identifica el lugar físico en la cual se está realizando el levantamiento de activos. \n•\tProceso: Campo que despliega todos los procesos de acuerdo con el mapa de procesos del Instituto. \n•\tÁrea/Dependencia: campo que despliega las dependencias que hacen parte de un proceso del Instituto.\n•\tDependencia Regional: campo que despliega los grupos o dependencias de las Regionales, Para el caso de la Sede de la Dirección General solo despliega la opción “No aplica”.\n•\tServicio Tecnológico: campo que despliega los servicios de TI que presta la Subdirección de Recursos Tecnológicos:\n \n-\tAlmacenamiento\n-\tComunicaciones Unificadas\n-\tGestión de Aplicaciones\n-\tSeguridad Informática\n-\tServicios de Portales Web\n-\tRespaldos\n-\tRedes\n-\tServidores\n-\tFluido Eléctrico\n-\tUPS\n-\tBase de Datos\n-\tSistema de Información\n\n•\tActivo de Información: Campo de texto el cual que indica el nombre de los activos de información identificados por cada proceso en la Sede de la Dirección General y Regionales.\n•\tTipo de Activo: Campo que contiene la definición del tipo de activo de información, este campo arroja la información que los procesos de la Sede de la Dirección General indican cuando se realiza la identificación       \n                         de activos. Los tipos de activos de información indicados a continuación tienen relación con la clasificación de activos según la norma ISO/IEC 27001:2022 (ver información en paréntesis):  \n\n-\tINFORMACIÓN (Documental): Corresponden a este tipo datos e información almacenada o procesada electrónicamente:  Bases y archivos de datos, contratos, documentación del sistema, investigaciones, acuerdos   \n                    de confidencialidad, manuales de usuario, procedimientos operativos o de soporte, planes para la continuidad del negocio, acuerdos sobre retiro y pruebas de auditoría, entre otros. \n-\tFÍSICO (Documental): corresponde a todos los documentos físicos como: actas, acuerdos, circulares, informes, manuales, planes, carpetas, archivo de gestión, entre otros. \n-\tELECTRÓNICO (Herramientas para la operación (S1)): corresponde a la información contenida en los Sistemas de Información o en medio digital como SharePoint, OneDrive, entre otros. Adicional, lo \n                        relacionado con procedimientos operativos o de soporte, planes y demás documentación del Sistema Integrado de Gestión – SIGE.\n-\tFISICO – ELECTRONICO (Documental- S1): corresponde a la información contenida tanto en medios físicos como electrónicos.\n-\tSOFTWARE (Software): corresponde a software de aplicación, software del sistema, herramientas de desarrollo y utilidades; por ejemplo, SEVEN, KACTUS, SIM, SIGA, CUENTAME, entre otros. \n-\tRECURSO HUMANO -P (RECURSO HUMANO): grupo de personas que posean información valiosa para el ICBF. \n-\tRECURSO HUMANO -C (RECURSO HUMANO): grupo de personas que posean información valiosa para el ICBF. \n-\tSERVICIO (Intangible): categoría que corresponde a los servicios tecnológicos que presta la Subdirección de Recursos Tecnológicos, establecidos en el catálogo de servicios de la \n                        DIT, así como otros servicios identificados desde otros procesos.  \n-\tHARDWARE (Equipos): componentes físicos, como Servidores, Switch, Router, Modem, Token, Biométricos, discos duros, entre otros. \n-\tSOPORTE (RH): recurso humano con conocimiento del negocio, que brinda apoyo a otros grupos de personas y procesos en el ICBF.\n-\tINSTALACIONES: Los lugares donde se almacenan o resguardan los sistemas de información y comunicaciones: Centros de cómputo, centros de cableado, Datacenter.\n-\tINTANGIBLES  (Intangible): son aquellos activos inmateriales como la imagen corporativa y reputación.\n\n•\tDescripción del Activo: Campo que muestra la descripción del Activo de Información al seleccionar el campo “Activo de Información”, esta información es previamente proporcionada por cada proceso de la \n                        Sede de la Dirección General. \n•\tContiene Datos Personales: Campo de selección especifica SÍ/NO/NO APLICA el activo de información contiene datos personales, esta información es dada previamente en la identificación de activos de \n                        información por cada proceso de la Sede de la Dirección General.\n•\tClasificación Datos Personales: Campo que muestra la tipología de datos personales que pueden contener los activos de información: público, privado, semiprivado, sensible, reservado o clasificado. \n•\tFormato: Campo que hace referencia al tipo de formato en el que se encuentra el activo, teniendo como base la siguiente Tabla. Esta información es dada previamente en la identificación de activos de información por \n                        cada proceso de la Sede de la Dirección General.\n\n\n\n\n\n\n\n\n\n\n\n\n\nNota: Si el formato del activo de información es “Base de Datos” y contiene datos personales, se debe indicar en el formato si se transfieren o transmiten a nivel internacional. \n\n•\tEs Reservada: campo que indica si la información contenida en el activo es de carácter reservado acorde a la ley 1581 de 2012.\n\n•\tLey por la cual es reservada: Si la clasificación del activo de información es de tipo “Reservada” o “Clasificada”, en este campo se debe indicar bajo qué normatividad legal se ejerce reserva en el activo de información.\n\n•\tClasificación ICBF: en este campo se selecciona la clasificación que contiene el activo de información de acuerdo con las leyes 1712 de 2014, 1581 de 2012, el Grupo 5 de Controles organizacionales, anexo A de la norma ISO 27001:2022, la normatividad interna \n                aplicable del ICBF, o apoyados en las Tablas de Retención Documental.\n\n•\tIdioma: Campo que hace referencia al idioma en el que se encuentra el activo de información, teniendo como base la tabla de Idiomas a continuación. Esta información es dada previamente en la identificación de activos de información por cada proceso de la Sede de la Dirección General.\n\nIdiomas\n\n"]
[]
[]
[]
[]
[]
[]
[]
[]
[]
[]
[]
[]
[]
[]
[]
[]
[]
[]
[]
[]
[]
[]
[]
[]
[]
[]
[]
[]
[]
[]
[]
[]
[]
[]
[]
[]
[]
[]
[]
[]
[]
[]
[]
[]
[]
[]
[]
[]
[]
[]
[]
[]
[]
[]
[]
[]
[]
[]
[]
[]
[]
[]
[]
[]
[]
[]
[]
[]
[]
[]
[]
[]
[]
[]
[]
[]
[]
[]
[]
[]
[]
[]
[]
[]
[]
["II.\tATRIBUTO"]
["Es un grupo de información que permite determinar particularidad de los activos de Información. En el formato para levantamiento de activos de información abarca los siguientes campos:  \n\n•\tContinuidad de la operación: campo que especifica SÍ, NO, No aplica, si el activo de información es importante para asegurar la continuidad del negocio.\n\n•\tICC: campo que especifica SÍ, NO, No aplica, si el activo de información hace parte de la Infraestructura Crítica Cibernética del ICBF."]
[]
[]
[]
[]
[]
["III.\tPROPIEDAD"]
["El objetivo de este grupo de información es determinar la propiedad de los activos de información, para ello se debe tener en cuenta las reglas para la identificación de los propietarios y custodios de los activos de información de acuerdo a lo establecido en la G10.GTI Guía para el Desarrollo de Inventario y Clasificación de Activos.\n\nEste grupo abarca los siguientes campos:\n\n•\tPropietario del activo: campo de texto que hace referencia al líder del proceso en el cual se está realizando el levantamiento de activos de información.\n\n•\tCustodio del activo: campo de texto que hace referencia al cargo de la persona que tiene bajo su responsabilidad la gestión del Activo de Información que se está identificando. El custodio será definido por el propietario del activo"]
[]
[]
[]
[]
[]
[]
[]
[]
["IV.\tUBICACIÓN"]
["Hace referencia al detalle en dónde se encuentra ubicado el activo (física o electrónica). En el formato para levantamiento de activos de información se diligenciará dependiendo si el activo se encuentra disponible en medio físico o en medio electrónico."]
[]
[]
["V.\tCRITICIDAD"]
["El sistema de clasificación implementado en la entidad se basa en la confidencialidad como principio rector en la identificación del activo e incluye el tratamiento de la información en lo relativo a la confidencialidad, integridad y disponibilidad de cada activo. De igual forma, se contempla el impacto que podría causar la pérdida de alguna de estas propiedades.\n\nPor cada propiedad se deben establecer criterios específicos y lineamientos con base en su sensibilidad y su valor para el tratamiento adecuado del activo. Así mismo, en la G10.GTI Guía para el Desarrollo de Inventario y Clasificación de Activos se definen los criterios y niveles de clasificación de los activos de información los cuales permiten establecer el valor general del activo en la entidad: Alto, Medio o Bajo, con el objetivo de identificar qué activos deben ser tratados de manera prioritaria.\n\n"]
[]
[]
[]
[]
[]
["VI.\tPUBLICACIÓN"]
["Información Publicada (WEB): Se refiere a la información publicada únicamente en la página web del ICBF. \n\nEnlace URL: Este campo solamente se registra cuando se diligencie en el campo “Información Publicada (WEB)” el valor de “SÍ”, para lo cual se debe colocar el enlace en donde se puede consultar dicha información. \n\nEjemplo: \nhttps://kactus.icbf.gov.co/Kactusso"]
[]
[]
[]
[]
[]
[]
[]
["VII.\tVERIFICACIÓN"]
["Observaciones Procesos/Regionales: Campo para registrar notas relevantes relacionadas con el activo actual, lo cual facilita al usuario las gestiones realizadas y/o pendientes por realizar."]
[]
[]
["Antes de imprimir este documento… piense en el medio ambiente!  \nCualquier copia impresa de este documento se considera como COPIA NO CONTROLADA."]

{"sheet":"ACTIVOS DE INFORMACIÓN","index":1,"n_rows":987,"n_cols":28,"rows_kept":987,"cut":false,"hidden":false,"merged":[[986,0,986,27],[0,0,2,1],[4,0,4,15],[4,16,4,17],[4,18,4,19],[4,20,4,21],[4,22,4,25],[4,26,4,27],[0,2,2,24],[1,26,1,27],[0,26,0,27],[2,25,2,27]]}
[null,null,"PROCESO GESTIÓN DE LA TECNOLOGÍA E INFORMACIÓN \n\nFORMATO PARA LEVANTAMIENTO DE ACTIVOS DE INFORMACION",null,null,null,null,null,null,null,null,null,null,null,null,null,null,null,null,null,null,null,null,null,null,"F1.G10.GTI","2026-02-20"]
[null,null,null,null,null,null,null,null,null,null,null,null,null,null,null,null,null,null,null,null,null,null,null,null,null,"Versión 10","Página 2 de 2"]
[null,null,null,null,null,null,null,null,null,null,null,null,null,null,null,null,null,null,null,null,null,null,null,null,null,"Clasificación de la Información: Clasificada"]
[]
["I. IDENTIFICADOR",null,null,null,null,null,null,null,null,null,null,null,null,null,null,null,"II. ATRIBUTO",null,"III. PROPIEDAD",null,"IV. UBICACIÓN",null,"V. CRITICIDAD",null,null,null,"VI. PUBLICACIÓN"]
["ID","SEDE - REGIONAL","PROCESO","Dependencia SDG","Dependencia Regional","Servicio Tecnológico","Activo de Información","Tipo de Activo","Descripción del Activo","Contiene Datos Personales","Clasificación Datos Personales","Formato ","Es  Reservada","Ley por la cual es Reservada"," Clasificación ICBF","Idioma","Continuidad de la Operación","ICC","Propietario del  activo ","Custodio del Activo","Física","Electrónica","Disponibilidad","Integridad","Confidencialidad ","Nivel de Criticidad","Información Publicada (WEB)","Enlace URL"]
[null,null,null,null,null,null,null,null,null,null,null,null,null,null,null,null,null,null,null,null,null,null,null,null,null,{"$f":"IF((Tabla2[[#This Row],[Disponibilidad]]+Tabla2[[#This Row],[Integridad]]+Tabla2[[#This Row],[Confidencialidad ]]<=4),\"Baja\",IF(AND(Tabla2[[#This Row],[Disponibilidad]]+Tabla2[[#This Row],[Integridad]]+Tabla2[[#This Row],[Confidencialidad ]]>=5,Tabla2[[#This Row],[Disponibilidad]]+Tabla2[[#This Row],[Integridad]]+Tabla2[[#This Row],[Confidencialidad ]]<=7),\"Media\",IF(Tabla2[[#This Row],[Disponibilidad]]+Tabla2[[#This Row],[Integridad]]+Tabla2[[#This Row],[Confidencialidad ]]>=8,\"Alta\",\"error\")))","v":"Baja"}]
[{"$f":"IF(C8<>\"\",1,\"\")","v":""},null,null,null,null,null,null,null,null,null,null,null,null,null,null,null,null,null,null,null,null,null,null,null,null,{"$f":"IF((Tabla2[[#This Row],[Disponibilidad]]+Tabla2[[#This Row],[Integridad]]+Tabla2[[#This Row],[Confidencialidad ]]<=4),\"Baja\",IF(AND(Tabla2[[#This Row],[Disponibilidad]]+Tabla2[[#This Row],[Integridad]]+Tabla2[[#This Row],[Confidencialidad ]]>=5,Tabla2[[#This Row],[Disponibilidad]]+Tabla2[[#This Row],[Integridad]]+Tabla2[[#This Row],[Confidencialidad ]]<=7),\"Media\",IF(Tabla2[[#This Row],[Disponibilidad]]+Tabla2[[#This Row],[Integridad]]+Tabla2[[#This Row],[Confidencialidad ]]>=8,\"Alta\",\"error\")))","v":"Baja"}]
["",null,null,null,null,null,null,null,null,null,null,null,null,null,null,null,null,null,null,null,null,null,null,null,null,{"$f":"IF((Tabla2[[#This Row],[Disponibilidad]]+Tabla2[[#This Row],[Integridad]]+Tabla2[[#This Row],[Confidencialidad ]]<=4),\"Baja\",IF(AND(Tabla2[[#This Row],[Disponibilidad]]+Tabla2[[#This Row],[Integridad]]+Tabla2[[#This Row],[Confidencialidad ]]>=5,Tabla2[[#This Row],[Disponibilidad]]+Tabla2[[#This Row],[Integridad]]+Tabla2[[#This Row],[Confidencialidad ]]<=7),\"Media\",IF(Tabla2[[#This Row],[Disponibilidad]]+Tabla2[[#This Row],[Integridad]]+Tabla2[[#This Row],[Confidencialidad ]]>=8,\"Alta\",\"error\")))","v":"Baja"}]
["",null,null,null,null,null,null,null,null,null,null,null,null,null,null,null,null,null,null,null,null,null,null,null,null,{"$f":"IF((Tabla2[[#This Row],[Disponibilidad]]+Tabla2[[#This Row],[Integridad]]+Tabla2[[#This Row],[Confidencialidad ]]<=4),\"Baja\",IF(AND(Tabla2[[#This Row],[Disponibilidad]]+Tabla2[[#This Row],[Integridad]]+Tabla2[[#This Row],[Confidencialidad ]]>=5,Tabla2[[#This Row],[Disponibilidad]]+Tabla2[[#This Row],[Integridad]]+Tabla2[[#This Row],[Confidencialidad ]]<=7),\"Media\",IF(Tabla2[[#This Row],[Disponibilidad]]+Tabla2[[#This Row],[Integridad]]+Tabla2[[#This Row],[Confidencialidad ]]>=8,\"Alta\",\"error\")))","v":"Baja"}]
["",null,null,null,null,null,null,null,null,null,null,null,null,null,null,null,null,null,null,null,null,null,null,null,null,{"$f":"IF((Tabla2[[#This Row],[Disponibilidad]]+Tabla2[[#This Row],[Integridad]]+Tabla2[[#This Row],[Confidencialidad ]]<=4),\"Baja\",IF(AND(Tabla2[[#This Row],[Disponibilidad]]+Tabla2[[#This Row],[Integridad]]+Tabla2[[#This Row],[Confidencialidad ]]>=5,Tabla2[[#This Row],[Disponibilidad]]+Tabla2[[#This Row],[Integridad]]+Tabla2[[#This Row],[Confidencialidad ]]<=7),\"Media\",IF(Tabla2[[#This Row],[Disponibilidad]]+Tabla2[[#This Row],[Integridad]]+Tabla2[[#This Row],[Confidencialidad ]]>=8,\"Alta\",\"error\")))","v":"Baja"}]
["",null,null,null,null,null,null,null,null,null,null,null,null,null,null,null,null,null,null,null,null,null,null,null,null,{"$f":"IF((Tabla2[[#This Row],[Disponibilidad]]+Tabla2[[#This Row],[Integridad]]+Tabla2[[#This Row],[Confidencialidad ]]<=4),\"Baja\",IF(AND(Tabla2[[#This Row],[Disponibilidad]]+Tabla2[[#This Row],[Integridad]]+Tabla2[[#This Row],[Confidencialidad ]]>=5,Tabla2[[#This Row],[Disponibilidad]]+Tabla2[[#This Row],[Integridad]]+Tabla2[[#This Row],[Confidencialidad ]]<=7),\"Media\",IF(Tabla2[[#This Row],[Disponibilidad]]+Tabla2[[#This Row],[Integridad]]+Tabla2[[#This Row],[Confidencialidad ]]>=8,\"Alta\",\"error\")))","v":"Baja"}]
["",null,null,null,null,null,null,null,null,null,null,null,null,null,null,null,null,null,null,null,null,null,null,null,null,{"$f":"IF((Tabla2[[#This Row],[Disponibilidad]]+Tabla2[[#This Row],[Integridad]]+Tabla2[[#This Row],[Confidencialidad ]]<=4),\"Baja\",IF(AND(Tabla2[[#This Row],[Disponibilidad]]+Tabla2[[#This Row],[Integridad]]+Tabla2[[#This Row],[Confidencialidad ]]>=5,Tabla2[[#This Row],[Disponibilidad]]+Tabla2[[#This Row],[Integridad]]+Tabla2[[#This Row],[Confidencialidad ]]<=7),\"Media\",IF(Tabla2[[#This Row],[Disponibilidad]]+Tabla2[[#This Row],[Integridad]]+Tabla2[[#This Row],[Confidencialidad ]]>=8,\"Alta\",\"error\")))","v":"Baja"}]
["",null,null,null,null,null,null,null,null,null,null,null,null,null,null,null,null,null,null,null,null,null,null,null,null,{"$f":"IF((Tabla2[[#This Row],[Disponibilidad]]+Tabla2[[#This Row],[Integridad]]+Tabla2[[#This Row],[Confidencialidad ]]<=4),\"Baja\",IF(AND(Tabla2[[#This Row],[Disponibilidad]]+Tabla2[[#This Row],[Integridad]]+Tabla2[[#This Row],[Confidencialidad ]]>=5,Tabla2[[#This Row],[Disponibilidad]]+Tabla2[[#This Row],[Integridad]]+Tabla2[[#This Row],[Confidencialidad ]]<=7),\"Media\",IF(Tabla2[[#This Row],[Disponibilidad]]+Tabla2[[#This Row],[Integridad]]+Tabla2[[#This Row],[Confidencialidad ]]>=8,\"Alta\",\"error\")))","v":"Baja"}]
["",null,null,null,null,null,null,null,null,null,null,null,null,null,null,null,null,null,null,null,null,null,null,null,null,{"$f":"IF((Tabla2[[#This Row],[Disponibilidad]]+Tabla2[[#This Row],[Integridad]]+Tabla2[[#This Row],[Confidencialidad ]]<=4),\"Baja\",IF(AND(Tabla2[[#This Row],[Disponibilidad]]+Tabla2[[#This Row],[Integridad]]+Tabla2[[#This Row],[Confidencialidad ]]>=5,Tabla2[[#This Row],[Disponibilidad]]+Tabla2[[#This Row],[Integridad]]+Tabla2[[#This Row],[Confidencialidad ]]<=7),\"Media\",IF(Tabla2[[#This Row],[Disponibilidad]]+Tabla2[[#This Row],[Integridad]]+Tabla2[[#This Row],[Confidencialidad ]]>=8,\"Alta\",\"error\")))","v":"Baja"}]
["",null,null,null,null,null,null,null,null,null,null,null,null,null,null,null,null,null,null,null,null,null,null,null,null,{"$f":"IF((Tabla2[[#This Row],[Disponibilidad]]+Tabla2[[#This Row],[Integridad]]+Tabla2[[#This Row],[Confidencialidad ]]<=4),\"Baja\",IF(AND(Tabla2[[#This Row],[Disponibilidad]]+Tabla2[[#This Row],[Integridad]]+Tabla2[[#This Row],[Confidencialidad ]]>=5,Tabla2[[#This Row],[Disponibilidad]]+Tabla2[[#This Row],[Integridad]]+Tabla2[[#This Row],[Confidencialidad ]]<=7),\"Media\",IF(Tabla2[[#This Row],[Disponibilidad]]+Tabla2[[#This Row],[Integridad]]+Tabla2[[#This Row],[Confidencialidad ]]>=8,\"Alta\",\"error\")))","v":"Baja"}]
["",null,null,null,null,null,null,null,null,null,null,null,null,null,null,null,null,null,null,null,null,null,null,null,null,{"$f":"IF((Tabla2[[#This Row],[Disponibilidad]]+Tabla2[[#This Row],[Integridad]]+Tabla2[[#This Row],[Confidencialidad ]]<=4),\"Baja\",IF(AND(Tabla2[[#This Row],[Disponibilidad]]+Tabla2[[#This Row],[Integridad]]+Tabla2[[#This Row],[Confidencialidad ]]>=5,Tabla2[[#This Row],[Disponibilidad]]+Tabla2[[#This Row],[Integridad]]+Tabla2[[#This Row],[Confidencialidad ]]<=7),\"Media\",IF(Tabla2[[#This Row],[Disponibilidad]]+Tabla2[[#This Row],[Integridad]]+Tabla2[[#This Row],[Confidencialidad ]]>=8,\"Alta\",\"error\")))","v":"Baja"}]
["",null,null,null,null,null,null,null,null,null,null,null,null,null,null,null,null,null,null,null,null,null,null,null,null,{"$f":"IF((Tabla2[[#This Row],[Disponibilidad]]+Tabla2[[#This Row],[Integridad]]+Tabla2[[#This Row],[Confidencialidad ]]<=4),\"Baja\",IF(AND(Tabla2[[#This Row],[Disponibilidad]]+Tabla2[[#This Row],[Integridad]]+Tabla2[[#This Row],[Confidencialidad ]]>=5,Tabla2[[#This Row],[Disponibilidad]]+Tabla2[[#This Row],[Integridad]]+Tabla2[[#This Row],[Confidencialidad ]]<=7),\"Media\",IF(Tabla2[[#This Row],[Disponibilidad]]+Tabla2[[#This Row],[Integridad]]+Tabla2[[#This Row],[Confidencialidad ]]>=8,\"Alta\",\"error\")))","v":"Baja"}]
["",null,null,null,null,null,null,null,null,null,null,null,null,null,null,null,null,null,null,null,null,null,null,null,null,{"$f":"IF((Tabla2[[#This Row],[Disponibilidad]]+Tabla2[[#This Row],[Integridad]]+Tabla2[[#This Row],[Confidencialidad ]]<=4),\"Baja\",IF(AND(Tabla2[[#This Row],[Disponibilidad]]+Tabla2[[#This Row],[Integridad]]+Tabla2[[#This Row],[Confidencialidad ]]>=5,Tabla2[[#This Row],[Disponibilidad]]+Tabla2[[#This Row],[Integridad]]+Tabla2[[#This Row],[Confidencialidad ]]<=7),\"Media\",IF(Tabla2[[#This Row],[Disponibilidad]]+Tabla2[[#This Row],[Integridad]]+Tabla2[[#This Row],[Confidencialidad ]]>=8,\"Alta\",\"error\")))","v":"Baja"}]
["",null,null,null,null,null,null,null,null,null,null,null,null,null,null,null,null,null,null,null,null,null,null,null,null,{"$f":"IF((Tabla2[[#This Row],[Disponibilidad]]+Tabla2[[#This Row],[Integridad]]+Tabla2[[#This Row],[Confidencialidad ]]<=4),\"Baja\",IF(AND(Tabla2[[#This Row],[Disponibilidad]]+Tabla2[[#This Row],[Integridad]]+Tabla2[[#This Row],[Confidencialidad ]]>=5,Tabla2[[#This Row],[Disponibilidad]]+Tabla2[[#This Row],[Integridad]]+Tabla2[[#This Row],[Confidencialidad ]]<=7),\"Media\",IF(Tabla2[[#This Row],[Disponibilidad]]+Tabla2[[#This Row],[Integridad]]+Tabla2[[#This Row],[Confidencialidad ]]>=8,\"Alta\",\"error\")))","v":"Baja"}]
["",null,null,null,null,null,null,null,null,null,null,null,null,null,null,null,null,null,null,null,null,null,null,null,null,{"$f":"IF((Tabla2[[#This Row],[Disponibilidad]]+Tabla2[[#This Row],[Integridad]]+Tabla2[[#This Row],[Confidencialidad ]]<=4),\"Baja\",IF(AND(Tabla2[[#This Row],[Disponibilidad]]+Tabla2[[#This Row],[Integridad]]+Tabla2[[#This Row],[Confidencialidad ]]>=5,Tabla2[[#This Row],[Disponibilidad]]+Tabla2[[#This Row],[Integridad]]+Tabla2[[#This Row],[Confidencialidad ]]<=7),\"Media\",IF(Tabla2[[#This Row],[Disponibilidad]]+Tabla2[[#This Row],[Integridad]]+Tabla2[[#This Row],[Confidencialidad ]]>=8,\"Alta\",\"error\")))","v":"Baja"}]
["",null,null,null,null,null,null,null,null,null,null,null,null,null,null,null,null,null,null,null,null,null,null,null,null,{"$f":"IF((Tabla2[[#This Row],[Disponibilidad]]+Tabla2[[#This Row],[Integridad]]+Tabla2[[#This Row],[Confidencialidad ]]<=4),\"Baja\",IF(AND(Tabla2[[#This Row],[Disponibilidad]]+Tabla2[[#This Row],[Integridad]]+Tabla2[[#This Row],[Confidencialidad ]]>=5,Tabla2[[#This Row],[Disponibilidad]]+Tabla2[[#This Row],[Integridad]]+Tabla2[[#This Row],[Confidencialidad ]]<=7),\"Media\",IF(Tabla2[[#This Row],[Disponibilidad]]+Tabla2[[#This Row],[Integridad]]+Tabla2[[#This Row],[Confidencialidad ]]>=8,\"Alta\",\"error\")))","v":"Baja"}]
["",null,null,null,null,null,null,null,null,null,null,null,null,null,null,null,null,null,null,null,null,null,null,null,null,{"$f":"IF((Tabla2[[#This Row],[Disponibilidad]]+Tabla2[[#This Row],[Integridad]]+Tabla2[[#This Row],[Confidencialidad ]]<=4),\"Baja\",IF(AND(Tabla2[[#This Row],[Disponibilidad]]+Tabla2[[#This Row],[Integridad]]+Tabla2[[#This Row],[Confidencialidad ]]>=5,Tabla2[[#This Row],[Disponibilidad]]+Tabla2[[#This Row],[Integridad]]+Tabla2[[#This Row],[Confidencialidad ]]<=7),\"Media\",IF(Tabla2[[#This Row],[Disponibilidad]]+Tabla2[[#This Row],[Integridad]]+Tabla2[[#This Row],[Confidencialidad ]]>=8,\"Alta\",\"error\")))","v":"Baja"}]
["",null,null,null,null,null,null,null,null,null,null,null,null,null,null,null,null,null,null,null,null,null,null,null,null,{"$f":"IF((Tabla2[[#This Row],[Disponibilidad]]+Tabla2[[#This Row],[Integridad]]+Tabla2[[#This Row],[Confidencialidad ]]<=4),\"Baja\",IF(AND(Tabla2[[#This Row],[Disponibilidad]]+Tabla2[[#This Row],[Integridad]]+Tabla2[[#This Row],[Confidencialidad ]]>=5,Tabla2[[#This Row],[Disponibilidad]]+Tabla2[[#This Row],[Integridad]]+Tabla2[[#This Row],[Confidencialidad ]]<=7),\"Media\",IF(Tabla2[[#This Row],[Disponibilidad]]+Tabla2[[#This Row],[Integridad]]+Tabla2[[#This Row],[Confidencialidad ]]>=8,\"Alta\",\"error\")))","v":"Baja"}]
["",null,null,null,null,null,null,null,null,null,null,null,null,null,null,null,null,null,null,null,null,null,null,null,null,{"$f":"IF((Tabla2[[#This Row],[Disponibilidad]]+Tabla2[[#This Row],[Integridad]]+Tabla2[[#This Row],[Confidencialidad ]]<=4),\"Baja\",IF(AND(Tabla2[[#This Row],[Disponibilidad]]+Tabla2[[#This Row],[Integridad]]+Tabla2[[#This Row],[Confidencialidad ]]>=5,Tabla2[[#This Row],[Disponibilidad]]+Tabla2[[#This Row],[Integridad]]+Tabla2[[#This Row],[Confidencialidad ]]<=7),\"Media\",IF(Tabla2[[#This Row],[Disponibilidad]]+Tabla2[[#This Row],[Integridad]]+Tabla2[[#This Row],[Confidencialidad ]]>=8,\"Alta\",\"error\")))","v":"Baja"}]
["",null,null,null,null,null,null,null,null,null,null,null,null,null,null,null,null,null,null,null,null,null,null,null,null,{"$f":"IF((Tabla2[[#This Row],[Disponibilidad]]+Tabla2[[#This Row],[Integridad]]+Tabla2[[#This Row],[Confidencialidad ]]<=4),\"Baja\",IF(AND(Tabla2[[#This Row],[Disponibilidad]]+Tabla2[[#This Row],[Integridad]]+Tabla2[[#This Row],[Confidencialidad ]]>=5,Tabla2[[#This Row],[Disponibilidad]]+Tabla2[[#This Row],[Integridad]]+Tabla2[[#This Row],[Confidencialidad ]]<=7),\"Media\",IF(Tabla2[[#This Row],[Disponibilidad]]+Tabla2[[#This Row],[Integridad]]+Tabla2[[#This Row],[Confidencialidad ]]>=8,\"Alta\",\"error\")))","v":"Baja"}]
["",null,null,null,null,null,null,null,null,null,null,null,null,null,null,null,null,null,null,null,null,null,null,null,null,{"$f":"IF((Tabla2[[#This Row],[Disponibilidad]]+Tabla2[[#This Row],[Integridad]]+Tabla2[[#This Row],[Confidencialidad ]]<=4),\"Baja\",IF(AND(Tabla2[[#This Row],[Disponibilidad]]+Tabla2[[#This Row],[Integridad]]+Tabla2[[#This Row],[Confidencialidad ]]>=5,Tabla2[[#This Row],[Disponibilidad]]+Tabla2[[#This Row],[Integridad]]+Tabla2[[#This Row],[Confidencialidad ]]<=7),\"Media\",IF(Tabla2[[#This Row],[Disponibilidad]]+Tabla2[[#This Row],[Integridad]]+Tabla2[[#This Row],[Confidencialidad ]]>=8,\"Alta\",\"error\")))","v":"Baja"}]
["",null,null,null,null,null,null,null,null,null,null,null,null,null,null,null,null,null,null,null,null,null,null,null,null,{"$f":"IF((Tabla2[[#This Row],[Disponibilidad]]+Tabla2[[#This Row],[Integridad]]+Tabla2[[#This Row],[Confidencialidad ]]<=4),\"Baja\",IF(AND(Tabla2[[#This Row],[Disponibilidad]]+Tabla2[[#This Row],[Integridad]]+Tabla2[[#This Row],[Confidencialidad ]]>=5,Tabla2[[#This Row],[Disponibilidad]]+Tabla2[[#This Row],[Integridad]]+Tabla2[[#This Row],[Confidencialidad ]]<=7),\"Media\",IF(Tabla2[[#This Row],[Disponibilidad]]+Tabla2[[#This Row],[Integridad]]+Tabla2[[#This Row],[Confidencialidad ]]>=8,\"Alta\",\"error\")))","v":"Baja"}]
["",null,null,null,null,null,null,null,null,null,null,null,null,null,null,null,null,null,null,null,null,null,null,null,null,{"$f":"IF((Tabla2[[#This Row],[Disponibilidad]]+Tabla2[[#This Row],[Integridad]]+Tabla2[[#This Row],[Confidencialidad ]]<=4),\"Baja\",IF(AND(Tabla2[[#This Row],[Disponibilidad]]+Tabla2[[#This Row],[Integridad]]+Tabla2[[#This Row],[Confidencialidad ]]>=5,Tabla2[[#This Row],[Disponibilidad]]+Tabla2[[#This Row],[Integridad]]+Tabla2[[#This Row],[Confidencialidad ]]<=7),\"Media\",IF(Tabla2[[#This Row],[Disponibilidad]]+Tabla2[[#This Row],[Integridad]]+Tabla2[[#This Row],[Confidencialidad ]]>=8,\"Alta\",\"error\")))","v":"Baja"}]
["",null,null,null,null,null,null,null,null,null,null,null,null,null,null,null,null,null,null,null,null,null,null,null,null,{"$f":"IF((Tabla2[[#This Row],[Disponibilidad]]+Tabla2[[#This Row],[Integridad]]+Tabla2[[#This Row],[Confidencialidad ]]<=4),\"Baja\",IF(AND(Tabla2[[#This Row],[Disponibilidad]]+Tabla2[[#This Row],[Integridad]]+Tabla2[[#This Row],[Confidencialidad ]]>=5,Tabla2[[#This Row],[Disponibilidad]]+Tabla2[[#This Row],[Integridad]]+Tabla2[[#This Row],[Confidencialidad ]]<=7),\"Media\",IF(Tabla2[[#This Row],[Disponibilidad]]+Tabla2[[#This Row],[Integridad]]+Tabla2[[#This Row],[Confidencialidad ]]>=8,\"Alta\",\"error\")))","v":"Baja"}]
["",null,null,null,null,null,null,null,null,null,null,null,null,null,null,null,null,null,null,null,null,null,null,null,null,{"$f":"IF((Tabla2[[#This Row],[Disponibilidad]]+Tabla2[[#This Row],[Integridad]]+Tabla2[[#This Row],[Confidencialidad ]]<=4),\"Baja\",IF(AND(Tabla2[[#This Row],[Disponibilidad]]+Tabla2[[#This Row],[Integridad]]+Tabla2[[#This Row],[Confidencialidad ]]>=5,Tabla2[[#This Row],[Disponibilidad]]+Tabla2[[#This Row],[Integridad]]+Tabla2[[#This Row],[Confidencialidad ]]<=7),\"Media\",IF(Tabla2[[#This Row],[Disponibilidad]]+Tabla2[[#This Row],[Integridad]]+Tabla2[[#This Row],[Confidencialidad ]]>=8,\"Alta\",\"error\")))","v":"Baja"}]
["",null,null,null,null,null,null,null,null,null,null,null,null,null,null,null,null,null,null,null,null,null,null,null,null,{"$f":"IF((Tabla2[[#This Row],[Disponibilidad]]+Tabla2[[#This Row],[Integridad]]+Tabla2[[#This Row],[Confidencialidad ]]<=4),\"Baja\",IF(AND(Tabla2[[#This Row],[Disponibilidad]]+Tabla2[[#This Row],[Integridad]]+Tabla2[[#This Row],[Confidencialidad ]]>=5,Tabla2[[#This Row],[Disponibilidad]]+Tabla2[[#This Row],[Integridad]]+Tabla2[[#This Row],[Confidencialidad ]]<=7),\"Media\",IF(Tabla2[[#This Row],[Disponibilidad]]+Tabla2[[#This Row],[Integridad]]+Tabla2[[#This Row],[Confidencialidad ]]>=8,\"Alta\",\"error\")))","v":"Baja"}]
["",null,null,null,null,null,null,null,null,null,null,null,null,null,null,null,null,null,null,null,null,null,null,null,null,{"$f":"IF((Tabla2[[#This Row],[Disponibilidad]]+Tabla2[[#This Row],[Integridad]]+Tabla2[[#This Row],[Confidencialidad ]]<=4),\"Baja\",IF(AND(Tabla2[[#This Row],[Disponibilidad]]+Tabla2[[#This Row],[Integridad]]+Tabla2[[#This Row],[Confidencialidad ]]>=5,Tabla2[[#This Row],[Disponibilidad]]+Tabla2[[#This Row],[Integridad]]+Tabla2[[#This Row],[Confidencialidad ]]<=7),\"Media\",IF(Tabla2[[#This Row],[Disponibilidad]]+Tabla2[[#This Row],[Integridad]]+Tabla2[[#This Row],[Confidencialidad ]]>=8,\"Alta\",\"error\")))","v":"Baja"}]
["",null,null,null,null,null,null,null,null,null,null,null,null,null,null,null,null,null,null,null,null,null,null,null,null,{"$f":"IF((Tabla2[[#This Row],[Disponibilidad]]+Tabla2[[#This Row],[Integridad]]+Tabla2[[#This Row],[Confidencialidad ]]<=4),\"Baja\",IF(AND(Tabla2[[#This Row],[Disponibilidad]]+Tabla2[[#This Row],[Integridad]]+Tabla2[[#This Row],[Confidencialidad ]]>=5,Tabla2[[#This Row],[Disponibilidad]]+Tabla2[[#This Row],[Integridad]]+Tabla2[[#This Row],[Confidencialidad ]]<=7),\"Media\",IF(Tabla2[[#This Row],[Disponibilidad]]+Tabla2[[#This Row],[Integridad]]+Tabla2[[#This Row],[Confidencialidad ]]>=8,\"Alta\",\"error\")))","v":"Baja"}]
["",null,null,null,null,null,null,null,null,null,null,null,null,null,null,null,null,null,null,null,null,null,null,null,null,{"$f":"IF((Tabla2[[#This Row],[Disponibilidad]]+Tabla2[[#This Row],[Integridad]]+Tabla2[[#This Row],[Confidencialidad ]]<=4),\"Baja\",IF(AND(Tabla2[[#This Row],[Disponibilidad]]+Tabla2[[#This Row],[Integridad]]+Tabla2[[#This Row],[Confidencialidad ]]>=5,Tabla2[[#This Row],[Disponibilidad]]+Tabla2[[#This Row],[Integridad]]+Tabla2[[#This Row],[Confidencialidad ]]<=7),\"Media\",IF(Tabla2[[#This Row],[Disponibilidad]]+Tabla2[[#This Row],[Integridad]]+Tabla2[[#This Row],[Confidencialidad ]]>=8,\"Alta\",\"error\")))","v":"Baja"}]
["",null,null,null,null,null,null,null,null,null,null,null,null,null,null,null,null,null,null,null,null,null,null,null,null,{"$f":"IF((Tabla2[[#This Row],[Disponibilidad]]+Tabla2[[#This Row],[Integridad]]+Tabla2[[#This Row],[Confidencialidad ]]<=4),\"Baja\",IF(AND(Tabla2[[#This Row],[Disponibilidad]]+Tabla2[[#This Row],[Integridad]]+Tabla2[[#This Row],[Confidencialidad ]]>=5,Tabla2[[#This Row],[Disponibilidad]]+Tabla2[[#This Row],[Integridad]]+Tabla2[[#This Row],[Confidencialidad ]]<=7),\"Media\",IF(Tabla2[[#This Row],[Disponibilidad]]+Tabla2[[#This Row],[Integridad]]+Tabla2[[#This Row],[Confidencialidad ]]>=8,\"Alta\",\"error\")))","v":"Baja"}]
["",null,null,null,null,null,null,null,null,null,null,null,null,null,null,null,null,null,null,null,null,null,null,null,null,{"$f":"IF((Tabla2[[#This Row],[Disponibilidad]]+Tabla2[[#This Row],[Integridad]]+Tabla2[[#This Row],[Confidencialidad ]]<=4),\"Baja\",IF(AND(Tabla2[[#This Row],[Disponibilidad]]+Tabla2[[#This Row],[Integridad]]+Tabla2[[#This Row],[Confidencialidad ]]>=5,Tabla2[[#This Row],[Disponibilidad]]+Tabla2[[#This Row],[Integridad]]+Tabla2[[#This Row],[Confidencialidad ]]<=7),\"Media\",IF(Tabla2[[#This Row],[Disponibilidad]]+Tabla2[[#This Row],[Integridad]]+Tabla2[[#This Row],[Confidencialidad ]]>=8,\"Alta\",\"error\")))","v":"Baja"}]
["",null,null,null,null,null,null,null,null,null,null,null,null,null,null,null,null,null,null,null,null,null,null,null,null,{"$f":"IF((Tabla2[[#This Row],[Disponibilidad]]+Tabla2[[#This Row],[Integridad]]+Tabla2[[#This Row],[Confidencialidad ]]<=4),\"Baja\",IF(AND(Tabla2[[#This Row],[Disponibilidad]]+Tabla2[[#This Row],[Integridad]]+Tabla2[[#This Row],[Confidencialidad ]]>=5,Tabla2[[#This Row],[Disponibilidad]]+Tabla2[[#This Row],[Integridad]]+Tabla2[[#This Row],[Confidencialidad ]]<=7),\"Media\",IF(Tabla2[[#This Row],[Disponibilidad]]+Tabla2[[#This Row],[Integridad]]+Tabla2[[#This Row],[Confidencialidad ]]>=8,\"Alta\",\"error\")))","v":"Baja"}]
["",null,null,null,null,null,null,null,null,null,null,null,null,null,null,null,null,null,null,null,null,null,null,null,null,{"$f":"IF((Tabla2[[#This Row],[Disponibilidad]]+Tabla2[[#This Row],[Integridad]]+Tabla2[[#This Row],[Confidencialidad ]]<=4),\"Baja\",IF(AND(Tabla2[[#This Row],[Disponibilidad]]+Tabla2[[#This Row],[Integridad]]+Tabla2[[#This Row],[Confidencialidad ]]>=5,Tabla2[[#This Row],[Disponibilidad]]+Tabla2[[#This Row],[Integridad]]+Tabla2[[#This Row],[Confidencialidad ]]<=7),\"Media\",IF(Tabla2[[#This Row],[Disponibilidad]]+Tabla2[[#This Row],[Integridad]]+Tabla2[[#This Row],[Confidencialidad ]]>=8,\"Alta\",\"error\")))","v":"Baja"}]
["",null,null,null,null,null,null,null,null,null,null,null,null,null,null,null,null,null,null,null,null,null,null,null,null,{"$f":"IF((Tabla2[[#This Row],[Disponibilidad]]+Tabla2[[#This Row],[Integridad]]+Tabla2[[#This Row],[Confidencialidad ]]<=4),\"Baja\",IF(AND(Tabla2[[#This Row],[Disponibilidad]]+Tabla2[[#This Row],[Integridad]]+Tabla2[[#This Row],[Confidencialidad ]]>=5,Tabla2[[#This Row],[Disponibilidad]]+Tabla2[[#This Row],[Integridad]]+Tabla2[[#This Row],[Confidencialidad ]]<=7),\"Media\",IF(Tabla2[[#This Row],[Disponibilidad]]+Tabla2[[#This Row],[Integridad]]+Tabla2[[#This Row],[Confidencialidad ]]>=8,\"Alta\",\"error\")))","v":"Baja"}]
["",null,null,null,null,null,null,null,null,null,null,null,null,null,null,null,null,null,null,null,null,null,null,null,null,{"$f":"IF((Tabla2[[#This Row],[Disponibilidad]]+Tabla2[[#This Row],[Integridad]]+Tabla2[[#This Row],[Confidencialidad ]]<=4),\"Baja\",IF(AND(Tabla2[[#This Row],[Disponibilidad]]+Tabla2[[#This Row],[Integridad]]+Tabla2[[#This Row],[Confidencialidad ]]>=5,Tabla2[[#This Row],[Disponibilidad]]+Tabla2[[#This Row],[Integridad]]+Tabla2[[#This Row],[Confidencialidad ]]<=7),\"Media\",IF(Tabla2[[#This Row],[Disponibilidad]]+Tabla2[[#This Row],[Integridad]]+Tabla2[[#This Row],[Confidencialidad ]]>=8,\"Alta\",\"error\")))","v":"Baja"}]
["",null,null,null,null,null,null,null,null,null,null,null,null,null,null,null,null,null,null,null,null,null,null,null,null,{"$f":"IF((Tabla2[[#This Row],[Disponibilidad]]+Tabla2[[#This Row],[Integridad]]+Tabla2[[#This Row],[Confidencialidad ]]<=4),\"Baja\",IF(AND(Tabla2[[#This Row],[Disponibilidad]]+Tabla2[[#This Row],[Integridad]]+Tabla2[[#This Row],[Confidencialidad ]]>=5,Tabla2[[#This Row],[Disponibilidad]]+Tabla2[[#This Row],[Integridad]]+Tabla2[[#This Row],[Confidencialidad ]]<=7),\"Media\",IF(Tabla2[[#This Row],[Disponibilidad]]+Tabla2[[#This Row],[Integridad]]+Tabla2[[#This Row],[Confidencialidad ]]>=8,\"Alta\",\"error\")))","v":"Baja"}]
["",null,null,null,null,null,null,null,null,null,null,null,null,null,null,null,null,null,null,null,null,null,null,null,null,{"$f":"IF((Tabla2[[#This Row],[Disponibilidad]]+Tabla2[[#This Row],[Integridad]]+Tabla2[[#This Row],[Confidencialidad ]]<=4),\"Baja\",IF(AND(Tabla2[[#This Row],[Disponibilidad]]+Tabla2[[#This Row],[Integridad]]+Tabla2[[#This Row],[Confidencialidad ]]>=5,Tabla2[[#This Row],[Disponibilidad]]+Tabla2[[#This Row],[Integridad]]+Tabla2[[#This Row],[Confidencialidad ]]<=7),\"Media\",IF(Tabla2[[#This Row],[Disponibilidad]]+Tabla2[[#This Row],[Integridad]]+Tabla2[[#This Row],[Confidencialidad ]]>=8,\"Alta\",\"error\")))","v":"Baja"}]
["",null,null,null,null,null,null,null,null,null,null,null,null,null,null,null,null,null,null,null,null,null,null,null,null,{"$f":"IF((Tabla2[[#This Row],[Disponibilidad]]+Tabla2[[#This Row],[Integridad]]+Tabla2[[#This Row],[Confidencialidad ]]<=4),\"Baja\",IF(AND(Tabla2[[#This Row],[Disponibilidad]]+Tabla2[[#This Row],[Integridad]]+Tabla2[[#This Row],[Confidencialidad ]]>=5,Tabla2[[#This Row],[Disponibilidad]]+Tabla2[[#This Row],[Integridad]]+Tabla2[[#This Row],[Confidencialidad ]]<=7),\"Media\",IF(Tabla2[[#This Row],[Disponibilidad]]+Tabla2[[#This Row],[Integridad]]+Tabla2[[#This Row],[Confidencialidad ]]>=8,\"Alta\",\"error\")))","v":"Baja"}]
["",null,null,null,null,null,null,null,null,null,null,null,null,null,null,null,null,null,null,null,null,null,null,null,null,{"$f":"IF((Tabla2[[#This Row],[Disponibilidad]]+Tabla2[[#This Row],[Integridad]]+Tabla2[[#This Row],[Confidencialidad ]]<=4),\"Baja\",IF(AND(Tabla2[[#This Row],[Disponibilidad]]+Tabla2[[#This Row],[Integridad]]+Tabla2[[#This Row],[Confidencialidad ]]>=5,Tabla2[[#This Row],[Disponibilidad]]+Tabla2[[#This Row],[Integridad]]+Tabla2[[#This Row],[Confidencialidad ]]<=7),\"Media\",IF(Tabla2[[#This Row],[Disponibilidad]]+Tabla2[[#This Row],[Integridad]]+Tabla2[[#This Row],[Confidencialidad ]]>=8,\"Alta\",\"error\")))","v":"Baja"}]
["",null,null,null,null,null,null,null,null,null,null,null,null,null,null,null,null,null,null,null,null,null,null,null,null,{"$f":"IF((Tabla2[[#This Row],[Disponibilidad]]+Tabla2[[#This Row],[Integridad]]+Tabla2[[#This Row],[Confidencialidad ]]<=4),\"Baja\",IF(AND(Tabla2[[#This Row],[Disponibilidad]]+Tabla2[[#This Row],[Integridad]]+Tabla2[[#This Row],[Confidencialidad ]]>=5,Tabla2[[#This Row],[Disponibilidad]]+Tabla2[[#This Row],[Integridad]]+Tabla2[[#This Row],[Confidencialidad ]]<=7),\"Media\",IF(Tabla2[[#This Row],[Disponibilidad]]+Tabla2[[#This Row],[Integridad]]+Tabla2[[#This Row],[Confidencialidad ]]>=8,\"Alta\",\"error\")))","v":"Baja"}]
["",null,null,null,null,null,null,null,null,null,null,null,null,null,null,null,null,null,null,null,null,null,null,null,null,{"$f":"IF((Tabla2[[#This Row],[Disponibilidad]]+Tabla2[[#This Row],[Integridad]]+Tabla2[[#This Row],[Confidencialidad ]]<=4),\"Baja\",IF(AND(Tabla2[[#This Row],[Disponibilidad]]+Tabla2[[#This Row],[Integridad]]+Tabla2[[#This Row],[Confidencialidad ]]>=5,Tabla2[[#This Row],[Disponibilidad]]+Tabla2[[#This Row],[Integridad]]+Tabla2[[#This Row],[Confidencialidad ]]<=7),\"Media\",IF(Tabla2[[#This Row],[Disponibilidad]]+Tabla2[[#This Row],[Integridad]]+Tabla2[[#This Row],[Confidencialidad ]]>=8,\"Alta\",\"error\")))","v":"Baja"}]
["",null,null,null,null,null,null,null,null,null,null,null,null,null,null,null,null,null,null,null,null,null,null,null,null,{"$f":"IF((Tabla2[[#This Row],[Disponibilidad]]+Tabla2[[#This Row],[Integridad]]+Tabla2[[#This Row],[Confidencialidad ]]<=4),\"Baja\",IF(AND(Tabla2[[#This Row],[Disponibilidad]]+Tabla2[[#This Row],[Integridad]]+Tabla2[[#This Row],[Confidencialidad ]]>=5,Tabla2[[#This Row],[Disponibilidad]]+Tabla2[[#This Row],[Integridad]]+Tabla2[[#This Row],[Confidencialidad ]]<=7),\"Media\",IF(Tabla2[[#This Row],[Disponibilidad]]+Tabla2[[#This Row],[Integridad]]+Tabla2[[#This Row],[Confidencialidad ]]>=8,\"Alta\",\"error\")))","v":"Baja"}]
["",null,null,null,null,null,null,null,null,null,null,null,null,null,null,null,null,null,null,null,null,null,null,null,null,{"$f":"IF((Tabla2[[#This Row],[Disponibilidad]]+Tabla2[[#This Row],[Integridad]]+Tabla2[[#This Row],[Confidencialidad ]]<=4),\"Baja\",IF(AND(Tabla2[[#This Row],[Disponibilidad]]+Tabla2[[#This Row],[Integridad]]+Tabla2[[#This Row],[Confidencialidad ]]>=5,Tabla2[[#This Row],[Disponibilidad]]+Tabla2[[#This Row],[Integridad]]+Tabla2[[#This Row],[Confidencialidad ]]<=7),\"Media\",IF(Tabla2[[#This Row],[Disponibilidad]]+Tabla2[[#This Row],[Integridad]]+Tabla2[[#This Row],[Confidencialidad ]]>=8,\"Alta\",\"error\")))","v":"Baja"}]
["",null,null,null,null,null,null,null,null,null,null,null,null,null,null,null,null,null,null,null,null,null,null,null,null,{"$f":"IF((Tabla2[[#This Row],[Disponibilidad]]+Tabla2[[#This Row],[Integridad]]+Tabla2[[#This Row],[Confidencialidad ]]<=4),\"Baja\",IF(AND(Tabla2[[#This Row],[Disponibilidad]]+Tabla2[[#This Row],[Integridad]]+Tabla2[[#This Row],[Confidencialidad ]]>=5,Tabla2[[#This Row],[Disponibilidad]]+Tabla2[[#This Row],[Integridad]]+Tabla2[[#This Row],[Confidencialidad ]]<=7),\"Media\",IF(Tabla2[[#This Row],[Disponibilidad]]+Tabla2[[#This Row],[Integridad]]+Tabla2[[#This Row],[Confidencialidad ]]>=8,\"Alta\",\"error\")))","v":"Baja"}]
["",null,null,null,null,null,null,null,null,null,null,null,null,null,null,null,null,null,null,null,null,null,null,null,null,{"$f":"IF((Tabla2[[#This Row],[Disponibilidad]]+Tabla2[[#This Row],[Integridad]]+Tabla2[[#This Row],[Confidencialidad ]]<=4),\"Baja\",IF(AND(Tabla2[[#This Row],[Disponibilidad]]+Tabla2[[#This Row],[Integridad]]+Tabla2[[#This Row],[Confidencialidad ]]>=5,Tabla2[[#This Row],[Disponibilidad]]+Tabla2[[#This Row],[Integridad]]+Tabla2[[#This Row],[Confidencialidad ]]<=7),\"Media\",IF(Tabla2[[#This Row],[Disponibilidad]]+Tabla2[[#This Row],[Integridad]]+Tabla2[[#This Row],[Confidencialidad ]]>=8,\"Alta\",\"error\")))","v":"Baja"}]
["",null,null,null,null,null,null,null,null,null,null,null,null,null,null,null,null,null,null,null,null,null,null,null,null,{"$f":"IF((Tabla2[[#This Row],[Disponibilidad]]+Tabla2[[#This Row],[Integridad]]+Tabla2[[#This Row],[Confidencialidad ]]<=4),\"Baja\",IF(AND(Tabla2[[#This Row],[Disponibilidad]]+Tabla2[[#This Row],[Integridad]]+Tabla2[[#This Row],[Confidencialidad ]]>=5,Tabla2[[#This Row],[Disponibilidad]]+Tabla2[[#This Row],[Integridad]]+Tabla2[[#This Row],[Confidencialidad ]]<=7),\"Media\",IF(Tabla2[[#This Row],[Disponibilidad]]+Tabla2[[#This Row],[Integridad]]+Tabla2[[#This Row],[Confidencialidad ]]>=8,\"Alta\",\"error\")))","v":"Baja"}]
["",null,null,null,null,null,null,null,null,null,null,null,null,null,null,null,null,null,null,null,null,null,null,null,null,{"$f":"IF((Tabla2[[#This Row],[Disponibilidad]]+Tabla2[[#This Row],[Integridad]]+Tabla2[[#This Row],[Confidencialidad ]]<=4),\"Baja\",IF(AND(Tabla2[[#This Row],[Disponibilidad]]+Tabla2[[#This Row],[Integridad]]+Tabla2[[#This Row],[Confidencialidad ]]>=5,Tabla2[[#This Row],[Disponibilidad]]+Tabla2[[#This Row],[Integridad]]+Tabla2[[#This Row],[Confidencialidad ]]<=7),\"Media\",IF(Tabla2[[#This Row],[Disponibilidad]]+Tabla2[[#This Row],[Integridad]]+Tabla2[[#This Row],[Confidencialidad ]]>=8,\"Alta\",\"error\")))","v":"Baja"}]
["",null,null,null,null,null,null,null,null,null,null,null,null,null,null,null,null,null,null,null,null,null,null,null,null,{"$f":"IF((Tabla2[[#This Row],[Disponibilidad]]+Tabla2[[#This Row],[Integridad]]+Tabla2[[#This Row],[Confidencialidad ]]<=4),\"Baja\",IF(AND(Tabla2[[#This Row],[Disponibilidad]]+Tabla2[[#This Row],[Integridad]]+Tabla2[[#This Row],[Confidencialidad ]]>=5,Tabla2[[#This Row],[Disponibilidad]]+Tabla2[[#This Row],[Integridad]]+Tabla2[[#This Row],[Confidencialidad ]]<=7),\"Media\",IF(Tabla2[[#This Row],[Disponibilidad]]+Tabla2[[#This Row],[Integridad]]+Tabla2[[#This Row],[Confidencialidad ]]>=8,\"Alta\",\"error\")))","v":"Baja"}]
["",null,null,null,null,null,null,null,null,null,null,null,null,null,null,null,null,null,null,null,null,null,null,null,null,{"$f":"IF((Tabla2[[#This Row],[Disponibilidad]]+Tabla2[[#This Row],[Integridad]]+Tabla2[[#This Row],[Confidencialidad ]]<=4),\"Baja\",IF(AND(Tabla2[[#This Row],[Disponibilidad]]+Tabla2[[#This Row],[Integridad]]+Tabla2[[#This Row],[Confidencialidad ]]>=5,Tabla2[[#This Row],[Disponibilidad]]+Tabla2[[#This Row],[Integridad]]+Tabla2[[#This Row],[Confidencialidad ]]<=7),\"Media\",IF(Tabla2[[#This Row],[Disponibilidad]]+Tabla2[[#This Row],[Integridad]]+Tabla2[[#This Row],[Confidencialidad ]]>=8,\"Alta\",\"error\")))","v":"Baja"}]
["",null,null,null,null,null,null,null,null,null,null,null,null,null,null,null,null,null,null,null,null,null,null,null,null,{"$f":"IF((Tabla2[[#This Row],[Disponibilidad]]+Tabla2[[#This Row],[Integridad]]+Tabla2[[#This Row],[Confidencialidad ]]<=4),\"Baja\",IF(AND(Tabla2[[#This Row],[Disponibilidad]]+Tabla2[[#This Row],[Integridad]]+Tabla2[[#This Row],[Confidencialidad ]]>=5,Tabla2[[#This Row],[Disponibilidad]]+Tabla2[[#This Row],[Integridad]]+Tabla2[[#This Row],[Confidencialidad ]]<=7),\"Media\",IF(Tabla2[[#This Row],[Disponibilidad]]+Tabla2[[#This Row],[Integridad]]+Tabla2[[#This Row],[Confidencialidad ]]>=8,\"Alta\",\"error\")))","v":"Baja"}]
["",null,null,null,null,null,null,null,null,null,null,null,null,null,null,null,null,null,null,null,null,null,null,null,null,{"$f":"IF((Tabla2[[#This Row],[Disponibilidad]]+Tabla2[[#This Row],[Integridad]]+Tabla2[[#This Row],[Confidencialidad ]]<=4),\"Baja\",IF(AND(Tabla2[[#This Row],[Disponibilidad]]+Tabla2[[#This Row],[Integridad]]+Tabla2[[#This Row],[Confidencialidad ]]>=5,Tabla2[[#This Row],[Disponibilidad]]+Tabla2[[#This Row],[Integridad]]+Tabla2[[#This Row],[Confidencialidad ]]<=7),\"Media\",IF(Tabla2[[#This Row],[Disponibilidad]]+Tabla2[[#This Row],[Integridad]]+Tabla2[[#This Row],[Confidencialidad ]]>=8,\"Alta\",\"error\")))","v":"Baja"}]
["",null,null,null,null,null,null,null,null,null,null,null,null,null,null,null,null,null,null,null,null,null,null,null,null,{"$f":"IF((Tabla2[[#This Row],[Disponibilidad]]+Tabla2[[#This Row],[Integridad]]+Tabla2[[#This Row],[Confidencialidad ]]<=4),\"Baja\",IF(AND(Tabla2[[#This Row],[Disponibilidad]]+Tabla2[[#This Row],[Integridad]]+Tabla2[[#This Row],[Confidencialidad ]]>=5,Tabla2[[#This Row],[Disponibilidad]]+Tabla2[[#This Row],[Integridad]]+Tabla2[[#This Row],[Confidencialidad ]]<=7),\"Media\",IF(Tabla2[[#This Row],[Disponibilidad]]+Tabla2[[#This Row],[Integridad]]+Tabla2[[#This Row],[Confidencialidad ]]>=8,\"Alta\",\"error\")))","v":"Baja"}]
["",null,null,null,null,null,null,null,null,null,null,null,null,null,null,null,null,null,null,null,null,null,null,null,null,{"$f":"IF((Tabla2[[#This Row],[Disponibilidad]]+Tabla2[[#This Row],[Integridad]]+Tabla2[[#This Row],[Confidencialidad ]]<=4),\"Baja\",IF(AND(Tabla2[[#This Row],[Disponibilidad]]+Tabla2[[#This Row],[Integridad]]+Tabla2[[#This Row],[Confidencialidad ]]>=5,Tabla2[[#This Row],[Disponibilidad]]+Tabla2[[#This Row],[Integridad]]+Tabla2[[#This Row],[Confidencialidad ]]<=7),\"Media\",IF(Tabla2[[#This Row],[Disponibilidad]]+Tabla2[[#This Row],[Integridad]]+Tabla2[[#This Row],[Confidencialidad ]]>=8,\"Alta\",\"error\")))","v":"Baja"}]
["",null,null,null,null,null,null,null,null,null,null,null,null,null,null,null,null,null,null,null,null,null,null,null,null,{"$f":"IF((Tabla2[[#This Row],[Disponibilidad]]+Tabla2[[#This Row],[Integridad]]+Tabla2[[#This Row],[Confidencialidad ]]<=4),\"Baja\",IF(AND(Tabla2[[#This Row],[Disponibilidad]]+Tabla2[[#This Row],[Integridad]]+Tabla2[[#This Row],[Confidencialidad ]]>=5,Tabla2[[#This Row],[Disponibilidad]]+Tabla2[[#This Row],[Integridad]]+Tabla2[[#This Row],[Confidencialidad ]]<=7),\"Media\",IF(Tabla2[[#This Row],[Disponibilidad]]+Tabla2[[#This Row],[Integridad]]+Tabla2[[#This Row],[Confidencialidad ]]>=8,\"Alta\",\"error\")))","v":"Baja"}]
["",null,null,null,null,null,null,null,null,null,null,null,null,null,null,null,null,null,null,null,null,null,null,null,null,{"$f":"IF((Tabla2[[#This Row],[Disponibilidad]]+Tabla2[[#This Row],[Integridad]]+Tabla2[[#This Row],[Confidencialidad ]]<=4),\"Baja\",IF(AND(Tabla2[[#This Row],[Disponibilidad]]+Tabla2[[#This Row],[Integridad]]+Tabla2[[#This Row],[Confidencialidad ]]>=5,Tabla2[[#This Row],[Disponibilidad]]+Tabla2[[#This Row],[Integridad]]+Tabla2[[#This Row],[Confidencialidad ]]<=7),\"Media\",IF(Tabla2[[#This Row],[Disponibilidad]]+Tabla2[[#This Row],[Integridad]]+Tabla2[[#This Row],[Confidencialidad ]]>=8,\"Alta\",\"error\")))","v":"Baja"}]
["",null,null,null,null,null,null,null,null,null,null,null,null,null,null,null,null,null,null,null,null,null,null,null,null,{"$f":"IF((Tabla2[[#This Row],[Disponibilidad]]+Tabla2[[#This Row],[Integridad]]+Tabla2[[#This Row],[Confidencialidad ]]<=4),\"Baja\",IF(AND(Tabla2[[#This Row],[Disponibilidad]]+Tabla2[[#This Row],[Integridad]]+Tabla2[[#This Row],[Confidencialidad ]]>=5,Tabla2[[#This Row],[Disponibilidad]]+Tabla2[[#This Row],[Integridad]]+Tabla2[[#This Row],[Confidencialidad ]]<=7),\"Media\",IF(Tabla2[[#This Row],[Disponibilidad]]+Tabla2[[#This Row],[Integridad]]+Tabla2[[#This Row],[Confidencialidad ]]>=8,\"Alta\",\"error\")))","v":"Baja"}]
["",null,null,null,null,null,null,null,null,null,null,null,null,null,null,null,null,null,null,null,null,null,null,null,null,{"$f":"IF((Tabla2[[#This Row],[Disponibilidad]]+Tabla2[[#This Row],[Integridad]]+Tabla2[[#This Row],[Confidencialidad ]]<=4),\"Baja\",IF(AND(Tabla2[[#This Row],[Disponibilidad]]+Tabla2[[#This Row],[Integridad]]+Tabla2[[#This Row],[Confidencialidad ]]>=5,Tabla2[[#This Row],[Disponibilidad]]+Tabla2[[#This Row],[Integridad]]+Tabla2[[#This Row],[Confidencialidad ]]<=7),\"Media\",IF(Tabla2[[#This Row],[Disponibilidad]]+Tabla2[[#This Row],[Integridad]]+Tabla2[[#This Row],[Confidencialidad ]]>=8,\"Alta\",\"error\")))","v":"Baja"}]
["",null,null,null,null,null,null,null,null,null,null,null,null,null,null,null,null,null,null,null,null,null,null,null,null,{"$f":"IF((Tabla2[[#This Row],[Disponibilidad]]+Tabla2[[#This Row],[Integridad]]+Tabla2[[#This Row],[Confidencialidad ]]<=4),\"Baja\",IF(AND(Tabla2[[#This Row],[Disponibilidad]]+Tabla2[[#This Row],[Integridad]]+Tabla2[[#This Row],[Confidencialidad ]]>=5,Tabla2[[#This Row],[Disponibilidad]]+Tabla2[[#This Row],[Integridad]]+Tabla2[[#This Row],[Confidencialidad ]]<=7),\"Media\",IF(Tabla2[[#This Row],[Disponibilidad]]+Tabla2[[#This Row],[Integridad]]+Tabla2[[#This Row],[Confidencialidad ]]>=8,\"Alta\",\"error\")))","v":"Baja"}]
["",null,null,null,null,null,null,null,null,null,null,null,null,null,null,null,null,null,null,null,null,null,null,null,null,{"$f":"IF((Tabla2[[#This Row],[Disponibilidad]]+Tabla2[[#This Row],[Integridad]]+Tabla2[[#This Row],[Confidencialidad ]]<=4),\"Baja\",IF(AND(Tabla2[[#This Row],[Disponibilidad]]+Tabla2[[#This Row],[Integridad]]+Tabla2[[#This Row],[Confidencialidad ]]>=5,Tabla2[[#This Row],[Disponibilidad]]+Tabla2[[#This Row],[Integridad]]+Tabla2[[#This Row],[Confidencialidad ]]<=7),\"Media\",IF(Tabla2[[#This Row],[Disponibilidad]]+Tabla2[[#This Row],[Integridad]]+Tabla2[[#This Row],[Confidencialidad ]]>=8,\"Alta\",\"error\")))","v":"Baja"}]
["",null,null,null,null,null,null,null,null,null,null,null,null,null,null,null,null,null,null,null,null,null,null,null,null,{"$f":"IF((Tabla2[[#This Row],[Disponibilidad]]+Tabla2[[#This Row],[Integridad]]+Tabla2[[#This Row],[Confidencialidad ]]<=4),\"Baja\",IF(AND(Tabla2[[#This Row],[Disponibilidad]]+Tabla2[[#This Row],[Integridad]]+Tabla2[[#This Row],[Confidencialidad ]]>=5,Tabla2[[#This Row],[Disponibilidad]]+Tabla2[[#This Row],[Integridad]]+Tabla2[[#This Row],[Confidencialidad ]]<=7),\"Media\",IF(Tabla2[[#This Row],[Disponibilidad]]+Tabla2[[#This Row],[Integridad]]+Tabla2[[#This Row],[Confidencialidad ]]>=8,\"Alta\",\"error\")))","v":"Baja"}]
["",null,null,null,null,null,null,null,null,null,null,null,null,null,null,null,null,null,null,null,null,null,null,null,null,{"$f":"IF((Tabla2[[#This Row],[Disponibilidad]]+Tabla2[[#This Row],[Integridad]]+Tabla2[[#This Row],[Confidencialidad ]]<=4),\"Baja\",IF(AND(Tabla2[[#This Row],[Disponibilidad]]+Tabla2[[#This Row],[Integridad]]+Tabla2[[#This Row],[Confidencialidad ]]>=5,Tabla2[[#This Row],[Disponibilidad]]+Tabla2[[#This Row],[Integridad]]+Tabla2[[#This Row],[Confidencialidad ]]<=7),\"Media\",IF(Tabla2[[#This Row],[Disponibilidad]]+Tabla2[[#This Row],[Integridad]]+Tabla2[[#This Row],[Confidencialidad ]]>=8,\"Alta\",\"error\")))","v":"Baja"}]
["",null,null,null,null,null,null,null,null,null,null,null,null,null,null,null,null,null,null,null,null,null,null,null,null,{"$f":"IF((Tabla2[[#This Row],[Disponibilidad]]+Tabla2[[#This Row],[Integridad]]+Tabla2[[#This Row],[Confidencialidad ]]<=4),\"Baja\",IF(AND(Tabla2[[#This Row],[Disponibilidad]]+Tabla2[[#This Row],[Integridad]]+Tabla2[[#This Row],[Confidencialidad ]]>=5,Tabla2[[#This Row],[Disponibilidad]]+Tabla2[[#This Row],[Integridad]]+Tabla2[[#This Row],[Confidencialidad ]]<=7),\"Media\",IF(Tabla2[[#This Row],[Disponibilidad]]+Tabla2[[#This Row],[Integridad]]+Tabla2[[#This Row],[Confidencialidad ]]>=8,\"Alta\",\"error\")))","v":"Baja"}]
["",null,null,null,null,null,null,null,null,null,null,null,null,null,null,null,null,null,null,null,null,null,null,null,null,{"$f":"IF((Tabla2[[#This Row],[Disponibilidad]]+Tabla2[[#This Row],[Integridad]]+Tabla2[[#This Row],[Confidencialidad ]]<=4),\"Baja\",IF(AND(Tabla2[[#This Row],[Disponibilidad]]+Tabla2[[#This Row],[Integridad]]+Tabla2[[#This Row],[Confidencialidad ]]>=5,Tabla2[[#This Row],[Disponibilidad]]+Tabla2[[#This Row],[Integridad]]+Tabla2[[#This Row],[Confidencialidad ]]<=7),\"Media\",IF(Tabla2[[#This Row],[Disponibilidad]]+Tabla2[[#This Row],[Integridad]]+Tabla2[[#This Row],[Confidencialidad ]]>=8,\"Alta\",\"error\")))","v":"Baja"}]
["",null,null,null,null,null,null,null,null,null,null,null,null,null,null,null,null,null,null,null,null,null,null,null,null,{"$f":"IF((Tabla2[[#This Row],[Disponibilidad]]+Tabla2[[#This Row],[Integridad]]+Tabla2[[#This Row],[Confidencialidad ]]<=4),\"Baja\",IF(AND(Tabla2[[#This Row],[Disponibilidad]]+Tabla2[[#This Row],[Integridad]]+Tabla2[[#This Row],[Confidencialidad ]]>=5,Tabla2[[#This Row],[Disponibilidad]]+Tabla2[[#This Row],[Integridad]]+Tabla2[[#This Row],[Confidencialidad ]]<=7),\"Media\",IF(Tabla2[[#This Row],[Disponibilidad]]+Tabla2[[#This Row],[Integridad]]+Tabla2[[#This Row],[Confidencialidad ]]>=8,\"Alta\",\"error\")))","v":"Baja"}]
["",null,null,null,null,null,null,null,null,null,null,null,null,null,null,null,null,null,null,null,null,null,null,null,null,{"$f":"IF((Tabla2[[#This Row],[Disponibilidad]]+Tabla2[[#This Row],[Integridad]]+Tabla2[[#This Row],[Confidencialidad ]]<=4),\"Baja\",IF(AND(Tabla2[[#This Row],[Disponibilidad]]+Tabla2[[#This Row],[Integridad]]+Tabla2[[#This Row],[Confidencialidad ]]>=5,Tabla2[[#This Row],[Disponibilidad]]+Tabla2[[#This Row],[Integridad]]+Tabla2[[#This Row],[Confidencialidad ]]<=7),\"Media\",IF(Tabla2[[#This Row],[Disponibilidad]]+Tabla2[[#This Row],[Integridad]]+Tabla2[[#This Row],[Confidencialidad ]]>=8,\"Alta\",\"error\")))","v":"Baja"}]
[{"$f":"IF(C72<>\"\",1,\"\")","v":""},null,null,null,null,null,null,null,null,null,null,null,null,null,null,null,null,null,null,null,null,null,null,null,null,{"$f":"IF((Tabla2[[#This Row],[Disponibilidad]]+Tabla2[[#This Row],[Integridad]]+Tabla2[[#This Row],[Confidencialidad ]]<=4),\"Baja\",IF(AND(Tabla2[[#This Row],[Disponibilidad]]+Tabla2[[#This Row],[Integridad]]+Tabla2[[#This Row],[Confidencialidad ]]>=5,Tabla2[[#This Row],[Disponibilidad]]+Tabla2[[#This Row],[Integridad]]+Tabla2[[#This Row],[Confidencialidad ]]<=7),\"Media\",IF(Tabla2[[#This Row],[Disponibilidad]]+Tabla2[[#This Row],[Integridad]]+Tabla2[[#This Row],[Confidencialidad ]]>=8,\"Alta\",\"error\")))","v":"Baja"}]
["",null,null,null,null,null,null,null,null,null,null,null,null,null,null,null,null,null,null,null,null,null,null,null,null,{"$f":"IF((Tabla2[[#This Row],[Disponibilidad]]+Tabla2[[#This Row],[Integridad]]+Tabla2[[#This Row],[Confidencialidad ]]<=4),\"Baja\",IF(AND(Tabla2[[#This Row],[Disponibilidad]]+Tabla2[[#This Row],[Integridad]]+Tabla2[[#This Row],[Confidencialidad ]]>=5,Tabla2[[#This Row],[Disponibilidad]]+Tabla2[[#This Row],[Integridad]]+Tabla2[[#This Row],[Confidencialidad ]]<=7),\"Media\",IF(Tabla2[[#This Row],[Disponibilidad]]+Tabla2[[#This Row],[Integridad]]+Tabla2[[#This Row],[Confidencialidad ]]>=8,\"Alta\",\"error\")))","v":"Baja"}]
["",null,null,null,null,null,null,null,null,null,null,null,null,null,null,null,null,null,null,null,null,null,null,null,null,{"$f":"IF((Tabla2[[#This Row],[Disponibilidad]]+Tabla2[[#This Row],[Integridad]]+Tabla2[[#This Row],[Confidencialidad ]]<=4),\"Baja\",IF(AND(Tabla2[[#This Row],[Disponibilidad]]+Tabla2[[#This Row],[Integridad]]+Tabla2[[#This Row],[Confidencialidad ]]>=5,Tabla2[[#This Row],[Disponibilidad]]+Tabla2[[#This Row],[Integridad]]+Tabla2[[#This Row],[Confidencialidad ]]<=7),\"Media\",IF(Tabla2[[#This Row],[Disponibilidad]]+Tabla2[[#This Row],[Integridad]]+Tabla2[[#This Row],[Confidencialidad ]]>=8,\"Alta\",\"error\")))","v":"Baja"}]
["",null,null,null,null,null,null,null,null,null,null,null,null,null,null,null,null,null,null,null,null,null,null,null,null,{"$f":"IF((Tabla2[[#This Row],[Disponibilidad]]+Tabla2[[#This Row],[Integridad]]+Tabla2[[#This Row],[Confidencialidad ]]<=4),\"Baja\",IF(AND(Tabla2[[#This Row],[Disponibilidad]]+Tabla2[[#This Row],[Integridad]]+Tabla2[[#This Row],[Confidencialidad ]]>=5,Tabla2[[#This Row],[Disponibilidad]]+Tabla2[[#This Row],[Integridad]]+Tabla2[[#This Row],[Confidencialidad ]]<=7),\"Media\",IF(Tabla2[[#This Row],[Disponibilidad]]+Tabla2[[#This Row],[Integridad]]+Tabla2[[#This Row],[Confidencialidad ]]>=8,\"Alta\",\"error\")))","v":"Baja"}]
["",null,null,null,null,null,null,null,null,null,null,null,null,null,null,null,null,null,null,null,null,null,null,null,null,{"$f":"IF((Tabla2[[#This Row],[Disponibilidad]]+Tabla2[[#This Row],[Integridad]]+Tabla2[[#This Row],[Confidencialidad ]]<=4),\"Baja\",IF(AND(Tabla2[[#This Row],[Disponibilidad]]+Tabla2[[#This Row],[Integridad]]+Tabla2[[#This Row],[Confidencialidad ]]>=5,Tabla2[[#This Row],[Disponibilidad]]+Tabla2[[#This Row],[Integridad]]+Tabla2[[#This Row],[Confidencialidad ]]<=7),\"Media\",IF(Tabla2[[#This Row],[Disponibilidad]]+Tabla2[[#This Row],[Integridad]]+Tabla2[[#This Row],[Confidencialidad ]]>=8,\"Alta\",\"error\")))","v":"Baja"}]
["",null,null,null,null,null,null,null,null,null,null,null,null,null,null,null,null,null,null,null,null,null,null,null,null,{"$f":"IF((Tabla2[[#This Row],[Disponibilidad]]+Tabla2[[#This Row],[Integridad]]+Tabla2[[#This Row],[Confidencialidad ]]<=4),\"Baja\",IF(AND(Tabla2[[#This Row],[Disponibilidad]]+Tabla2[[#This Row],[Integridad]]+Tabla2[[#This Row],[Confidencialidad ]]>=5,Tabla2[[#This Row],[Disponibilidad]]+Tabla2[[#This Row],[Integridad]]+Tabla2[[#This Row],[Confidencialidad ]]<=7),\"Media\",IF(Tabla2[[#This Row],[Disponibilidad]]+Tabla2[[#This Row],[Integridad]]+Tabla2[[#This Row],[Confidencialidad ]]>=8,\"Alta\",\"error\")))","v":"Baja"}]
["",null,null,null,null,null,null,null,null,null,null,null,null,null,null,null,null,null,null,null,null,null,null,null,null,{"$f":"IF((Tabla2[[#This Row],[Disponibilidad]]+Tabla2[[#This Row],[Integridad]]+Tabla2[[#This Row],[Confidencialidad ]]<=4),\"Baja\",IF(AND(Tabla2[[#This Row],[Disponibilidad]]+Tabla2[[#This Row],[Integridad]]+Tabla2[[#This Row],[Confidencialidad ]]>=5,Tabla2[[#This Row],[Disponibilidad]]+Tabla2[[#This Row],[Integridad]]+Tabla2[[#This Row],[Confidencialidad ]]<=7),\"Media\",IF(Tabla2[[#This Row],[Disponibilidad]]+Tabla2[[#This Row],[Integridad]]+Tabla2[[#This Row],[Confidencialidad ]]>=8,\"Alta\",\"error\")))","v":"Baja"}]
["",null,null,null,null,null,null,null,null,null,null,null,null,null,null,null,null,null,null,null,null,null,null,null,null,{"$f":"IF((Tabla2[[#This Row],[Disponibilidad]]+Tabla2[[#This Row],[Integridad]]+Tabla2[[#This Row],[Confidencialidad ]]<=4),\"Baja\",IF(AND(Tabla2[[#This Row],[Disponibilidad]]+Tabla2[[#This Row],[Integridad]]+Tabla2[[#This Row],[Confidencialidad ]]>=5,Tabla2[[#This Row],[Disponibilidad]]+Tabla2[[#This Row],[Integridad]]+Tabla2[[#This Row],[Confidencialidad ]]<=7),\"Media\",IF(Tabla2[[#This Row],[Disponibilidad]]+Tabla2[[#This Row],[Integridad]]+Tabla2[[#This Row],[Confidencialidad ]]>=8,\"Alta\",\"error\")))","v":"Baja"}]
["",null,null,null,null,null,null,null,null,null,null,null,null,null,null,null,null,null,null,null,null,null,null,null,null,{"$f":"IF((Tabla2[[#This Row],[Disponibilidad]]+Tabla2[[#This Row],[Integridad]]+Tabla2[[#This Row],[Confidencialidad ]]<=4),\"Baja\",IF(AND(Tabla2[[#This Row],[Disponibilidad]]+Tabla2[[#This Row],[Integridad]]+Tabla2[[#This Row],[Confidencialidad ]]>=5,Tabla2[[#This Row],[Disponibilidad]]+Tabla2[[#This Row],[Integridad]]+Tabla2[[#This Row],[Confidencialidad ]]<=7),\"Media\",IF(Tabla2[[#This Row],[Disponibilidad]]+Tabla2[[#This Row],[Integridad]]+Tabla2[[#This Row],[Confidencialidad ]]>=8,\"Alta\",\"error\")))","v":"Baja"}]
["",null,null,null,null,null,null,null,null,null,null,null,null,null,null,null,null,null,null,null,null,null,null,null,null,{"$f":"IF((Tabla2[[#This Row],[Disponibilidad]]+Tabla2[[#This Row],[Integridad]]+Tabla2[[#This Row],[Confidencialidad ]]<=4),\"Baja\",IF(AND(Tabla2[[#This Row],[Disponibilidad]]+Tabla2[[#This Row],[Integridad]]+Tabla2[[#This Row],[Confidencialidad ]]>=5,Tabla2[[#This Row],[Disponibilidad]]+Tabla2[[#This Row],[Integridad]]+Tabla2[[#This Row],[Confidencialidad ]]<=7),\"Media\",IF(Tabla2[[#This Row],[Disponibilidad]]+Tabla2[[#This Row],[Integridad]]+Tabla2[[#This Row],[Confidencialidad ]]>=8,\"Alta\",\"error\")))","v":"Baja"}]
["",null,null,null,null,null,null,null,null,null,null,null,null,null,null,null,null,null,null,null,null,null,null,null,null,{"$f":"IF((Tabla2[[#This Row],[Disponibilidad]]+Tabla2[[#This Row],[Integridad]]+Tabla2[[#This Row],[Confidencialidad ]]<=4),\"Baja\",IF(AND(Tabla2[[#This Row],[Disponibilidad]]+Tabla2[[#This Row],[Integridad]]+Tabla2[[#This Row],[Confidencialidad ]]>=5,Tabla2[[#This Row],[Disponibilidad]]+Tabla2[[#This Row],[Integridad]]+Tabla2[[#This Row],[Confidencialidad ]]<=7),\"Media\",IF(Tabla2[[#This Row],[Disponibilidad]]+Tabla2[[#This Row],[Integridad]]+Tabla2[[#This Row],[Confidencialidad ]]>=8,\"Alta\",\"error\")))","v":"Baja"}]
["",null,null,null,null,null,null,null,null,null,null,null,null,null,null,null,null,null,null,null,null,null,null,null,null,{"$f":"IF((Tabla2[[#This Row],[Disponibilidad]]+Tabla2[[#This Row],[Integridad]]+Tabla2[[#This Row],[Confidencialidad ]]<=4),\"Baja\",IF(AND(Tabla2[[#This Row],[Disponibilidad]]+Tabla2[[#This Row],[Integridad]]+Tabla2[[#This Row],[Confidencialidad ]]>=5,Tabla2[[#This Row],[Disponibilidad]]+Tabla2[[#This Row],[Integridad]]+Tabla2[[#This Row],[Confidencialidad ]]<=7),\"Media\",IF(Tabla2[[#This Row],[Disponibilidad]]+Tabla2[[#This Row],[Integridad]]+Tabla2[[#This Row],[Confidencialidad ]]>=8,\"Alta\",\"error\")))","v":"Baja"}]
["",null,null,null,null,null,null,null,null,null,null,null,null,null,null,null,null,null,null,null,null,null,null,null,null,{"$f":"IF((Tabla2[[#This Row],[Disponibilidad]]+Tabla2[[#This Row],[Integridad]]+Tabla2[[#This Row],[Confidencialidad ]]<=4),\"Baja\",IF(AND(Tabla2[[#This Row],[Disponibilidad]]+Tabla2[[#This Row],[Integridad]]+Tabla2[[#This Row],[Confidencialidad ]]>=5,Tabla2[[#This Row],[Disponibilidad]]+Tabla2[[#This Row],[Integridad]]+Tabla2[[#This Row],[Confidencialidad ]]<=7),\"Media\",IF(Tabla2[[#This Row],[Disponibilidad]]+Tabla2[[#This Row],[Integridad]]+Tabla2[[#This Row],[Confidencialidad ]]>=8,\"Alta\",\"error\")))","v":"Baja"}]
["",null,null,null,null,null,null,null,null,null,null,null,null,null,null,null,null,null,null,null,null,null,null,null,null,{"$f":"IF((Tabla2[[#This Row],[Disponibilidad]]+Tabla2[[#This Row],[Integridad]]+Tabla2[[#This Row],[Confidencialidad ]]<=4),\"Baja\",IF(AND(Tabla2[[#This Row],[Disponibilidad]]+Tabla2[[#This Row],[Integridad]]+Tabla2[[#This Row],[Confidencialidad ]]>=5,Tabla2[[#This Row],[Disponibilidad]]+Tabla2[[#This Row],[Integridad]]+Tabla2[[#This Row],[Confidencialidad ]]<=7),\"Media\",IF(Tabla2[[#This Row],[Disponibilidad]]+Tabla2[[#This Row],[Integridad]]+Tabla2[[#This Row],[Confidencialidad ]]>=8,\"Alta\",\"error\")))","v":"Baja"}]
["",null,null,null,null,null,null,null,null,null,null,null,null,null,null,null,null,null,null,null,null,null,null,null,null,{"$f":"IF((Tabla2[[#This Row],[Disponibilidad]]+Tabla2[[#This Row],[Integridad]]+Tabla2[[#This Row],[Confidencialidad ]]<=4),\"Baja\",IF(AND(Tabla2[[#This Row],[Disponibilidad]]+Tabla2[[#This Row],[Integridad]]+Tabla2[[#This Row],[Confidencialidad ]]>=5,Tabla2[[#This Row],[Disponibilidad]]+Tabla2[[#This Row],[Integridad]]+Tabla2[[#This Row],[Confidencialidad ]]<=7),\"Media\",IF(Tabla2[[#This Row],[Disponibilidad]]+Tabla2[[#This Row],[Integridad]]+Tabla2[[#This Row],[Confidencialidad ]]>=8,\"Alta\",\"error\")))","v":"Baja"}]
["",null,null,null,null,null,null,null,null,null,null,null,null,null,null,null,null,null,null,null,null,null,null,null,null,{"$f":"IF((Tabla2[[#This Row],[Disponibilidad]]+Tabla2[[#This Row],[Integridad]]+Tabla2[[#This Row],[Confidencialidad ]]<=4),\"Baja\",IF(AND(Tabla2[[#This Row],[Disponibilidad]]+Tabla2[[#This Row],[Integridad]]+Tabla2[[#This Row],[Confidencialidad ]]>=5,Tabla2[[#This Row],[Disponibilidad]]+Tabla2[[#This Row],[Integridad]]+Tabla2[[#This Row],[Confidencialidad ]]<=7),\"Media\",IF(Tabla2[[#This Row],[Disponibilidad]]+Tabla2[[#This Row],[Integridad]]+Tabla2[[#This Row],[Confidencialidad ]]>=8,\"Alta\",\"error\")))","v":"Baja"}]
["",null,null,null,null,null,null,null,null,null,null,null,null,null,null,null,null,null,null,null,null,null,null,null,null,{"$f":"IF((Tabla2[[#This Row],[Disponibilidad]]+Tabla2[[#This Row],[Integridad]]+Tabla2[[#This Row],[Confidencialidad ]]<=4),\"Baja\",IF(AND(Tabla2[[#This Row],[Disponibilidad]]+Tabla2[[#This Row],[Integridad]]+Tabla2[[#This Row],[Confidencialidad ]]>=5,Tabla2[[#This Row],[Disponibilidad]]+Tabla2[[#This Row],[Integridad]]+Tabla2[[#This Row],[Confidencialidad ]]<=7),\"Media\",IF(Tabla2[[#This Row],[Disponibilidad]]+Tabla2[[#This Row],[Integridad]]+Tabla2[[#This Row],[Confidencialidad ]]>=8,\"Alta\",\"error\")))","v":"Baja"}]
["",null,null,null,null,null,null,null,null,null,null,null,null,null,null,null,null,null,null,null,null,null,null,null,null,{"$f":"IF((Tabla2[[#This Row],[Disponibilidad]]+Tabla2[[#This Row],[Integridad]]+Tabla2[[#This Row],[Confidencialidad ]]<=4),\"Baja\",IF(AND(Tabla2[[#This Row],[Disponibilidad]]+Tabla2[[#This Row],[Integridad]]+Tabla2[[#This Row],[Confidencialidad ]]>=5,Tabla2[[#This Row],[Disponibilidad]]+Tabla2[[#This Row],[Integridad]]+Tabla2[[#This Row],[Confidencialidad ]]<=7),\"Media\",IF(Tabla2[[#This Row],[Disponibilidad]]+Tabla2[[#This Row],[Integridad]]+Tabla2[[#This Row],[Confidencialidad ]]>=8,\"Alta\",\"error\")))","v":"Baja"}]
["",null,null,null,null,null,null,null,null,null,null,null,null,null,null,null,null,null,null,null,null,null,null,null,null,{"$f":"IF((Tabla2[[#This Row],[Disponibilidad]]+Tabla2[[#This Row],[Integridad]]+Tabla2[[#This Row],[Confidencialidad ]]<=4),\"Baja\",IF(AND(Tabla2[[#This Row],[Disponibilidad]]+Tabla2[[#This Row],[Integridad]]+Tabla2[[#This Row],[Confidencialidad ]]>=5,Tabla2[[#This Row],[Disponibilidad]]+Tabla2[[#This Row],[Integridad]]+Tabla2[[#This Row],[Confidencialidad ]]<=7),\"Media\",IF(Tabla2[[#This Row],[Disponibilidad]]+Tabla2[[#This Row],[Integridad]]+Tabla2[[#This Row],[Confidencialidad ]]>=8,\"Alta\",\"error\")))","v":"Baja"}]
["",null,null,null,null,null,null,null,null,null,null,null,null,null,null,null,null,null,null,null,null,null,null,null,null,{"$f":"IF((Tabla2[[#This Row],[Disponibilidad]]+Tabla2[[#This Row],[Integridad]]+Tabla2[[#This Row],[Confidencialidad ]]<=4),\"Baja\",IF(AND(Tabla2[[#This Row],[Disponibilidad]]+Tabla2[[#This Row],[Integridad]]+Tabla2[[#This Row],[Confidencialidad ]]>=5,Tabla2[[#This Row],[Disponibilidad]]+Tabla2[[#This Row],[Integridad]]+Tabla2[[#This Row],[Confidencialidad ]]<=7),\"Media\",IF(Tabla2[[#This Row],[Disponibilidad]]+Tabla2[[#This Row],[Integridad]]+Tabla2[[#This Row],[Confidencialidad ]]>=8,\"Alta\",\"error\")))","v":"Baja"}]
["",null,null,null,null,null,null,null,null,null,null,null,null,null,null,null,null,null,null,null,null,null,null,null,null,{"$f":"IF((Tabla2[[#This Row],[Disponibilidad]]+Tabla2[[#This Row],[Integridad]]+Tabla2[[#This Row],[Confidencialidad ]]<=4),\"Baja\",IF(AND(Tabla2[[#This Row],[Disponibilidad]]+Tabla2[[#This Row],[Integridad]]+Tabla2[[#This Row],[Confidencialidad ]]>=5,Tabla2[[#This Row],[Disponibilidad]]+Tabla2[[#This Row],[Integridad]]+Tabla2[[#This Row],[Confidencialidad ]]<=7),\"Media\",IF(Tabla2[[#This Row],[Disponibilidad]]+Tabla2[[#This Row],[Integridad]]+Tabla2[[#This Row],[Confidencialidad ]]>=8,\"Alta\",\"error\")))","v":"Baja"}]
["",null,null,null,null,null,null,null,null,null,null,null,null,null,null,null,null,null,null,null,null,null,null,null,null,{"$f":"IF((Tabla2[[#This Row],[Disponibilidad]]+Tabla2[[#This Row],[Integridad]]+Tabla2[[#This Row],[Confidencialidad ]]<=4),\"Baja\",IF(AND(Tabla2[[#This Row],[Disponibilidad]]+Tabla2[[#This Row],[Integridad]]+Tabla2[[#This Row],[Confidencialidad ]]>=5,Tabla2[[#This Row],[Disponibilidad]]+Tabla2[[#This Row],[Integridad]]+Tabla2[[#This Row],[Confidencialidad ]]<=7),\"Media\",IF(Tabla2[[#This Row],[Disponibilidad]]+Tabla2[[#This Row],[Integridad]]+Tabla2[[#This Row],[Confidencialidad ]]>=8,\"Alta\",\"error\")))","v":"Baja"}]
["",null,null,null,null,null,null,null,null,null,null,null,null,null,null,null,null,null,null,null,null,null,null,null,null,{"$f":"IF((Tabla2[[#This Row],[Disponibilidad]]+Tabla2[[#This Row],[Integridad]]+Tabla2[[#This Row],[Confidencialidad ]]<=4),\"Baja\",IF(AND(Tabla2[[#This Row],[Disponibilidad]]+Tabla2[[#This Row],[Integridad]]+Tabla2[[#This Row],[Confidencialidad ]]>=5,Tabla2[[#This Row],[Disponibilidad]]+Tabla2[[#This Row],[Integridad]]+Tabla2[[#This Row],[Confidencialidad ]]<=7),\"Media\",IF(Tabla2[[#This Row],[Disponibilidad]]+Tabla2[[#This Row],[Integridad]]+Tabla2[[#This Row],[Confidencialidad ]]>=8,\"Alta\",\"error\")))","v":"Baja"}]
["",null,null,null,null,null,null,null,null,null,null,null,null,null,null,null,null,null,null,null,null,null,null,null,null,{"$f":"IF((Tabla2[[#This Row],[Disponibilidad]]+Tabla2[[#This Row],[Integridad]]+Tabla2[[#This Row],[Confidencialidad ]]<=4),\"Baja\",IF(AND(Tabla2[[#This Row],[Disponibilidad]]+Tabla2[[#This Row],[Integridad]]+Tabla2[[#This Row],[Confidencialidad ]]>=5,Tabla2[[#This Row],[Disponibilidad]]+Tabla2[[#This Row],[Integridad]]+Tabla2[[#This Row],[Confidencialidad ]]<=7),\"Media\",IF(Tabla2[[#This Row],[Disponibilidad]]+Tabla2[[#This Row],[Integridad]]+Tabla2[[#This Row],[Confidencialidad ]]>=8,\"Alta\",\"error\")))","v":"Baja"}]
["",null,null,null,null,null,null,null,null,null,null,null,null,null,null,null,null,null,null,null,null,null,null,null,null,{"$f":"IF((Tabla2[[#This Row],[Disponibilidad]]+Tabla2[[#This Row],[Integridad]]+Tabla2[[#This Row],[Confidencialidad ]]<=4),\"Baja\",IF(AND(Tabla2[[#This Row],[Disponibilidad]]+Tabla2[[#This Row],[Integridad]]+Tabla2[[#This Row],[Confidencialidad ]]>=5,Tabla2[[#This Row],[Disponibilidad]]+Tabla2[[#This Row],[Integridad]]+Tabla2[[#This Row],[Confidencialidad ]]<=7),\"Media\",IF(Tabla2[[#This Row],[Disponibilidad]]+Tabla2[[#This Row],[Integridad]]+Tabla2[[#This Row],[Confidencialidad ]]>=8,\"Alta\",\"error\")))","v":"Baja"}]
["",null,null,null,null,null,null,null,null,null,null,null,null,null,null,null,null,null,null,null,null,null,null,null,null,{"$f":"IF((Tabla2[[#This Row],[Disponibilidad]]+Tabla2[[#This Row],[Integridad]]+Tabla2[[#This Row],[Confidencialidad ]]<=4),\"Baja\",IF(AND(Tabla2[[#This Row],[Disponibilidad]]+Tabla2[[#This Row],[Integridad]]+Tabla2[[#This Row],[Confidencialidad ]]>=5,Tabla2[[#This Row],[Disponibilidad]]+Tabla2[[#This Row],[Integridad]]+Tabla2[[#This Row],[Confidencialidad ]]<=7),\"Media\",IF(Tabla2[[#This Row],[Disponibilidad]]+Tabla2[[#This Row],[Integridad]]+Tabla2[[#This Row],[Confidencialidad ]]>=8,\"Alta\",\"error\")))","v":"Baja"}]
["",null,null,null,null,null,null,null,null,null,null,null,null,null,null,null,null,null,null,null,null,null,null,null,null,{"$f":"IF((Tabla2[[#This Row],[Disponibilidad]]+Tabla2[[#This Row],[Integridad]]+Tabla2[[#This Row],[Confidencialidad ]]<=4),\"Baja\",IF(AND(Tabla2[[#This Row],[Disponibilidad]]+Tabla2[[#This Row],[Integridad]]+Tabla2[[#This Row],[Confidencialidad ]]>=5,Tabla2[[#This Row],[Disponibilidad]]+Tabla2[[#This Row],[Integridad]]+Tabla2[[#This Row],[Confidencialidad ]]<=7),\"Media\",IF(Tabla2[[#This Row],[Disponibilidad]]+Tabla2[[#This Row],[Integridad]]+Tabla2[[#This Row],[Confidencialidad ]]>=8,\"Alta\",\"error\")))","v":"Baja"}]
["",null,null,null,null,null,null,null,null,null,null,null,null,null,null,null,null,null,null,null,null,null,null,null,null,{"$f":"IF((Tabla2[[#This Row],[Disponibilidad]]+Tabla2[[#This Row],[Integridad]]+Tabla2[[#This Row],[Confidencialidad ]]<=4),\"Baja\",IF(AND(Tabla2[[#This Row],[Disponibilidad]]+Tabla2[[#This Row],[Integridad]]+Tabla2[[#This Row],[Confidencialidad ]]>=5,Tabla2[[#This Row],[Disponibilidad]]+Tabla2[[#This Row],[Integridad]]+Tabla2[[#This Row],[Confidencialidad ]]<=7),\"Media\",IF(Tabla2[[#This Row],[Disponibilidad]]+Tabla2[[#This Row],[Integridad]]+Tabla2[[#This Row],[Confidencialidad ]]>=8,\"Alta\",\"error\")))","v":"Baja"}]
["",null,null,null,null,null,null,null,null,null,null,null,null,null,null,null,null,null,null,null,null,null,null,null,null,{"$f":"IF((Tabla2[[#This Row],[Disponibilidad]]+Tabla2[[#This Row],[Integridad]]+Tabla2[[#This Row],[Confidencialidad ]]<=4),\"Baja\",IF(AND(Tabla2[[#This Row],[Disponibilidad]]+Tabla2[[#This Row],[Integridad]]+Tabla2[[#This Row],[Confidencialidad ]]>=5,Tabla2[[#This Row],[Disponibilidad]]+Tabla2[[#This Row],[Integridad]]+Tabla2[[#This Row],[Confidencialidad ]]<=7),\"Media\",IF(Tabla2[[#This Row],[Disponibilidad]]+Tabla2[[#This Row],[Integridad]]+Tabla2[[#This Row],[Confidencialidad ]]>=8,\"Alta\",\"error\")))","v":"Baja"}]
["",null,null,null,null,null,null,null,null,null,null,null,null,null,null,null,null,null,null,null,null,null,null,null,null,{"$f":"IF((Tabla2[[#This Row],[Disponibilidad]]+Tabla2[[#This Row],[Integridad]]+Tabla2[[#This Row],[Confidencialidad ]]<=4),\"Baja\",IF(AND(Tabla2[[#This Row],[Disponibilidad]]+Tabla2[[#This Row],[Integridad]]+Tabla2[[#This Row],[Confidencialidad ]]>=5,Tabla2[[#This Row],[Disponibilidad]]+Tabla2[[#This Row],[Integridad]]+Tabla2[[#This Row],[Confidencialidad ]]<=7),\"Media\",IF(Tabla2[[#This Row],[Disponibilidad]]+Tabla2[[#This Row],[Integridad]]+Tabla2[[#This Row],[Confidencialidad ]]>=8,\"Alta\",\"error\")))","v":"Baja"}]
["",null,null,null,null,null,null,null,null,null,null,null,null,null,null,null,null,null,null,null,null,null,null,null,null,{"$f":"IF((Tabla2[[#This Row],[Disponibilidad]]+Tabla2[[#This Row],[Integridad]]+Tabla2[[#This Row],[Confidencialidad ]]<=4),\"Baja\",IF(AND(Tabla2[[#This Row],[Disponibilidad]]+Tabla2[[#This Row],[Integridad]]+Tabla2[[#This Row],[Confidencialidad ]]>=5,Tabla2[[#This Row],[Disponibilidad]]+Tabla2[[#This Row],[Integridad]]+Tabla2[[#This Row],[Confidencialidad ]]<=7),\"Media\",IF(Tabla2[[#This Row],[Disponibilidad]]+Tabla2[[#This Row],[Integridad]]+Tabla2[[#This Row],[Confidencialidad ]]>=8,\"Alta\",\"error\")))","v":"Baja"}]
["",null,null,null,null,null,null,null,null,null,null,null,null,null,null,null,null,null,null,null,null,null,null,null,null,{"$f":"IF((Tabla2[[#This Row],[Disponibilidad]]+Tabla2[[#This Row],[Integridad]]+Tabla2[[#This Row],[Confidencialidad ]]<=4),\"Baja\",IF(AND(Tabla2[[#This Row],[Disponibilidad]]+Tabla2[[#This Row],[Integridad]]+Tabla2[[#This Row],[Confidencialidad ]]>=5,Tabla2[[#This Row],[Disponibilidad]]+Tabla2[[#This Row],[Integridad]]+Tabla2[[#This Row],[Confidencialidad ]]<=7),\"Media\",IF(Tabla2[[#This Row],[Disponibilidad]]+Tabla2[[#This Row],[Integridad]]+Tabla2[[#This Row],[Confidencialidad ]]>=8,\"Alta\",\"error\")))","v":"Baja"}]
["",null,null,null,null,null,null,null,null,null,null,null,null,null,null,null,null,null,null,null,null,null,null,null,null,{"$f":"IF((Tabla2[[#This Row],[Disponibilidad]]+Tabla2[[#This Row],[Integridad]]+Tabla2[[#This Row],[Confidencialidad ]]<=4),\"Baja\",IF(AND(Tabla2[[#This Row],[Disponibilidad]]+Tabla2[[#This Row],[Integridad]]+Tabla2[[#This Row],[Confidencialidad ]]>=5,Tabla2[[#This Row],[Disponibilidad]]+Tabla2[[#This Row],[Integridad]]+Tabla2[[#This Row],[Confidencialidad ]]<=7),\"Media\",IF(Tabla2[[#This Row],[Disponibilidad]]+Tabla2[[#This Row],[Integridad]]+Tabla2[[#This Row],[Confidencialidad ]]>=8,\"Alta\",\"error\")))","v":"Baja"}]
["",null,null,null,null,null,null,null,null,null,null,null,null,null,null,null,null,null,null,null,null,null,null,null,null,{"$f":"IF((Tabla2[[#This Row],[Disponibilidad]]+Tabla2[[#This Row],[Integridad]]+Tabla2[[#This Row],[Confidencialidad ]]<=4),\"Baja\",IF(AND(Tabla2[[#This Row],[Disponibilidad]]+Tabla2[[#This Row],[Integridad]]+Tabla2[[#This Row],[Confidencialidad ]]>=5,Tabla2[[#This Row],[Disponibilidad]]+Tabla2[[#This Row],[Integridad]]+Tabla2[[#This Row],[Confidencialidad ]]<=7),\"Media\",IF(Tabla2[[#This Row],[Disponibilidad]]+Tabla2[[#This Row],[Integridad]]+Tabla2[[#This Row],[Confidencialidad ]]>=8,\"Alta\",\"error\")))","v":"Baja"}]
["",null,null,null,null,null,null,null,null,null,null,null,null,null,null,null,null,null,null,null,null,null,null,null,null,{"$f":"IF((Tabla2[[#This Row],[Disponibilidad]]+Tabla2[[#This Row],[Integridad]]+Tabla2[[#This Row],[Confidencialidad ]]<=4),\"Baja\",IF(AND(Tabla2[[#This Row],[Disponibilidad]]+Tabla2[[#This Row],[Integridad]]+Tabla2[[#This Row],[Confidencialidad ]]>=5,Tabla2[[#This Row],[Disponibilidad]]+Tabla2[[#This Row],[Integridad]]+Tabla2[[#This Row],[Confidencialidad ]]<=7),\"Media\",IF(Tabla2[[#This Row],[Disponibilidad]]+Tabla2[[#This Row],[Integridad]]+Tabla2[[#This Row],[Confidencialidad ]]>=8,\"Alta\",\"error\")))","v":"Baja"}]
["",null,null,null,null,null,null,null,null,null,null,null,null,null,null,null,null,null,null,null,null,null,null,null,null,{"$f":"IF((Tabla2[[#This Row],[Disponibilidad]]+Tabla2[[#This Row],[Integridad]]+Tabla2[[#This Row],[Confidencialidad ]]<=4),\"Baja\",IF(AND(Tabla2[[#This Row],[Disponibilidad]]+Tabla2[[#This Row],[Integridad]]+Tabla2[[#This Row],[Confidencialidad ]]>=5,Tabla2[[#This Row],[Disponibilidad]]+Tabla2[[#This Row],[Integridad]]+Tabla2[[#This Row],[Confidencialidad ]]<=7),\"Media\",IF(Tabla2[[#This Row],[Disponibilidad]]+Tabla2[[#This Row],[Integridad]]+Tabla2[[#This Row],[Confidencialidad ]]>=8,\"Alta\",\"error\")))","v":"Baja"}]
["",null,null,null,null,null,null,null,null,null,null,null,null,null,null,null,null,null,null,null,null,null,null,null,null,{"$f":"IF((Tabla2[[#This Row],[Disponibilidad]]+Tabla2[[#This Row],[Integridad]]+Tabla2[[#This Row],[Confidencialidad ]]<=4),\"Baja\",IF(AND(Tabla2[[#This Row],[Disponibilidad]]+Tabla2[[#This Row],[Integridad]]+Tabla2[[#This Row],[Confidencialidad ]]>=5,Tabla2[[#This Row],[Disponibilidad]]+Tabla2[[#This Row],[Integridad]]+Tabla2[[#This Row],[Confidencialidad ]]<=7),\"Media\",IF(Tabla2[[#This Row],[Disponibilidad]]+Tabla2[[#This Row],[Integridad]]+Tabla2[[#This Row],[Confidencialidad ]]>=8,\"Alta\",\"error\")))","v":"Baja"}]
["",null,null,null,null,null,null,null,null,null,null,null,null,null,null,null,null,null,null,null,null,null,null,null,null,{"$f":"IF((Tabla2[[#This Row],[Disponibilidad]]+Tabla2[[#This Row],[Integridad]]+Tabla2[[#This Row],[Confidencialidad ]]<=4),\"Baja\",IF(AND(Tabla2[[#This Row],[Disponibilidad]]+Tabla2[[#This Row],[Integridad]]+Tabla2[[#This Row],[Confidencialidad ]]>=5,Tabla2[[#This Row],[Disponibilidad]]+Tabla2[[#This Row],[Integridad]]+Tabla2[[#This Row],[Confidencialidad ]]<=7),\"Media\",IF(Tabla2[[#This Row],[Disponibilidad]]+Tabla2[[#This Row],[Integridad]]+Tabla2[[#This Row],[Confidencialidad ]]>=8,\"Alta\",\"error\")))","v":"Baja"}]
["",null,null,null,null,null,null,null,null,null,null,null,null,null,null,null,null,null,null,null,null,null,null,null,null,{"$f":"IF((Tabla2[[#This Row],[Disponibilidad]]+Tabla2[[#This Row],[Integridad]]+Tabla2[[#This Row],[Confidencialidad ]]<=4),\"Baja\",IF(AND(Tabla2[[#This Row],[Disponibilidad]]+Tabla2[[#This Row],[Integridad]]+Tabla2[[#This Row],[Confidencialidad ]]>=5,Tabla2[[#This Row],[Disponibilidad]]+Tabla2[[#This Row],[Integridad]]+Tabla2[[#This Row],[Confidencialidad ]]<=7),\"Media\",IF(Tabla2[[#This Row],[Disponibilidad]]+Tabla2[[#This Row],[Integridad]]+Tabla2[[#This Row],[Confidencialidad ]]>=8,\"Alta\",\"error\")))","v":"Baja"}]
["",null,null,null,null,null,null,null,null,null,null,null,null,null,null,null,null,null,null,null,null,null,null,null,null,{"$f":"IF((Tabla2[[#This Row],[Disponibilidad]]+Tabla2[[#This Row],[Integridad]]+Tabla2[[#This Row],[Confidencialidad ]]<=4),\"Baja\",IF(AND(Tabla2[[#This Row],[Disponibilidad]]+Tabla2[[#This Row],[Integridad]]+Tabla2[[#This Row],[Confidencialidad ]]>=5,Tabla2[[#This Row],[Disponibilidad]]+Tabla2[[#This Row],[Integridad]]+Tabla2[[#This Row],[Confidencialidad ]]<=7),\"Media\",IF(Tabla2[[#This Row],[Disponibilidad]]+Tabla2[[#This Row],[Integridad]]+Tabla2[[#This Row],[Confidencialidad ]]>=8,\"Alta\",\"error\")))","v":"Baja"}]
["",null,null,null,null,null,null,null,null,null,null,null,null,null,null,null,null,null,null,null,null,null,null,null,null,{"$f":"IF((Tabla2[[#This Row],[Disponibilidad]]+Tabla2[[#This Row],[Integridad]]+Tabla2[[#This Row],[Confidencialidad ]]<=4),\"Baja\",IF(AND(Tabla2[[#This Row],[Disponibilidad]]+Tabla2[[#This Row],[Integridad]]+Tabla2[[#This Row],[Confidencialidad ]]>=5,Tabla2[[#This Row],[Disponibilidad]]+Tabla2[[#This Row],[Integridad]]+Tabla2[[#This Row],[Confidencialidad ]]<=7),\"Media\",IF(Tabla2[[#This Row],[Disponibilidad]]+Tabla2[[#This Row],[Integridad]]+Tabla2[[#This Row],[Confidencialidad ]]>=8,\"Alta\",\"error\")))","v":"Baja"}]
["",null,null,null,null,null,null,null,null,null,null,null,null,null,null,null,null,null,null,null,null,null,null,null,null,{"$f":"IF((Tabla2[[#This Row],[Disponibilidad]]+Tabla2[[#This Row],[Integridad]]+Tabla2[[#This Row],[Confidencialidad ]]<=4),\"Baja\",IF(AND(Tabla2[[#This Row],[Disponibilidad]]+Tabla2[[#This Row],[Integridad]]+Tabla2[[#This Row],[Confidencialidad ]]>=5,Tabla2[[#This Row],[Disponibilidad]]+Tabla2[[#This Row],[Integridad]]+Tabla2[[#This Row],[Confidencialidad ]]<=7),\"Media\",IF(Tabla2[[#This Row],[Disponibilidad]]+Tabla2[[#This Row],[Integridad]]+Tabla2[[#This Row],[Confidencialidad ]]>=8,\"Alta\",\"error\")))","v":"Baja"}]
["",null,null,null,null,null,null,null,null,null,null,null,null,null,null,null,null,null,null,null,null,null,null,null,null,{"$f":"IF((Tabla2[[#This Row],[Disponibilidad]]+Tabla2[[#This Row],[Integridad]]+Tabla2[[#This Row],[Confidencialidad ]]<=4),\"Baja\",IF(AND(Tabla2[[#This Row],[Disponibilidad]]+Tabla2[[#This Row],[Integridad]]+Tabla2[[#This Row],[Confidencialidad ]]>=5,Tabla2[[#This Row],[Disponibilidad]]+Tabla2[[#This Row],[Integridad]]+Tabla2[[#This Row],[Confidencialidad ]]<=7),\"Media\",IF(Tabla2[[#This Row],[Disponibilidad]]+Tabla2[[#This Row],[Integridad]]+Tabla2[[#This Row],[Confidencialidad ]]>=8,\"Alta\",\"error\")))","v":"Baja"}]
["",null,null,null,null,null,null,null,null,null,null,null,null,null,null,null,null,null,null,null,null,null,null,null,null,{"$f":"IF((Tabla2[[#This Row],[Disponibilidad]]+Tabla2[[#This Row],[Integridad]]+Tabla2[[#This Row],[Confidencialidad ]]<=4),\"Baja\",IF(AND(Tabla2[[#This Row],[Disponibilidad]]+Tabla2[[#This Row],[Integridad]]+Tabla2[[#This Row],[Confidencialidad ]]>=5,Tabla2[[#This Row],[Disponibilidad]]+Tabla2[[#This Row],[Integridad]]+Tabla2[[#This Row],[Confidencialidad ]]<=7),\"Media\",IF(Tabla2[[#This Row],[Disponibilidad]]+Tabla2[[#This Row],[Integridad]]+Tabla2[[#This Row],[Confidencialidad ]]>=8,\"Alta\",\"error\")))","v":"Baja"}]
["",null,null,null,null,null,null,null,null,null,null,null,null,null,null,null,null,null,null,null,null,null,null,null,null,{"$f":"IF((Tabla2[[#This Row],[Disponibilidad]]+Tabla2[[#This Row],[Integridad]]+Tabla2[[#This Row],[Confidencialidad ]]<=4),\"Baja\",IF(AND(Tabla2[[#This Row],[Disponibilidad]]+Tabla2[[#This Row],[Integridad]]+Tabla2[[#This Row],[Confidencialidad ]]>=5,Tabla2[[#This Row],[Disponibilidad]]+Tabla2[[#This Row],[Integridad]]+Tabla2[[#This Row],[Confidencialidad ]]<=7),\"Media\",IF(Tabla2[[#This Row],[Disponibilidad]]+Tabla2[[#This Row],[Integridad]]+Tabla2[[#This Row],[Confidencialidad ]]>=8,\"Alta\",\"error\")))","v":"Baja"}]
["",null,null,null,null,null,null,null,null,null,null,null,null,null,null,null,null,null,null,null,null,null,null,null,null,{"$f":"IF((Tabla2[[#This Row],[Disponibilidad]]+Tabla2[[#This Row],[Integridad]]+Tabla2[[#This Row],[Confidencialidad ]]<=4),\"Baja\",IF(AND(Tabla2[[#This Row],[Disponibilidad]]+Tabla2[[#This Row],[Integridad]]+Tabla2[[#This Row],[Confidencialidad ]]>=5,Tabla2[[#This Row],[Disponibilidad]]+Tabla2[[#This Row],[Integridad]]+Tabla2[[#This Row],[Confidencialidad ]]<=7),\"Media\",IF(Tabla2[[#This Row],[Disponibilidad]]+Tabla2[[#This Row],[Integridad]]+Tabla2[[#This Row],[Confidencialidad ]]>=8,\"Alta\",\"error\")))","v":"Baja"}]
["",null,null,null,null,null,null,null,null,null,null,null,null,null,null,null,null,null,null,null,null,null,null,null,null,{"$f":"IF((Tabla2[[#This Row],[Disponibilidad]]+Tabla2[[#This Row],[Integridad]]+Tabla2[[#This Row],[Confidencialidad ]]<=4),\"Baja\",IF(AND(Tabla2[[#This Row],[Disponibilidad]]+Tabla2[[#This Row],[Integridad]]+Tabla2[[#This Row],[Confidencialidad ]]>=5,Tabla2[[#This Row],[Disponibilidad]]+Tabla2[[#This Row],[Integridad]]+Tabla2[[#This Row],[Confidencialidad ]]<=7),\"Media\",IF(Tabla2[[#This Row],[Disponibilidad]]+Tabla2[[#This Row],[Integridad]]+Tabla2[[#This Row],[Confidencialidad ]]>=8,\"Alta\",\"error\")))","v":"Baja"}]
["",null,null,null,null,null,null,null,null,null,null,null,null,null,null,null,null,null,null,null,null,null,null,null,null,{"$f":"IF((Tabla2[[#This Row],[Disponibilidad]]+Tabla2[[#This Row],[Integridad]]+Tabla2[[#This Row],[Confidencialidad ]]<=4),\"Baja\",IF(AND(Tabla2[[#This Row],[Disponibilidad]]+Tabla2[[#This Row],[Integridad]]+Tabla2[[#This Row],[Confidencialidad ]]>=5,Tabla2[[#This Row],[Disponibilidad]]+Tabla2[[#This Row],[Integridad]]+Tabla2[[#This Row],[Confidencialidad ]]<=7),\"Media\",IF(Tabla2[[#This Row],[Disponibilidad]]+Tabla2[[#This Row],[Integridad]]+Tabla2[[#This Row],[Confidencialidad ]]>=8,\"Alta\",\"error\")))","v":"Baja"}]
["",null,null,null,null,null,null,null,null,null,null,null,null,null,null,null,null,null,null,null,null,null,null,null,null,{"$f":"IF((Tabla2[[#This Row],[Disponibilidad]]+Tabla2[[#This Row],[Integridad]]+Tabla2[[#This Row],[Confidencialidad ]]<=4),\"Baja\",IF(AND(Tabla2[[#This Row],[Disponibilidad]]+Tabla2[[#This Row],[Integridad]]+Tabla2[[#This Row],[Confidencialidad ]]>=5,Tabla2[[#This Row],[Disponibilidad]]+Tabla2[[#This Row],[Integridad]]+Tabla2[[#This Row],[Confidencialidad ]]<=7),\"Media\",IF(Tabla2[[#This Row],[Disponibilidad]]+Tabla2[[#This Row],[Integridad]]+Tabla2[[#This Row],[Confidencialidad ]]>=8,\"Alta\",\"error\")))","v":"Baja"}]
["",null,null,null,null,null,null,null,null,null,null,null,null,null,null,null,null,null,null,null,null,null,null,null,null,{"$f":"IF((Tabla2[[#This Row],[Disponibilidad]]+Tabla2[[#This Row],[Integridad]]+Tabla2[[#This Row],[Confidencialidad ]]<=4),\"Baja\",IF(AND(Tabla2[[#This Row],[Disponibilidad]]+Tabla2[[#This Row],[Integridad]]+Tabla2[[#This Row],[Confidencialidad ]]>=5,Tabla2[[#This Row],[Disponibilidad]]+Tabla2[[#This Row],[Integridad]]+Tabla2[[#This Row],[Confidencialidad ]]<=7),\"Media\",IF(Tabla2[[#This Row],[Disponibilidad]]+Tabla2[[#This Row],[Integridad]]+Tabla2[[#This Row],[Confidencialidad ]]>=8,\"Alta\",\"error\")))","v":"Baja"}]
["",null,null,null,null,null,null,null,null,null,null,null,null,null,null,null,null,null,null,null,null,null,null,null,null,{"$f":"IF((Tabla2[[#This Row],[Disponibilidad]]+Tabla2[[#This Row],[Integridad]]+Tabla2[[#This Row],[Confidencialidad ]]<=4),\"Baja\",IF(AND(Tabla2[[#This Row],[Disponibilidad]]+Tabla2[[#This Row],[Integridad]]+Tabla2[[#This Row],[Confidencialidad ]]>=5,Tabla2[[#This Row],[Disponibilidad]]+Tabla2[[#This Row],[Integridad]]+Tabla2[[#This Row],[Confidencialidad ]]<=7),\"Media\",IF(Tabla2[[#This Row],[Disponibilidad]]+Tabla2[[#This Row],[Integridad]]+Tabla2[[#This Row],[Confidencialidad ]]>=8,\"Alta\",\"error\")))","v":"Baja"}]
["",null,null,null,null,null,null,null,null,null,null,null,null,null,null,null,null,null,null,null,null,null,null,null,null,{"$f":"IF((Tabla2[[#This Row],[Disponibilidad]]+Tabla2[[#This Row],[Integridad]]+Tabla2[[#This Row],[Confidencialidad ]]<=4),\"Baja\",IF(AND(Tabla2[[#This Row],[Disponibilidad]]+Tabla2[[#This Row],[Integridad]]+Tabla2[[#This Row],[Confidencialidad ]]>=5,Tabla2[[#This Row],[Disponibilidad]]+Tabla2[[#This Row],[Integridad]]+Tabla2[[#This Row],[Confidencialidad ]]<=7),\"Media\",IF(Tabla2[[#This Row],[Disponibilidad]]+Tabla2[[#This Row],[Integridad]]+Tabla2[[#This Row],[Confidencialidad ]]>=8,\"Alta\",\"error\")))","v":"Baja"}]
["",null,null,null,null,null,null,null,null,null,null,null,null,null,null,null,null,null,null,null,null,null,null,null,null,{"$f":"IF((Tabla2[[#This Row],[Disponibilidad]]+Tabla2[[#This Row],[Integridad]]+Tabla2[[#This Row],[Confidencialidad ]]<=4),\"Baja\",IF(AND(Tabla2[[#This Row],[Disponibilidad]]+Tabla2[[#This Row],[Integridad]]+Tabla2[[#This Row],[Confidencialidad ]]>=5,Tabla2[[#This Row],[Disponibilidad]]+Tabla2[[#This Row],[Integridad]]+Tabla2[[#This Row],[Confidencialidad ]]<=7),\"Media\",IF(Tabla2[[#This Row],[Disponibilidad]]+Tabla2[[#This Row],[Integridad]]+Tabla2[[#This Row],[Confidencialidad ]]>=8,\"Alta\",\"error\")))","v":"Baja"}]
["",null,null,null,null,null,null,null,null,null,null,null,null,null,null,null,null,null,null,null,null,null,null,null,null,{"$f":"IF((Tabla2[[#This Row],[Disponibilidad]]+Tabla2[[#This Row],[Integridad]]+Tabla2[[#This Row],[Confidencialidad ]]<=4),\"Baja\",IF(AND(Tabla2[[#This Row],[Disponibilidad]]+Tabla2[[#This Row],[Integridad]]+Tabla2[[#This Row],[Confidencialidad ]]>=5,Tabla2[[#This Row],[Disponibilidad]]+Tabla2[[#This Row],[Integridad]]+Tabla2[[#This Row],[Confidencialidad ]]<=7),\"Media\",IF(Tabla2[[#This Row],[Disponibilidad]]+Tabla2[[#This Row],[Integridad]]+Tabla2[[#This Row],[Confidencialidad ]]>=8,\"Alta\",\"error\")))","v":"Baja"}]
["",null,null,null,null,null,null,null,null,null,null,null,null,null,null,null,null,null,null,null,null,null,null,null,null,{"$f":"IF((Tabla2[[#This Row],[Disponibilidad]]+Tabla2[[#This Row],[Integridad]]+Tabla2[[#This Row],[Confidencialidad ]]<=4),\"Baja\",IF(AND(Tabla2[[#This Row],[Disponibilidad]]+Tabla2[[#This Row],[Integridad]]+Tabla2[[#This Row],[Confidencialidad ]]>=5,Tabla2[[#This Row],[Disponibilidad]]+Tabla2[[#This Row],[Integridad]]+Tabla2[[#This Row],[Confidencialidad ]]<=7),\"Media\",IF(Tabla2[[#This Row],[Disponibilidad]]+Tabla2[[#This Row],[Integridad]]+Tabla2[[#This Row],[Confidencialidad ]]>=8,\"Alta\",\"error\")))","v":"Baja"}]
["",null,null,null,null,null,null,null,null,null,null,null,null,null,null,null,null,null,null,null,null,null,null,null,null,{"$f":"IF((Tabla2[[#This Row],[Disponibilidad]]+Tabla2[[#This Row],[Integridad]]+Tabla2[[#This Row],[Confidencialidad ]]<=4),\"Baja\",IF(AND(Tabla2[[#This Row],[Disponibilidad]]+Tabla2[[#This Row],[Integridad]]+Tabla2[[#This Row],[Confidencialidad ]]>=5,Tabla2[[#This Row],[Disponibilidad]]+Tabla2[[#This Row],[Integridad]]+Tabla2[[#This Row],[Confidencialidad ]]<=7),\"Media\",IF(Tabla2[[#This Row],[Disponibilidad]]+Tabla2[[#This Row],[Integridad]]+Tabla2[[#This Row],[Confidencialidad ]]>=8,\"Alta\",\"error\")))","v":"Baja"}]
["",null,null,null,null,null,null,null,null,null,null,null,null,null,null,null,null,null,null,null,null,null,null,null,null,{"$f":"IF((Tabla2[[#This Row],[Disponibilidad]]+Tabla2[[#This Row],[Integridad]]+Tabla2[[#This Row],[Confidencialidad ]]<=4),\"Baja\",IF(AND(Tabla2[[#This Row],[Disponibilidad]]+Tabla2[[#This Row],[Integridad]]+Tabla2[[#This Row],[Confidencialidad ]]>=5,Tabla2[[#This Row],[Disponibilidad]]+Tabla2[[#This Row],[Integridad]]+Tabla2[[#This Row],[Confidencialidad ]]<=7),\"Media\",IF(Tabla2[[#This Row],[Disponibilidad]]+Tabla2[[#This Row],[Integridad]]+Tabla2[[#This Row],[Confidencialidad ]]>=8,\"Alta\",\"error\")))","v":"Baja"}]
["",null,null,null,null,null,null,null,null,null,null,null,null,null,null,null,null,null,null,null,null,null,null,null,null,{"$f":"IF((Tabla2[[#This Row],[Disponibilidad]]+Tabla2[[#This Row],[Integridad]]+Tabla2[[#This Row],[Confidencialidad ]]<=4),\"Baja\",IF(AND(Tabla2[[#This Row],[Disponibilidad]]+Tabla2[[#This Row],[Integridad]]+Tabla2[[#This Row],[Confidencialidad ]]>=5,Tabla2[[#This Row],[Disponibilidad]]+Tabla2[[#This Row],[Integridad]]+Tabla2[[#This Row],[Confidencialidad ]]<=7),\"Media\",IF(Tabla2[[#This Row],[Disponibilidad]]+Tabla2[[#This Row],[Integridad]]+Tabla2[[#This Row],[Confidencialidad ]]>=8,\"Alta\",\"error\")))","v":"Baja"}]
["",null,null,null,null,null,null,null,null,null,null,null,null,null,null,null,null,null,null,null,null,null,null,null,null,{"$f":"IF((Tabla2[[#This Row],[Disponibilidad]]+Tabla2[[#This Row],[Integridad]]+Tabla2[[#This Row],[Confidencialidad ]]<=4),\"Baja\",IF(AND(Tabla2[[#This Row],[Disponibilidad]]+Tabla2[[#This Row],[Integridad]]+Tabla2[[#This Row],[Confidencialidad ]]>=5,Tabla2[[#This Row],[Disponibilidad]]+Tabla2[[#This Row],[Integridad]]+Tabla2[[#This Row],[Confidencialidad ]]<=7),\"Media\",IF(Tabla2[[#This Row],[Disponibilidad]]+Tabla2[[#This Row],[Integridad]]+Tabla2[[#This Row],[Confidencialidad ]]>=8,\"Alta\",\"error\")))","v":"Baja"}]
["",null,null,null,null,null,null,null,null,null,null,null,null,null,null,null,null,null,null,null,null,null,null,null,null,{"$f":"IF((Tabla2[[#This Row],[Disponibilidad]]+Tabla2[[#This Row],[Integridad]]+Tabla2[[#This Row],[Confidencialidad ]]<=4),\"Baja\",IF(AND(Tabla2[[#This Row],[Disponibilidad]]+Tabla2[[#This Row],[Integridad]]+Tabla2[[#This Row],[Confidencialidad ]]>=5,Tabla2[[#This Row],[Disponibilidad]]+Tabla2[[#This Row],[Integridad]]+Tabla2[[#This Row],[Confidencialidad ]]<=7),\"Media\",IF(Tabla2[[#This Row],[Disponibilidad]]+Tabla2[[#This Row],[Integridad]]+Tabla2[[#This Row],[Confidencialidad ]]>=8,\"Alta\",\"error\")))","v":"Baja"}]
["",null,null,null,null,null,null,null,null,null,null,null,null,null,null,null,null,null,null,null,null,null,null,null,null,{"$f":"IF((Tabla2[[#This Row],[Disponibilidad]]+Tabla2[[#This Row],[Integridad]]+Tabla2[[#This Row],[Confidencialidad ]]<=4),\"Baja\",IF(AND(Tabla2[[#This Row],[Disponibilidad]]+Tabla2[[#This Row],[Integridad]]+Tabla2[[#This Row],[Confidencialidad ]]>=5,Tabla2[[#This Row],[Disponibilidad]]+Tabla2[[#This Row],[Integridad]]+Tabla2[[#This Row],[Confidencialidad ]]<=7),\"Media\",IF(Tabla2[[#This Row],[Disponibilidad]]+Tabla2[[#This Row],[Integridad]]+Tabla2[[#This Row],[Confidencialidad ]]>=8,\"Alta\",\"error\")))","v":"Baja"}]
["",null,null,null,null,null,null,null,null,null,null,null,null,null,null,null,null,null,null,null,null,null,null,null,null,{"$f":"IF((Tabla2[[#This Row],[Disponibilidad]]+Tabla2[[#This Row],[Integridad]]+Tabla2[[#This Row],[Confidencialidad ]]<=4),\"Baja\",IF(AND(Tabla2[[#This Row],[Disponibilidad]]+Tabla2[[#This Row],[Integridad]]+Tabla2[[#This Row],[Confidencialidad ]]>=5,Tabla2[[#This Row],[Disponibilidad]]+Tabla2[[#This Row],[Integridad]]+Tabla2[[#This Row],[Confidencialidad ]]<=7),\"Media\",IF(Tabla2[[#This Row],[Disponibilidad]]+Tabla2[[#This Row],[Integridad]]+Tabla2[[#This Row],[Confidencialidad ]]>=8,\"Alta\",\"error\")))","v":"Baja"}]
["",null,null,null,null,null,null,null,null,null,null,null,null,null,null,null,null,null,null,null,null,null,null,null,null,{"$f":"IF((Tabla2[[#This Row],[Disponibilidad]]+Tabla2[[#This Row],[Integridad]]+Tabla2[[#This Row],[Confidencialidad ]]<=4),\"Baja\",IF(AND(Tabla2[[#This Row],[Disponibilidad]]+Tabla2[[#This Row],[Integridad]]+Tabla2[[#This Row],[Confidencialidad ]]>=5,Tabla2[[#This Row],[Disponibilidad]]+Tabla2[[#This Row],[Integridad]]+Tabla2[[#This Row],[Confidencialidad ]]<=7),\"Media\",IF(Tabla2[[#This Row],[Disponibilidad]]+Tabla2[[#This Row],[Integridad]]+Tabla2[[#This Row],[Confidencialidad ]]>=8,\"Alta\",\"error\")))","v":"Baja"}]
["",null,null,null,null,null,null,null,null,null,null,null,null,null,null,null,null,null,null,null,null,null,null,null,null,{"$f":"IF((Tabla2[[#This Row],[Disponibilidad]]+Tabla2[[#This Row],[Integridad]]+Tabla2[[#This Row],[Confidencialidad ]]<=4),\"Baja\",IF(AND(Tabla2[[#This Row],[Disponibilidad]]+Tabla2[[#This Row],[Integridad]]+Tabla2[[#This Row],[Confidencialidad ]]>=5,Tabla2[[#This Row],[Disponibilidad]]+Tabla2[[#This Row],[Integridad]]+Tabla2[[#This Row],[Confidencialidad ]]<=7),\"Media\",IF(Tabla2[[#This Row],[Disponibilidad]]+Tabla2[[#This Row],[Integridad]]+Tabla2[[#This Row],[Confidencialidad ]]>=8,\"Alta\",\"error\")))","v":"Baja"}]
[{"$f":"IF(C136<>\"\",1,\"\")","v":""},null,null,null,null,null,null,null,null,null,null,null,null,null,null,null,null,null,null,null,null,null,null,null,null,{"$f":"IF((Tabla2[[#This Row],[Disponibilidad]]+Tabla2[[#This Row],[Integridad]]+Tabla2[[#This Row],[Confidencialidad ]]<=4),\"Baja\",IF(AND(Tabla2[[#This Row],[Disponibilidad]]+Tabla2[[#This Row],[Integridad]]+Tabla2[[#This Row],[Confidencialidad ]]>=5,Tabla2[[#This Row],[Disponibilidad]]+Tabla2[[#This Row],[Integridad]]+Tabla2[[#This Row],[Confidencialidad ]]<=7),\"Media\",IF(Tabla2[[#This Row],[Disponibilidad]]+Tabla2[[#This Row],[Integridad]]+Tabla2[[#This Row],[Confidencialidad ]]>=8,\"Alta\",\"error\")))","v":"Baja"}]
["",null,null,null,null,null,null,null,null,null,null,null,null,null,null,null,null,null,null,null,null,null,null,null,null,{"$f":"IF((Tabla2[[#This Row],[Disponibilidad]]+Tabla2[[#This Row],[Integridad]]+Tabla2[[#This Row],[Confidencialidad ]]<=4),\"Baja\",IF(AND(Tabla2[[#This Row],[Disponibilidad]]+Tabla2[[#This Row],[Integridad]]+Tabla2[[#This Row],[Confidencialidad ]]>=5,Tabla2[[#This Row],[Disponibilidad]]+Tabla2[[#This Row],[Integridad]]+Tabla2[[#This Row],[Confidencialidad ]]<=7),\"Media\",IF(Tabla2[[#This Row],[Disponibilidad]]+Tabla2[[#This Row],[Integridad]]+Tabla2[[#This Row],[Confidencialidad ]]>=8,\"Alta\",\"error\")))","v":"Baja"}]
["",null,null,null,null,null,null,null,null,null,null,null,null,null,null,null,null,null,null,null,null,null,null,null,null,{"$f":"IF((Tabla2[[#This Row],[Disponibilidad]]+Tabla2[[#This Row],[Integridad]]+Tabla2[[#This Row],[Confidencialidad ]]<=4),\"Baja\",IF(AND(Tabla2[[#This Row],[Disponibilidad]]+Tabla2[[#This Row],[Integridad]]+Tabla2[[#This Row],[Confidencialidad ]]>=5,Tabla2[[#This Row],[Disponibilidad]]+Tabla2[[#This Row],[Integridad]]+Tabla2[[#This Row],[Confidencialidad ]]<=7),\"Media\",IF(Tabla2[[#This Row],[Disponibilidad]]+Tabla2[[#This Row],[Integridad]]+Tabla2[[#This Row],[Confidencialidad ]]>=8,\"Alta\",\"error\")))","v":"Baja"}]
["",null,null,null,null,null,null,null,null,null,null,null,null,null,null,null,null,null,null,null,null,null,null,null,null,{"$f":"IF((Tabla2[[#This Row],[Disponibilidad]]+Tabla2[[#This Row],[Integridad]]+Tabla2[[#This Row],[Confidencialidad ]]<=4),\"Baja\",IF(AND(Tabla2[[#This Row],[Disponibilidad]]+Tabla2[[#This Row],[Integridad]]+Tabla2[[#This Row],[Confidencialidad ]]>=5,Tabla2[[#This Row],[Disponibilidad]]+Tabla2[[#This Row],[Integridad]]+Tabla2[[#This Row],[Confidencialidad ]]<=7),\"Media\",IF(Tabla2[[#This Row],[Disponibilidad]]+Tabla2[[#This Row],[Integridad]]+Tabla2[[#This Row],[Confidencialidad ]]>=8,\"Alta\",\"error\")))","v":"Baja"}]
["",null,null,null,null,null,null,null,null,null,null,null,null,null,null,null,null,null,null,null,null,null,null,null,null,{"$f":"IF((Tabla2[[#This Row],[Disponibilidad]]+Tabla2[[#This Row],[Integridad]]+Tabla2[[#This Row],[Confidencialidad ]]<=4),\"Baja\",IF(AND(Tabla2[[#This Row],[Disponibilidad]]+Tabla2[[#This Row],[Integridad]]+Tabla2[[#This Row],[Confidencialidad ]]>=5,Tabla2[[#This Row],[Disponibilidad]]+Tabla2[[#This Row],[Integridad]]+Tabla2[[#This Row],[Confidencialidad ]]<=7),\"Media\",IF(Tabla2[[#This Row],[Disponibilidad]]+Tabla2[[#This Row],[Integridad]]+Tabla2[[#This Row],[Confidencialidad ]]>=8,\"Alta\",\"error\")))","v":"Baja"}]
["",null,null,null,null,null,null,null,null,null,null,null,null,null,null,null,null,null,null,null,null,null,null,null,null,{"$f":"IF((Tabla2[[#This Row],[Disponibilidad]]+Tabla2[[#This Row],[Integridad]]+Tabla2[[#This Row],[Confidencialidad ]]<=4),\"Baja\",IF(AND(Tabla2[[#This Row],[Disponibilidad]]+Tabla2[[#This Row],[Integridad]]+Tabla2[[#This Row],[Confidencialidad ]]>=5,Tabla2[[#This Row],[Disponibilidad]]+Tabla2[[#This Row],[Integridad]]+Tabla2[[#This Row],[Confidencialidad ]]<=7),\"Media\",IF(Tabla2[[#This Row],[Disponibilidad]]+Tabla2[[#This Row],[Integridad]]+Tabla2[[#This Row],[Confidencialidad ]]>=8,\"Alta\",\"error\")))","v":"Baja"}]
["",null,null,null,null,null,null,null,null,null,null,null,null,null,null,null,null,null,null,null,null,null,null,null,null,{"$f":"IF((Tabla2[[#This Row],[Disponibilidad]]+Tabla2[[#This Row],[Integridad]]+Tabla2[[#This Row],[Confidencialidad ]]<=4),\"Baja\",IF(AND(Tabla2[[#This Row],[Disponibilidad]]+Tabla2[[#This Row],[Integridad]]+Tabla2[[#This Row],[Confidencialidad ]]>=5,Tabla2[[#This Row],[Disponibilidad]]+Tabla2[[#This Row],[Integridad]]+Tabla2[[#This Row],[Confidencialidad ]]<=7),\"Media\",IF(Tabla2[[#This Row],[Disponibilidad]]+Tabla2[[#This Row],[Integridad]]+Tabla2[[#This Row],[Confidencialidad ]]>=8,\"Alta\",\"error\")))","v":"Baja"}]
["",null,null,null,null,null,null,null,null,null,null,null,null,null,null,null,null,null,null,null,null,null,null,null,null,{"$f":"IF((Tabla2[[#This Row],[Disponibilidad]]+Tabla2[[#This Row],[Integridad]]+Tabla2[[#This Row],[Confidencialidad ]]<=4),\"Baja\",IF(AND(Tabla2[[#This Row],[Disponibilidad]]+Tabla2[[#This Row],[Integridad]]+Tabla2[[#This Row],[Confidencialidad ]]>=5,Tabla2[[#This Row],[Disponibilidad]]+Tabla2[[#This Row],[Integridad]]+Tabla2[[#This Row],[Confidencialidad ]]<=7),\"Media\",IF(Tabla2[[#This Row],[Disponibilidad]]+Tabla2[[#This Row],[Integridad]]+Tabla2[[#This Row],[Confidencialidad ]]>=8,\"Alta\",\"error\")))","v":"Baja"}]
["",null,null,null,null,null,null,null,null,null,null,null,null,null,null,null,null,null,null,null,null,null,null,null,null,{"$f":"IF((Tabla2[[#This Row],[Disponibilidad]]+Tabla2[[#This Row],[Integridad]]+Tabla2[[#This Row],[Confidencialidad ]]<=4),\"Baja\",IF(AND(Tabla2[[#This Row],[Disponibilidad]]+Tabla2[[#This Row],[Integridad]]+Tabla2[[#This Row],[Confidencialidad ]]>=5,Tabla2[[#This Row],[Disponibilidad]]+Tabla2[[#This Row],[Integridad]]+Tabla2[[#This Row],[Confidencialidad ]]<=7),\"Media\",IF(Tabla2[[#This Row],[Disponibilidad]]+Tabla2[[#This Row],[Integridad]]+Tabla2[[#This Row],[Confidencialidad ]]>=8,\"Alta\",\"error\")))","v":"Baja"}]
["",null,null,null,null,null,null,null,null,null,null,null,null,null,null,null,null,null,null,null,null,null,null,null,null,{"$f":"IF((Tabla2[[#This Row],[Disponibilidad]]+Tabla2[[#This Row],[Integridad]]+Tabla2[[#This Row],[Confidencialidad ]]<=4),\"Baja\",IF(AND(Tabla2[[#This Row],[Disponibilidad]]+Tabla2[[#This Row],[Integridad]]+Tabla2[[#This Row],[Confidencialidad ]]>=5,Tabla2[[#This Row],[Disponibilidad]]+Tabla2[[#This Row],[Integridad]]+Tabla2[[#This Row],[Confidencialidad ]]<=7),\"Media\",IF(Tabla2[[#This Row],[Disponibilidad]]+Tabla2[[#This Row],[Integridad]]+Tabla2[[#This Row],[Confidencialidad ]]>=8,\"Alta\",\"error\")))","v":"Baja"}]
["",null,null,null,null,null,null,null,null,null,null,null,null,null,null,null,null,null,null,null,null,null,null,null,null,{"$f":"IF((Tabla2[[#This Row],[Disponibilidad]]+Tabla2[[#This Row],[Integridad]]+Tabla2[[#This Row],[Confidencialidad ]]<=4),\"Baja\",IF(AND(Tabla2[[#This Row],[Disponibilidad]]+Tabla2[[#This Row],[Integridad]]+Tabla2[[#This Row],[Confidencialidad ]]>=5,Tabla2[[#This Row],[Disponibilidad]]+Tabla2[[#This Row],[Integridad]]+Tabla2[[#This Row],[Confidencialidad ]]<=7),\"Media\",IF(Tabla2[[#This Row],[Disponibilidad]]+Tabla2[[#This Row],[Integridad]]+Tabla2[[#This Row],[Confidencialidad ]]>=8,\"Alta\",\"error\")))","v":"Baja"}]
["",null,null,null,null,null,null,null,null,null,null,null,null,null,null,null,null,null,null,null,null,null,null,null,null,{"$f":"IF((Tabla2[[#This Row],[Disponibilidad]]+Tabla2[[#This Row],[Integridad]]+Tabla2[[#This Row],[Confidencialidad ]]<=4),\"Baja\",IF(AND(Tabla2[[#This Row],[Disponibilidad]]+Tabla2[[#This Row],[Integridad]]+Tabla2[[#This Row],[Confidencialidad ]]>=5,Tabla2[[#This Row],[Disponibilidad]]+Tabla2[[#This Row],[Integridad]]+Tabla2[[#This Row],[Confidencialidad ]]<=7),\"Media\",IF(Tabla2[[#This Row],[Disponibilidad]]+Tabla2[[#This Row],[Integridad]]+Tabla2[[#This Row],[Confidencialidad ]]>=8,\"Alta\",\"error\")))","v":"Baja"}]
["",null,null,null,null,null,null,null,null,null,null,null,null,null,null,null,null,null,null,null,null,null,null,null,null,{"$f":"IF((Tabla2[[#This Row],[Disponibilidad]]+Tabla2[[#This Row],[Integridad]]+Tabla2[[#This Row],[Confidencialidad ]]<=4),\"Baja\",IF(AND(Tabla2[[#This Row],[Disponibilidad]]+Tabla2[[#This Row],[Integridad]]+Tabla2[[#This Row],[Confidencialidad ]]>=5,Tabla2[[#This Row],[Disponibilidad]]+Tabla2[[#This Row],[Integridad]]+Tabla2[[#This Row],[Confidencialidad ]]<=7),\"Media\",IF(Tabla2[[#This Row],[Disponibilidad]]+Tabla2[[#This Row],[Integridad]]+Tabla2[[#This Row],[Confidencialidad ]]>=8,\"Alta\",\"error\")))","v":"Baja"}]
["",null,null,null,null,null,null,null,null,null,null,null,null,null,null,null,null,null,null,null,null,null,null,null,null,{"$f":"IF((Tabla2[[#This Row],[Disponibilidad]]+Tabla2[[#This Row],[Integridad]]+Tabla2[[#This Row],[Confidencialidad ]]<=4),\"Baja\",IF(AND(Tabla2[[#This Row],[Disponibilidad]]+Tabla2[[#This Row],[Integridad]]+Tabla2[[#This Row],[Confidencialidad ]]>=5,Tabla2[[#This Row],[Disponibilidad]]+Tabla2[[#This Row],[Integridad]]+Tabla2[[#This Row],[Confidencialidad ]]<=7),\"Media\",IF(Tabla2[[#This Row],[Disponibilidad]]+Tabla2[[#This Row],[Integridad]]+Tabla2[[#This Row],[Confidencialidad ]]>=8,\"Alta\",\"error\")))","v":"Baja"}]
["",null,null,null,null,null,null,null,null,null,null,null,null,null,null,null,null,null,null,null,null,null,null,null,null,{"$f":"IF((Tabla2[[#This Row],[Disponibilidad]]+Tabla2[[#This Row],[Integridad]]+Tabla2[[#This Row],[Confidencialidad ]]<=4),\"Baja\",IF(AND(Tabla2[[#This Row],[Disponibilidad]]+Tabla2[[#This Row],[Integridad]]+Tabla2[[#This Row],[Confidencialidad ]]>=5,Tabla2[[#This Row],[Disponibilidad]]+Tabla2[[#This Row],[Integridad]]+Tabla2[[#This Row],[Confidencialidad ]]<=7),\"Media\",IF(Tabla2[[#This Row],[Disponibilidad]]+Tabla2[[#This Row],[Integridad]]+Tabla2[[#This Row],[Confidencialidad ]]>=8,\"Alta\",\"error\")))","v":"Baja"}]
["",null,null,null,null,null,null,null,null,null,null,null,null,null,null,null,null,null,null,null,null,null,null,null,null,{"$f":"IF((Tabla2[[#This Row],[Disponibilidad]]+Tabla2[[#This Row],[Integridad]]+Tabla2[[#This Row],[Confidencialidad ]]<=4),\"Baja\",IF(AND(Tabla2[[#This Row],[Disponibilidad]]+Tabla2[[#This Row],[Integridad]]+Tabla2[[#This Row],[Confidencialidad ]]>=5,Tabla2[[#This Row],[Disponibilidad]]+Tabla2[[#This Row],[Integridad]]+Tabla2[[#This Row],[Confidencialidad ]]<=7),\"Media\",IF(Tabla2[[#This Row],[Disponibilidad]]+Tabla2[[#This Row],[Integridad]]+Tabla2[[#This Row],[Confidencialidad ]]>=8,\"Alta\",\"error\")))","v":"Baja"}]
["",null,null,null,null,null,null,null,null,null,null,null,null,null,null,null,null,null,null,null,null,null,null,null,null,{"$f":"IF((Tabla2[[#This Row],[Disponibilidad]]+Tabla2[[#This Row],[Integridad]]+Tabla2[[#This Row],[Confidencialidad ]]<=4),\"Baja\",IF(AND(Tabla2[[#This Row],[Disponibilidad]]+Tabla2[[#This Row],[Integridad]]+Tabla2[[#This Row],[Confidencialidad ]]>=5,Tabla2[[#This Row],[Disponibilidad]]+Tabla2[[#This Row],[Integridad]]+Tabla2[[#This Row],[Confidencialidad ]]<=7),\"Media\",IF(Tabla2[[#This Row],[Disponibilidad]]+Tabla2[[#This Row],[Integridad]]+Tabla2[[#This Row],[Confidencialidad ]]>=8,\"Alta\",\"error\")))","v":"Baja"}]
["",null,null,null,null,null,null,null,null,null,null,null,null,null,null,null,null,null,null,null,null,null,null,null,null,{"$f":"IF((Tabla2[[#This Row],[Disponibilidad]]+Tabla2[[#This Row],[Integridad]]+Tabla2[[#This Row],[Confidencialidad ]]<=4),\"Baja\",IF(AND(Tabla2[[#This Row],[Disponibilidad]]+Tabla2[[#This Row],[Integridad]]+Tabla2[[#This Row],[Confidencialidad ]]>=5,Tabla2[[#This Row],[Disponibilidad]]+Tabla2[[#This Row],[Integridad]]+Tabla2[[#This Row],[Confidencialidad ]]<=7),\"Media\",IF(Tabla2[[#This Row],[Disponibilidad]]+Tabla2[[#This Row],[Integridad]]+Tabla2[[#This Row],[Confidencialidad ]]>=8,\"Alta\",\"error\")))","v":"Baja"}]
["",null,null,null,null,null,null,null,null,null,null,null,null,null,null,null,null,null,null,null,null,null,null,null,null,{"$f":"IF((Tabla2[[#This Row],[Disponibilidad]]+Tabla2[[#This Row],[Integridad]]+Tabla2[[#This Row],[Confidencialidad ]]<=4),\"Baja\",IF(AND(Tabla2[[#This Row],[Disponibilidad]]+Tabla2[[#This Row],[Integridad]]+Tabla2[[#This Row],[Confidencialidad ]]>=5,Tabla2[[#This Row],[Disponibilidad]]+Tabla2[[#This Row],[Integridad]]+Tabla2[[#This Row],[Confidencialidad ]]<=7),\"Media\",IF(Tabla2[[#This Row],[Disponibilidad]]+Tabla2[[#This Row],[Integridad]]+Tabla2[[#This Row],[Confidencialidad ]]>=8,\"Alta\",\"error\")))","v":"Baja"}]
["",null,null,null,null,null,null,null,null,null,null,null,null,null,null,null,null,null,null,null,null,null,null,null,null,{"$f":"IF((Tabla2[[#This Row],[Disponibilidad]]+Tabla2[[#This Row],[Integridad]]+Tabla2[[#This Row],[Confidencialidad ]]<=4),\"Baja\",IF(AND(Tabla2[[#This Row],[Disponibilidad]]+Tabla2[[#This Row],[Integridad]]+Tabla2[[#This Row],[Confidencialidad ]]>=5,Tabla2[[#This Row],[Disponibilidad]]+Tabla2[[#This Row],[Integridad]]+Tabla2[[#This Row],[Confidencialidad ]]<=7),\"Media\",IF(Tabla2[[#This Row],[Disponibilidad]]+Tabla2[[#This Row],[Integridad]]+Tabla2[[#This Row],[Confidencialidad ]]>=8,\"Alta\",\"error\")))","v":"Baja"}]
["",null,null,null,null,null,null,null,null,null,null,null,null,null,null,null,null,null,null,null,null,null,null,null,null,{"$f":"IF((Tabla2[[#This Row],[Disponibilidad]]+Tabla2[[#This Row],[Integridad]]+Tabla2[[#This Row],[Confidencialidad ]]<=4),\"Baja\",IF(AND(Tabla2[[#This Row],[Disponibilidad]]+Tabla2[[#This Row],[Integridad]]+Tabla2[[#This Row],[Confidencialidad ]]>=5,Tabla2[[#This Row],[Disponibilidad]]+Tabla2[[#This Row],[Integridad]]+Tabla2[[#This Row],[Confidencialidad ]]<=7),\"Media\",IF(Tabla2[[#This Row],[Disponibilidad]]+Tabla2[[#This Row],[Integridad]]+Tabla2[[#This Row],[Confidencialidad ]]>=8,\"Alta\",\"error\")))","v":"Baja"}]
["",null,null,null,null,null,null,null,null,null,null,null,null,null,null,null,null,null,null,null,null,null,null,null,null,{"$f":"IF((Tabla2[[#This Row],[Disponibilidad]]+Tabla2[[#This Row],[Integridad]]+Tabla2[[#This Row],[Confidencialidad ]]<=4),\"Baja\",IF(AND(Tabla2[[#This Row],[Disponibilidad]]+Tabla2[[#This Row],[Integridad]]+Tabla2[[#This Row],[Confidencialidad ]]>=5,Tabla2[[#This Row],[Disponibilidad]]+Tabla2[[#This Row],[Integridad]]+Tabla2[[#This Row],[Confidencialidad ]]<=7),\"Media\",IF(Tabla2[[#This Row],[Disponibilidad]]+Tabla2[[#This Row],[Integridad]]+Tabla2[[#This Row],[Confidencialidad ]]>=8,\"Alta\",\"error\")))","v":"Baja"}]
["",null,null,null,null,null,null,null,null,null,null,null,null,null,null,null,null,null,null,null,null,null,null,null,null,{"$f":"IF((Tabla2[[#This Row],[Disponibilidad]]+Tabla2[[#This Row],[Integridad]]+Tabla2[[#This Row],[Confidencialidad ]]<=4),\"Baja\",IF(AND(Tabla2[[#This Row],[Disponibilidad]]+Tabla2[[#This Row],[Integridad]]+Tabla2[[#This Row],[Confidencialidad ]]>=5,Tabla2[[#This Row],[Disponibilidad]]+Tabla2[[#This Row],[Integridad]]+Tabla2[[#This Row],[Confidencialidad ]]<=7),\"Media\",IF(Tabla2[[#This Row],[Disponibilidad]]+Tabla2[[#This Row],[Integridad]]+Tabla2[[#This Row],[Confidencialidad ]]>=8,\"Alta\",\"error\")))","v":"Baja"}]
["",null,null,null,null,null,null,null,null,null,null,null,null,null,null,null,null,null,null,null,null,null,null,null,null,{"$f":"IF((Tabla2[[#This Row],[Disponibilidad]]+Tabla2[[#This Row],[Integridad]]+Tabla2[[#This Row],[Confidencialidad ]]<=4),\"Baja\",IF(AND(Tabla2[[#This Row],[Disponibilidad]]+Tabla2[[#This Row],[Integridad]]+Tabla2[[#This Row],[Confidencialidad ]]>=5,Tabla2[[#This Row],[Disponibilidad]]+Tabla2[[#This Row],[Integridad]]+Tabla2[[#This Row],[Confidencialidad ]]<=7),\"Media\",IF(Tabla2[[#This Row],[Disponibilidad]]+Tabla2[[#This Row],[Integridad]]+Tabla2[[#This Row],[Confidencialidad ]]>=8,\"Alta\",\"error\")))","v":"Baja"}]
["",null,null,null,null,null,null,null,null,null,null,null,null,null,null,null,null,null,null,null,null,null,null,null,null,{"$f":"IF((Tabla2[[#This Row],[Disponibilidad]]+Tabla2[[#This Row],[Integridad]]+Tabla2[[#This Row],[Confidencialidad ]]<=4),\"Baja\",IF(AND(Tabla2[[#This Row],[Disponibilidad]]+Tabla2[[#This Row],[Integridad]]+Tabla2[[#This Row],[Confidencialidad ]]>=5,Tabla2[[#This Row],[Disponibilidad]]+Tabla2[[#This Row],[Integridad]]+Tabla2[[#This Row],[Confidencialidad ]]<=7),\"Media\",IF(Tabla2[[#This Row],[Disponibilidad]]+Tabla2[[#This Row],[Integridad]]+Tabla2[[#This Row],[Confidencialidad ]]>=8,\"Alta\",\"error\")))","v":"Baja"}]
["",null,null,null,null,null,null,null,null,null,null,null,null,null,null,null,null,null,null,null,null,null,null,null,null,{"$f":"IF((Tabla2[[#This Row],[Disponibilidad]]+Tabla2[[#This Row],[Integridad]]+Tabla2[[#This Row],[Confidencialidad ]]<=4),\"Baja\",IF(AND(Tabla2[[#This Row],[Disponibilidad]]+Tabla2[[#This Row],[Integridad]]+Tabla2[[#This Row],[Confidencialidad ]]>=5,Tabla2[[#This Row],[Disponibilidad]]+Tabla2[[#This Row],[Integridad]]+Tabla2[[#This Row],[Confidencialidad ]]<=7),\"Media\",IF(Tabla2[[#This Row],[Disponibilidad]]+Tabla2[[#This Row],[Integridad]]+Tabla2[[#This Row],[Confidencialidad ]]>=8,\"Alta\",\"error\")))","v":"Baja"}]
["",null,null,null,null,null,null,null,null,null,null,null,null,null,null,null,null,null,null,null,null,null,null,null,null,{"$f":"IF((Tabla2[[#This Row],[Disponibilidad]]+Tabla2[[#This Row],[Integridad]]+Tabla2[[#This Row],[Confidencialidad ]]<=4),\"Baja\",IF(AND(Tabla2[[#This Row],[Disponibilidad]]+Tabla2[[#This Row],[Integridad]]+Tabla2[[#This Row],[Confidencialidad ]]>=5,Tabla2[[#This Row],[Disponibilidad]]+Tabla2[[#This Row],[Integridad]]+Tabla2[[#This Row],[Confidencialidad ]]<=7),\"Media\",IF(Tabla2[[#This Row],[Disponibilidad]]+Tabla2[[#This Row],[Integridad]]+Tabla2[[#This Row],[Confidencialidad ]]>=8,\"Alta\",\"error\")))","v":"Baja"}]
["",null,null,null,null,null,null,null,null,null,null,null,null,null,null,null,null,null,null,null,null,null,null,null,null,{"$f":"IF((Tabla2[[#This Row],[Disponibilidad]]+Tabla2[[#This Row],[Integridad]]+Tabla2[[#This Row],[Confidencialidad ]]<=4),\"Baja\",IF(AND(Tabla2[[#This Row],[Disponibilidad]]+Tabla2[[#This Row],[Integridad]]+Tabla2[[#This Row],[Confidencialidad ]]>=5,Tabla2[[#This Row],[Disponibilidad]]+Tabla2[[#This Row],[Integridad]]+Tabla2[[#This Row],[Confidencialidad ]]<=7),\"Media\",IF(Tabla2[[#This Row],[Disponibilidad]]+Tabla2[[#This Row],[Integridad]]+Tabla2[[#This Row],[Confidencialidad ]]>=8,\"Alta\",\"error\")))","v":"Baja"}]
["",null,null,null,null,null,null,null,null,null,null,null,null,null,null,null,null,null,null,null,null,null,null,null,null,{"$f":"IF((Tabla2[[#This Row],[Disponibilidad]]+Tabla2[[#This Row],[Integridad]]+Tabla2[[#This Row],[Confidencialidad ]]<=4),\"Baja\",IF(AND(Tabla2[[#This Row],[Disponibilidad]]+Tabla2[[#This Row],[Integridad]]+Tabla2[[#This Row],[Confidencialidad ]]>=5,Tabla2[[#This Row],[Disponibilidad]]+Tabla2[[#This Row],[Integridad]]+Tabla2[[#This Row],[Confidencialidad ]]<=7),\"Media\",IF(Tabla2[[#This Row],[Disponibilidad]]+Tabla2[[#This Row],[Integridad]]+Tabla2[[#This Row],[Confidencialidad ]]>=8,\"Alta\",\"error\")))","v":"Baja"}]
["",null,null,null,null,null,null,null,null,null,null,null,null,null,null,null,null,null,null,null,null,null,null,null,null,{"$f":"IF((Tabla2[[#This Row],[Disponibilidad]]+Tabla2[[#This Row],[Integridad]]+Tabla2[[#This Row],[Confidencialidad ]]<=4),\"Baja\",IF(AND(Tabla2[[#This Row],[Disponibilidad]]+Tabla2[[#This Row],[Integridad]]+Tabla2[[#This Row],[Confidencialidad ]]>=5,Tabla2[[#This Row],[Disponibilidad]]+Tabla2[[#This Row],[Integridad]]+Tabla2[[#This Row],[Confidencialidad ]]<=7),\"Media\",IF(Tabla2[[#This Row],[Disponibilidad]]+Tabla2[[#This Row],[Integridad]]+Tabla2[[#This Row],[Confidencialidad ]]>=8,\"Alta\",\"error\")))","v":"Baja"}]
["",null,null,null,null,null,null,null,null,null,null,null,null,null,null,null,null,null,null,null,null,null,null,null,null,{"$f":"IF((Tabla2[[#This Row],[Disponibilidad]]+Tabla2[[#This Row],[Integridad]]+Tabla2[[#This Row],[Confidencialidad ]]<=4),\"Baja\",IF(AND(Tabla2[[#This Row],[Disponibilidad]]+Tabla2[[#This Row],[Integridad]]+Tabla2[[#This Row],[Confidencialidad ]]>=5,Tabla2[[#This Row],[Disponibilidad]]+Tabla2[[#This Row],[Integridad]]+Tabla2[[#This Row],[Confidencialidad ]]<=7),\"Media\",IF(Tabla2[[#This Row],[Disponibilidad]]+Tabla2[[#This Row],[Integridad]]+Tabla2[[#This Row],[Confidencialidad ]]>=8,\"Alta\",\"error\")))","v":"Baja"}]
["",null,null,null,null,null,null,null,null,null,null,null,null,null,null,null,null,null,null,null,null,null,null,null,null,{"$f":"IF((Tabla2[[#This Row],[Disponibilidad]]+Tabla2[[#This Row],[Integridad]]+Tabla2[[#This Row],[Confidencialidad ]]<=4),\"Baja\",IF(AND(Tabla2[[#This Row],[Disponibilidad]]+Tabla2[[#This Row],[Integridad]]+Tabla2[[#This Row],[Confidencialidad ]]>=5,Tabla2[[#This Row],[Disponibilidad]]+Tabla2[[#This Row],[Integridad]]+Tabla2[[#This Row],[Confidencialidad ]]<=7),\"Media\",IF(Tabla2[[#This Row],[Disponibilidad]]+Tabla2[[#This Row],[Integridad]]+Tabla2[[#This Row],[Confidencialidad ]]>=8,\"Alta\",\"error\")))","v":"Baja"}]
["",null,null,null,null,null,null,null,null,null,null,null,null,null,null,null,null,null,null,null,null,null,null,null,null,{"$f":"IF((Tabla2[[#This Row],[Disponibilidad]]+Tabla2[[#This Row],[Integridad]]+Tabla2[[#This Row],[Confidencialidad ]]<=4),\"Baja\",IF(AND(Tabla2[[#This Row],[Disponibilidad]]+Tabla2[[#This Row],[Integridad]]+Tabla2[[#This Row],[Confidencialidad ]]>=5,Tabla2[[#This Row],[Disponibilidad]]+Tabla2[[#This Row],[Integridad]]+Tabla2[[#This Row],[Confidencialidad ]]<=7),\"Media\",IF(Tabla2[[#This Row],[Disponibilidad]]+Tabla2[[#This Row],[Integridad]]+Tabla2[[#This Row],[Confidencialidad ]]>=8,\"Alta\",\"error\")))","v":"Baja"}]
["",null,null,null,null,null,null,null,null,null,null,null,null,null,null,null,null,null,null,null,null,null,null,null,null,{"$f":"IF((Tabla2[[#This Row],[Disponibilidad]]+Tabla2[[#This Row],[Integridad]]+Tabla2[[#This Row],[Confidencialidad ]]<=4),\"Baja\",IF(AND(Tabla2[[#This Row],[Disponibilidad]]+Tabla2[[#This Row],[Integridad]]+Tabla2[[#This Row],[Confidencialidad ]]>=5,Tabla2[[#This Row],[Disponibilidad]]+Tabla2[[#This Row],[Integridad]]+Tabla2[[#This Row],[Confidencialidad ]]<=7),\"Media\",IF(Tabla2[[#This Row],[Disponibilidad]]+Tabla2[[#This Row],[Integridad]]+Tabla2[[#This Row],[Confidencialidad ]]>=8,\"Alta\",\"error\")))","v":"Baja"}]
["",null,null,null,null,null,null,null,null,null,null,null,null,null,null,null,null,null,null,null,null,null,null,null,null,{"$f":"IF((Tabla2[[#This Row],[Disponibilidad]]+Tabla2[[#This Row],[Integridad]]+Tabla2[[#This Row],[Confidencialidad ]]<=4),\"Baja\",IF(AND(Tabla2[[#This Row],[Disponibilidad]]+Tabla2[[#This Row],[Integridad]]+Tabla2[[#This Row],[Confidencialidad ]]>=5,Tabla2[[#This Row],[Disponibilidad]]+Tabla2[[#This Row],[Integridad]]+Tabla2[[#This Row],[Confidencialidad ]]<=7),\"Media\",IF(Tabla2[[#This Row],[Disponibilidad]]+Tabla2[[#This Row],[Integridad]]+Tabla2[[#This Row],[Confidencialidad ]]>=8,\"Alta\",\"error\")))","v":"Baja"}]
["",null,null,null,null,null,null,null,null,null,null,null,null,null,null,null,null,null,null,null,null,null,null,null,null,{"$f":"IF((Tabla2[[#This Row],[Disponibilidad]]+Tabla2[[#This Row],[Integridad]]+Tabla2[[#This Row],[Confidencialidad ]]<=4),\"Baja\",IF(AND(Tabla2[[#This Row],[Disponibilidad]]+Tabla2[[#This Row],[Integridad]]+Tabla2[[#This Row],[Confidencialidad ]]>=5,Tabla2[[#This Row],[Disponibilidad]]+Tabla2[[#This Row],[Integridad]]+Tabla2[[#This Row],[Confidencialidad ]]<=7),\"Media\",IF(Tabla2[[#This Row],[Disponibilidad]]+Tabla2[[#This Row],[Integridad]]+Tabla2[[#This Row],[Confidencialidad ]]>=8,\"Alta\",\"error\")))","v":"Baja"}]
["",null,null,null,null,null,null,null,null,null,null,null,null,null,null,null,null,null,null,null,null,null,null,null,null,{"$f":"IF((Tabla2[[#This Row],[Disponibilidad]]+Tabla2[[#This Row],[Integridad]]+Tabla2[[#This Row],[Confidencialidad ]]<=4),\"Baja\",IF(AND(Tabla2[[#This Row],[Disponibilidad]]+Tabla2[[#This Row],[Integridad]]+Tabla2[[#This Row],[Confidencialidad ]]>=5,Tabla2[[#This Row],[Disponibilidad]]+Tabla2[[#This Row],[Integridad]]+Tabla2[[#This Row],[Confidencialidad ]]<=7),\"Media\",IF(Tabla2[[#This Row],[Disponibilidad]]+Tabla2[[#This Row],[Integridad]]+Tabla2[[#This Row],[Confidencialidad ]]>=8,\"Alta\",\"error\")))","v":"Baja"}]
["",null,null,null,null,null,null,null,null,null,null,null,null,null,null,null,null,null,null,null,null,null,null,null,null,{"$f":"IF((Tabla2[[#This Row],[Disponibilidad]]+Tabla2[[#This Row],[Integridad]]+Tabla2[[#This Row],[Confidencialidad ]]<=4),\"Baja\",IF(AND(Tabla2[[#This Row],[Disponibilidad]]+Tabla2[[#This Row],[Integridad]]+Tabla2[[#This Row],[Confidencialidad ]]>=5,Tabla2[[#This Row],[Disponibilidad]]+Tabla2[[#This Row],[Integridad]]+Tabla2[[#This Row],[Confidencialidad ]]<=7),\"Media\",IF(Tabla2[[#This Row],[Disponibilidad]]+Tabla2[[#This Row],[Integridad]]+Tabla2[[#This Row],[Confidencialidad ]]>=8,\"Alta\",\"error\")))","v":"Baja"}]
["",null,null,null,null,null,null,null,null,null,null,null,null,null,null,null,null,null,null,null,null,null,null,null,null,{"$f":"IF((Tabla2[[#This Row],[Disponibilidad]]+Tabla2[[#This Row],[Integridad]]+Tabla2[[#This Row],[Confidencialidad ]]<=4),\"Baja\",IF(AND(Tabla2[[#This Row],[Disponibilidad]]+Tabla2[[#This Row],[Integridad]]+Tabla2[[#This Row],[Confidencialidad ]]>=5,Tabla2[[#This Row],[Disponibilidad]]+Tabla2[[#This Row],[Integridad]]+Tabla2[[#This Row],[Confidencialidad ]]<=7),\"Media\",IF(Tabla2[[#This Row],[Disponibilidad]]+Tabla2[[#This Row],[Integridad]]+Tabla2[[#This Row],[Confidencialidad ]]>=8,\"Alta\",\"error\")))","v":"Baja"}]
["",null,null,null,null,null,null,null,null,null,null,null,null,null,null,null,null,null,null,null,null,null,null,null,null,{"$f":"IF((Tabla2[[#This Row],[Disponibilidad]]+Tabla2[[#This Row],[Integridad]]+Tabla2[[#This Row],[Confidencialidad ]]<=4),\"Baja\",IF(AND(Tabla2[[#This Row],[Disponibilidad]]+Tabla2[[#This Row],[Integridad]]+Tabla2[[#This Row],[Confidencialidad ]]>=5,Tabla2[[#This Row],[Disponibilidad]]+Tabla2[[#This Row],[Integridad]]+Tabla2[[#This Row],[Confidencialidad ]]<=7),\"Media\",IF(Tabla2[[#This Row],[Disponibilidad]]+Tabla2[[#This Row],[Integridad]]+Tabla2[[#This Row],[Confidencialidad ]]>=8,\"Alta\",\"error\")))","v":"Baja"}]
["",null,null,null,null,null,null,null,null,null,null,null,null,null,null,null,null,null,null,null,null,null,null,null,null,{"$f":"IF((Tabla2[[#This Row],[Disponibilidad]]+Tabla2[[#This Row],[Integridad]]+Tabla2[[#This Row],[Confidencialidad ]]<=4),\"Baja\",IF(AND(Tabla2[[#This Row],[Disponibilidad]]+Tabla2[[#This Row],[Integridad]]+Tabla2[[#This Row],[Confidencialidad ]]>=5,Tabla2[[#This Row],[Disponibilidad]]+Tabla2[[#This Row],[Integridad]]+Tabla2[[#This Row],[Confidencialidad ]]<=7),\"Media\",IF(Tabla2[[#This Row],[Disponibilidad]]+Tabla2[[#This Row],[Integridad]]+Tabla2[[#This Row],[Confidencialidad ]]>=8,\"Alta\",\"error\")))","v":"Baja"}]
["",null,null,null,null,null,null,null,null,null,null,null,null,null,null,null,null,null,null,null,null,null,null,null,null,{"$f":"IF((Tabla2[[#This Row],[Disponibilidad]]+Tabla2[[#This Row],[Integridad]]+Tabla2[[#This Row],[Confidencialidad ]]<=4),\"Baja\",IF(AND(Tabla2[[#This Row],[Disponibilidad]]+Tabla2[[#This Row],[Integridad]]+Tabla2[[#This Row],[Confidencialidad ]]>=5,Tabla2[[#This Row],[Disponibilidad]]+Tabla2[[#This Row],[Integridad]]+Tabla2[[#This Row],[Confidencialidad ]]<=7),\"Media\",IF(Tabla2[[#This Row],[Disponibilidad]]+Tabla2[[#This Row],[Integridad]]+Tabla2[[#This Row],[Confidencialidad ]]>=8,\"Alta\",\"error\")))","v":"Baja"}]
["",null,null,null,null,null,null,null,null,null,null,null,null,null,null,null,null,null,null,null,null,null,null,null,null,{"$f":"IF((Tabla2[[#This Row],[Disponibilidad]]+Tabla2[[#This Row],[Integridad]]+Tabla2[[#This Row],[Confidencialidad ]]<=4),\"Baja\",IF(AND(Tabla2[[#This Row],[Disponibilidad]]+Tabla2[[#This Row],[Integridad]]+Tabla2[[#This Row],[Confidencialidad ]]>=5,Tabla2[[#This Row],[Disponibilidad]]+Tabla2[[#This Row],[Integridad]]+Tabla2[[#This Row],[Confidencialidad ]]<=7),\"Media\",IF(Tabla2[[#This Row],[Disponibilidad]]+Tabla2[[#This Row],[Integridad]]+Tabla2[[#This Row],[Confidencialidad ]]>=8,\"Alta\",\"error\")))","v":"Baja"}]
["",null,null,null,null,null,null,null,null,null,null,null,null,null,null,null,null,null,null,null,null,null,null,null,null,{"$f":"IF((Tabla2[[#This Row],[Disponibilidad]]+Tabla2[[#This Row],[Integridad]]+Tabla2[[#This Row],[Confidencialidad ]]<=4),\"Baja\",IF(AND(Tabla2[[#This Row],[Disponibilidad]]+Tabla2[[#This Row],[Integridad]]+Tabla2[[#This Row],[Confidencialidad ]]>=5,Tabla2[[#This Row],[Disponibilidad]]+Tabla2[[#This Row],[Integridad]]+Tabla2[[#This Row],[Confidencialidad ]]<=7),\"Media\",IF(Tabla2[[#This Row],[Disponibilidad]]+Tabla2[[#This Row],[Integridad]]+Tabla2[[#This Row],[Confidencialidad ]]>=8,\"Alta\",\"error\")))","v":"Baja"}]
["",null,null,null,null,null,null,null,null,null,null,null,null,null,null,null,null,null,null,null,null,null,null,null,null,{"$f":"IF((Tabla2[[#This Row],[Disponibilidad]]+Tabla2[[#This Row],[Integridad]]+Tabla2[[#This Row],[Confidencialidad ]]<=4),\"Baja\",IF(AND(Tabla2[[#This Row],[Disponibilidad]]+Tabla2[[#This Row],[Integridad]]+Tabla2[[#This Row],[Confidencialidad ]]>=5,Tabla2[[#This Row],[Disponibilidad]]+Tabla2[[#This Row],[Integridad]]+Tabla2[[#This Row],[Confidencialidad ]]<=7),\"Media\",IF(Tabla2[[#This Row],[Disponibilidad]]+Tabla2[[#This Row],[Integridad]]+Tabla2[[#This Row],[Confidencialidad ]]>=8,\"Alta\",\"error\")))","v":"Baja"}]
["",null,null,null,null,null,null,null,null,null,null,null,null,null,null,null,null,null,null,null,null,null,null,null,null,{"$f":"IF((Tabla2[[#This Row],[Disponibilidad]]+Tabla2[[#This Row],[Integridad]]+Tabla2[[#This Row],[Confidencialidad ]]<=4),\"Baja\",IF(AND(Tabla2[[#This Row],[Disponibilidad]]+Tabla2[[#This Row],[Integridad]]+Tabla2[[#This Row],[Confidencialidad ]]>=5,Tabla2[[#This Row],[Disponibilidad]]+Tabla2[[#This Row],[Integridad]]+Tabla2[[#This Row],[Confidencialidad ]]<=7),\"Media\",IF(Tabla2[[#This Row],[Disponibilidad]]+Tabla2[[#This Row],[Integridad]]+Tabla2[[#This Row],[Confidencialidad ]]>=8,\"Alta\",\"error\")))","v":"Baja"}]
["",null,null,null,null,null,null,null,null,null,null,null,null,null,null,null,null,null,null,null,null,null,null,null,null,{"$f":"IF((Tabla2[[#This Row],[Disponibilidad]]+Tabla2[[#This Row],[Integridad]]+Tabla2[[#This Row],[Confidencialidad ]]<=4),\"Baja\",IF(AND(Tabla2[[#This Row],[Disponibilidad]]+Tabla2[[#This Row],[Integridad]]+Tabla2[[#This Row],[Confidencialidad ]]>=5,Tabla2[[#This Row],[Disponibilidad]]+Tabla2[[#This Row],[Integridad]]+Tabla2[[#This Row],[Confidencialidad ]]<=7),\"Media\",IF(Tabla2[[#This Row],[Disponibilidad]]+Tabla2[[#This Row],[Integridad]]+Tabla2[[#This Row],[Confidencialidad ]]>=8,\"Alta\",\"error\")))","v":"Baja"}]
["",null,null,null,null,null,null,null,null,null,null,null,null,null,null,null,null,null,null,null,null,null,null,null,null,{"$f":"IF((Tabla2[[#This Row],[Disponibilidad]]+Tabla2[[#This Row],[Integridad]]+Tabla2[[#This Row],[Confidencialidad ]]<=4),\"Baja\",IF(AND(Tabla2[[#This Row],[Disponibilidad]]+Tabla2[[#This Row],[Integridad]]+Tabla2[[#This Row],[Confidencialidad ]]>=5,Tabla2[[#This Row],[Disponibilidad]]+Tabla2[[#This Row],[Integridad]]+Tabla2[[#This Row],[Confidencialidad ]]<=7),\"Media\",IF(Tabla2[[#This Row],[Disponibilidad]]+Tabla2[[#This Row],[Integridad]]+Tabla2[[#This Row],[Confidencialidad ]]>=8,\"Alta\",\"error\")))","v":"Baja"}]
["",null,null,null,null,null,null,null,null,null,null,null,null,null,null,null,null,null,null,null,null,null,null,null,null,{"$f":"IF((Tabla2[[#This Row],[Disponibilidad]]+Tabla2[[#This Row],[Integridad]]+Tabla2[[#This Row],[Confidencialidad ]]<=4),\"Baja\",IF(AND(Tabla2[[#This Row],[Disponibilidad]]+Tabla2[[#This Row],[Integridad]]+Tabla2[[#This Row],[Confidencialidad ]]>=5,Tabla2[[#This Row],[Disponibilidad]]+Tabla2[[#This Row],[Integridad]]+Tabla2[[#This Row],[Confidencialidad ]]<=7),\"Media\",IF(Tabla2[[#This Row],[Disponibilidad]]+Tabla2[[#This Row],[Integridad]]+Tabla2[[#This Row],[Confidencialidad ]]>=8,\"Alta\",\"error\")))","v":"Baja"}]
["",null,null,null,null,null,null,null,null,null,null,null,null,null,null,null,null,null,null,null,null,null,null,null,null,{"$f":"IF((Tabla2[[#This Row],[Disponibilidad]]+Tabla2[[#This Row],[Integridad]]+Tabla2[[#This Row],[Confidencialidad ]]<=4),\"Baja\",IF(AND(Tabla2[[#This Row],[Disponibilidad]]+Tabla2[[#This Row],[Integridad]]+Tabla2[[#This Row],[Confidencialidad ]]>=5,Tabla2[[#This Row],[Disponibilidad]]+Tabla2[[#This Row],[Integridad]]+Tabla2[[#This Row],[Confidencialidad ]]<=7),\"Media\",IF(Tabla2[[#This Row],[Disponibilidad]]+Tabla2[[#This Row],[Integridad]]+Tabla2[[#This Row],[Confidencialidad ]]>=8,\"Alta\",\"error\")))","v":"Baja"}]
["",null,null,null,null,null,null,null,null,null,null,null,null,null,null,null,null,null,null,null,null,null,null,null,null,{"$f":"IF((Tabla2[[#This Row],[Disponibilidad]]+Tabla2[[#This Row],[Integridad]]+Tabla2[[#This Row],[Confidencialidad ]]<=4),\"Baja\",IF(AND(Tabla2[[#This Row],[Disponibilidad]]+Tabla2[[#This Row],[Integridad]]+Tabla2[[#This Row],[Confidencialidad ]]>=5,Tabla2[[#This Row],[Disponibilidad]]+Tabla2[[#This Row],[Integridad]]+Tabla2[[#This Row],[Confidencialidad ]]<=7),\"Media\",IF(Tabla2[[#This Row],[Disponibilidad]]+Tabla2[[#This Row],[Integridad]]+Tabla2[[#This Row],[Confidencialidad ]]>=8,\"Alta\",\"error\")))","v":"Baja"}]
["",null,null,null,null,null,null,null,null,null,null,null,null,null,null,null,null,null,null,null,null,null,null,null,null,{"$f":"IF((Tabla2[[#This Row],[Disponibilidad]]+Tabla2[[#This Row],[Integridad]]+Tabla2[[#This Row],[Confidencialidad ]]<=4),\"Baja\",IF(AND(Tabla2[[#This Row],[Disponibilidad]]+Tabla2[[#This Row],[Integridad]]+Tabla2[[#This Row],[Confidencialidad ]]>=5,Tabla2[[#This Row],[Disponibilidad]]+Tabla2[[#This Row],[Integridad]]+Tabla2[[#This Row],[Confidencialidad ]]<=7),\"Media\",IF(Tabla2[[#This Row],[Disponibilidad]]+Tabla2[[#This Row],[Integridad]]+Tabla2[[#This Row],[Confidencialidad ]]>=8,\"Alta\",\"error\")))","v":"Baja"}]
["",null,null,null,null,null,null,null,null,null,null,null,null,null,null,null,null,null,null,null,null,null,null,null,null,{"$f":"IF((Tabla2[[#This Row],[Disponibilidad]]+Tabla2[[#This Row],[Integridad]]+Tabla2[[#This Row],[Confidencialidad ]]<=4),\"Baja\",IF(AND(Tabla2[[#This Row],[Disponibilidad]]+Tabla2[[#This Row],[Integridad]]+Tabla2[[#This Row],[Confidencialidad ]]>=5,Tabla2[[#This Row],[Disponibilidad]]+Tabla2[[#This Row],[Integridad]]+Tabla2[[#This Row],[Confidencialidad ]]<=7),\"Media\",IF(Tabla2[[#This Row],[Disponibilidad]]+Tabla2[[#This Row],[Integridad]]+Tabla2[[#This Row],[Confidencialidad ]]>=8,\"Alta\",\"error\")))","v":"Baja"}]
["",null,null,null,null,null,null,null,null,null,null,null,null,null,null,null,null,null,null,null,null,null,null,null,null,{"$f":"IF((Tabla2[[#This Row],[Disponibilidad]]+Tabla2[[#This Row],[Integridad]]+Tabla2[[#This Row],[Confidencialidad ]]<=4),\"Baja\",IF(AND(Tabla2[[#This Row],[Disponibilidad]]+Tabla2[[#This Row],[Integridad]]+Tabla2[[#This Row],[Confidencialidad ]]>=5,Tabla2[[#This Row],[Disponibilidad]]+Tabla2[[#This Row],[Integridad]]+Tabla2[[#This Row],[Confidencialidad ]]<=7),\"Media\",IF(Tabla2[[#This Row],[Disponibilidad]]+Tabla2[[#This Row],[Integridad]]+Tabla2[[#This Row],[Confidencialidad ]]>=8,\"Alta\",\"error\")))","v":"Baja"}]
["",null,null,null,null,null,null,null,null,null,null,null,null,null,null,null,null,null,null,null,null,null,null,null,null,{"$f":"IF((Tabla2[[#This Row],[Disponibilidad]]+Tabla2[[#This Row],[Integridad]]+Tabla2[[#This Row],[Confidencialidad ]]<=4),\"Baja\",IF(AND(Tabla2[[#This Row],[Disponibilidad]]+Tabla2[[#This Row],[Integridad]]+Tabla2[[#This Row],[Confidencialidad ]]>=5,Tabla2[[#This Row],[Disponibilidad]]+Tabla2[[#This Row],[Integridad]]+Tabla2[[#This Row],[Confidencialidad ]]<=7),\"Media\",IF(Tabla2[[#This Row],[Disponibilidad]]+Tabla2[[#This Row],[Integridad]]+Tabla2[[#This Row],[Confidencialidad ]]>=8,\"Alta\",\"error\")))","v":"Baja"}]
["",null,null,null,null,null,null,null,null,null,null,null,null,null,null,null,null,null,null,null,null,null,null,null,null,{"$f":"IF((Tabla2[[#This Row],[Disponibilidad]]+Tabla2[[#This Row],[Integridad]]+Tabla2[[#This Row],[Confidencialidad ]]<=4),\"Baja\",IF(AND(Tabla2[[#This Row],[Disponibilidad]]+Tabla2[[#This Row],[Integridad]]+Tabla2[[#This Row],[Confidencialidad ]]>=5,Tabla2[[#This Row],[Disponibilidad]]+Tabla2[[#This Row],[Integridad]]+Tabla2[[#This Row],[Confidencialidad ]]<=7),\"Media\",IF(Tabla2[[#This Row],[Disponibilidad]]+Tabla2[[#This Row],[Integridad]]+Tabla2[[#This Row],[Confidencialidad ]]>=8,\"Alta\",\"error\")))","v":"Baja"}]
["",null,null,null,null,null,null,null,null,null,null,null,null,null,null,null,null,null,null,null,null,null,null,null,null,{"$f":"IF((Tabla2[[#This Row],[Disponibilidad]]+Tabla2[[#This Row],[Integridad]]+Tabla2[[#This Row],[Confidencialidad ]]<=4),\"Baja\",IF(AND(Tabla2[[#This Row],[Disponibilidad]]+Tabla2[[#This Row],[Integridad]]+Tabla2[[#This Row],[Confidencialidad ]]>=5,Tabla2[[#This Row],[Disponibilidad]]+Tabla2[[#This Row],[Integridad]]+Tabla2[[#This Row],[Confidencialidad ]]<=7),\"Media\",IF(Tabla2[[#This Row],[Disponibilidad]]+Tabla2[[#This Row],[Integridad]]+Tabla2[[#This Row],[Confidencialidad ]]>=8,\"Alta\",\"error\")))","v":"Baja"}]
["",null,null,null,null,null,null,null,null,null,null,null,null,null,null,null,null,null,null,null,null,null,null,null,null,{"$f":"IF((Tabla2[[#This Row],[Disponibilidad]]+Tabla2[[#This Row],[Integridad]]+Tabla2[[#This Row],[Confidencialidad ]]<=4),\"Baja\",IF(AND(Tabla2[[#This Row],[Disponibilidad]]+Tabla2[[#This Row],[Integridad]]+Tabla2[[#This Row],[Confidencialidad ]]>=5,Tabla2[[#This Row],[Disponibilidad]]+Tabla2[[#This Row],[Integridad]]+Tabla2[[#This Row],[Confidencialidad ]]<=7),\"Media\",IF(Tabla2[[#This Row],[Disponibilidad]]+Tabla2[[#This Row],[Integridad]]+Tabla2[[#This Row],[Confidencialidad ]]>=8,\"Alta\",\"error\")))","v":"Baja"}]
["",null,null,null,null,null,null,null,null,null,null,null,null,null,null,null,null,null,null,null,null,null,null,null,null,{"$f":"IF((Tabla2[[#This Row],[Disponibilidad]]+Tabla2[[#This Row],[Integridad]]+Tabla2[[#This Row],[Confidencialidad ]]<=4),\"Baja\",IF(AND(Tabla2[[#This Row],[Disponibilidad]]+Tabla2[[#This Row],[Integridad]]+Tabla2[[#This Row],[Confidencialidad ]]>=5,Tabla2[[#This Row],[Disponibilidad]]+Tabla2[[#This Row],[Integridad]]+Tabla2[[#This Row],[Confidencialidad ]]<=7),\"Media\",IF(Tabla2[[#This Row],[Disponibilidad]]+Tabla2[[#This Row],[Integridad]]+Tabla2[[#This Row],[Confidencialidad ]]>=8,\"Alta\",\"error\")))","v":"Baja"}]
["",null,null,null,null,null,null,null,null,null,null,null,null,null,null,null,null,null,null,null,null,null,null,null,null,{"$f":"IF((Tabla2[[#This Row],[Disponibilidad]]+Tabla2[[#This Row],[Integridad]]+Tabla2[[#This Row],[Confidencialidad ]]<=4),\"Baja\",IF(AND(Tabla2[[#This Row],[Disponibilidad]]+Tabla2[[#This Row],[Integridad]]+Tabla2[[#This Row],[Confidencialidad ]]>=5,Tabla2[[#This Row],[Disponibilidad]]+Tabla2[[#This Row],[Integridad]]+Tabla2[[#This Row],[Confidencialidad ]]<=7),\"Media\",IF(Tabla2[[#This Row],[Disponibilidad]]+Tabla2[[#This Row],[Integridad]]+Tabla2[[#This Row],[Confidencialidad ]]>=8,\"Alta\",\"error\")))","v":"Baja"}]
["",null,null,null,null,null,null,null,null,null,null,null,null,null,null,null,null,null,null,null,null,null,null,null,null,{"$f":"IF((Tabla2[[#This Row],[Disponibilidad]]+Tabla2[[#This Row],[Integridad]]+Tabla2[[#This Row],[Confidencialidad ]]<=4),\"Baja\",IF(AND(Tabla2[[#This Row],[Disponibilidad]]+Tabla2[[#This Row],[Integridad]]+Tabla2[[#This Row],[Confidencialidad ]]>=5,Tabla2[[#This Row],[Disponibilidad]]+Tabla2[[#This Row],[Integridad]]+Tabla2[[#This Row],[Confidencialidad ]]<=7),\"Media\",IF(Tabla2[[#This Row],[Disponibilidad]]+Tabla2[[#This Row],[Integridad]]+Tabla2[[#This Row],[Confidencialidad ]]>=8,\"Alta\",\"error\")))","v":"Baja"}]
["",null,null,null,null,null,null,null,null,null,null,null,null,null,null,null,null,null,null,null,null,null,null,null,null,{"$f":"IF((Tabla2[[#This Row],[Disponibilidad]]+Tabla2[[#This Row],[Integridad]]+Tabla2[[#This Row],[Confidencialidad ]]<=4),\"Baja\",IF(AND(Tabla2[[#This Row],[Disponibilidad]]+Tabla2[[#This Row],[Integridad]]+Tabla2[[#This Row],[Confidencialidad ]]>=5,Tabla2[[#This Row],[Disponibilidad]]+Tabla2[[#This Row],[Integridad]]+Tabla2[[#This Row],[Confidencialidad ]]<=7),\"Media\",IF(Tabla2[[#This Row],[Disponibilidad]]+Tabla2[[#This Row],[Integridad]]+Tabla2[[#This Row],[Confidencialidad ]]>=8,\"Alta\",\"error\")))","v":"Baja"}]
["",null,null,null,null,null,null,null,null,null,null,null,null,null,null,null,null,null,null,null,null,null,null,null,null,{"$f":"IF((Tabla2[[#This Row],[Disponibilidad]]+Tabla2[[#This Row],[Integridad]]+Tabla2[[#This Row],[Confidencialidad ]]<=4),\"Baja\",IF(AND(Tabla2[[#This Row],[Disponibilidad]]+Tabla2[[#This Row],[Integridad]]+Tabla2[[#This Row],[Confidencialidad ]]>=5,Tabla2[[#This Row],[Disponibilidad]]+Tabla2[[#This Row],[Integridad]]+Tabla2[[#This Row],[Confidencialidad ]]<=7),\"Media\",IF(Tabla2[[#This Row],[Disponibilidad]]+Tabla2[[#This Row],[Integridad]]+Tabla2[[#This Row],[Confidencialidad ]]>=8,\"Alta\",\"error\")))","v":"Baja"}]
["",null,null,null,null,null,null,null,null,null,null,null,null,null,null,null,null,null,null,null,null,null,null,null,null,{"$f":"IF((Tabla2[[#This Row],[Disponibilidad]]+Tabla2[[#This Row],[Integridad]]+Tabla2[[#This Row],[Confidencialidad ]]<=4),\"Baja\",IF(AND(Tabla2[[#This Row],[Disponibilidad]]+Tabla2[[#This Row],[Integridad]]+Tabla2[[#This Row],[Confidencialidad ]]>=5,Tabla2[[#This Row],[Disponibilidad]]+Tabla2[[#This Row],[Integridad]]+Tabla2[[#This Row],[Confidencialidad ]]<=7),\"Media\",IF(Tabla2[[#This Row],[Disponibilidad]]+Tabla2[[#This Row],[Integridad]]+Tabla2[[#This Row],[Confidencialidad ]]>=8,\"Alta\",\"error\")))","v":"Baja"}]
[{"$f":"IF(C200<>\"\",1,\"\")","v":""},null,null,null,null,null,null,null,null,null,null,null,null,null,null,null,null,null,null,null,null,null,null,null,null,{"$f":"IF((Tabla2[[#This Row],[Disponibilidad]]+Tabla2[[#This Row],[Integridad]]+Tabla2[[#This Row],[Confidencialidad ]]<=4),\"Baja\",IF(AND(Tabla2[[#This Row],[Disponibilidad]]+Tabla2[[#This Row],[Integridad]]+Tabla2[[#This Row],[Confidencialidad ]]>=5,Tabla2[[#This Row],[Disponibilidad]]+Tabla2[[#This Row],[Integridad]]+Tabla2[[#This Row],[Confidencialidad ]]<=7),\"Media\",IF(Tabla2[[#This Row],[Disponibilidad]]+Tabla2[[#This Row],[Integridad]]+Tabla2[[#This Row],[Confidencialidad ]]>=8,\"Alta\",\"error\")))","v":"Baja"}]
["",null,null,null,null,null,null,null,null,null,null,null,null,null,null,null,null,null,null,null,null,null,null,null,null,{"$f":"IF((Tabla2[[#This Row],[Disponibilidad]]+Tabla2[[#This Row],[Integridad]]+Tabla2[[#This Row],[Confidencialidad ]]<=4),\"Baja\",IF(AND(Tabla2[[#This Row],[Disponibilidad]]+Tabla2[[#This Row],[Integridad]]+Tabla2[[#This Row],[Confidencialidad ]]>=5,Tabla2[[#This Row],[Disponibilidad]]+Tabla2[[#This Row],[Integridad]]+Tabla2[[#This Row],[Confidencialidad ]]<=7),\"Media\",IF(Tabla2[[#This Row],[Disponibilidad]]+Tabla2[[#This Row],[Integridad]]+Tabla2[[#This Row],[Confidencialidad ]]>=8,\"Alta\",\"error\")))","v":"Baja"}]
["",null,null,null,null,null,null,null,null,null,null,null,null,null,null,null,null,null,null,null,null,null,null,null,null,{"$f":"IF((Tabla2[[#This Row],[Disponibilidad]]+Tabla2[[#This Row],[Integridad]]+Tabla2[[#This Row],[Confidencialidad ]]<=4),\"Baja\",IF(AND(Tabla2[[#This Row],[Disponibilidad]]+Tabla2[[#This Row],[Integridad]]+Tabla2[[#This Row],[Confidencialidad ]]>=5,Tabla2[[#This Row],[Disponibilidad]]+Tabla2[[#This Row],[Integridad]]+Tabla2[[#This Row],[Confidencialidad ]]<=7),\"Media\",IF(Tabla2[[#This Row],[Disponibilidad]]+Tabla2[[#This Row],[Integridad]]+Tabla2[[#This Row],[Confidencialidad ]]>=8,\"Alta\",\"error\")))","v":"Baja"}]
["",null,null,null,null,null,null,null,null,null,null,null,null,null,null,null,null,null,null,null,null,null,null,null,null,{"$f":"IF((Tabla2[[#This Row],[Disponibilidad]]+Tabla2[[#This Row],[Integridad]]+Tabla2[[#This Row],[Confidencialidad ]]<=4),\"Baja\",IF(AND(Tabla2[[#This Row],[Disponibilidad]]+Tabla2[[#This Row],[Integridad]]+Tabla2[[#This Row],[Confidencialidad ]]>=5,Tabla2[[#This Row],[Disponibilidad]]+Tabla2[[#This Row],[Integridad]]+Tabla2[[#This Row],[Confidencialidad ]]<=7),\"Media\",IF(Tabla2[[#This Row],[Disponibilidad]]+Tabla2[[#This Row],[Integridad]]+Tabla2[[#This Row],[Confidencialidad ]]>=8,\"Alta\",\"error\")))","v":"Baja"}]
["",null,null,null,null,null,null,null,null,null,null,null,null,null,null,null,null,null,null,null,null,null,null,null,null,{"$f":"IF((Tabla2[[#This Row],[Disponibilidad]]+Tabla2[[#This Row],[Integridad]]+Tabla2[[#This Row],[Confidencialidad ]]<=4),\"Baja\",IF(AND(Tabla2[[#This Row],[Disponibilidad]]+Tabla2[[#This Row],[Integridad]]+Tabla2[[#This Row],[Confidencialidad ]]>=5,Tabla2[[#This Row],[Disponibilidad]]+Tabla2[[#This Row],[Integridad]]+Tabla2[[#This Row],[Confidencialidad ]]<=7),\"Media\",IF(Tabla2[[#This Row],[Disponibilidad]]+Tabla2[[#This Row],[Integridad]]+Tabla2[[#This Row],[Confidencialidad ]]>=8,\"Alta\",\"error\")))","v":"Baja"}]
["",null,null,null,null,null,null,null,null,null,null,null,null,null,null,null,null,null,null,null,null,null,null,null,null,{"$f":"IF((Tabla2[[#This Row],[Disponibilidad]]+Tabla2[[#This Row],[Integridad]]+Tabla2[[#This Row],[Confidencialidad ]]<=4),\"Baja\",IF(AND(Tabla2[[#This Row],[Disponibilidad]]+Tabla2[[#This Row],[Integridad]]+Tabla2[[#This Row],[Confidencialidad ]]>=5,Tabla2[[#This Row],[Disponibilidad]]+Tabla2[[#This Row],[Integridad]]+Tabla2[[#This Row],[Confidencialidad ]]<=7),\"Media\",IF(Tabla2[[#This Row],[Disponibilidad]]+Tabla2[[#This Row],[Integridad]]+Tabla2[[#This Row],[Confidencialidad ]]>=8,\"Alta\",\"error\")))","v":"Baja"}]
["",null,null,null,null,null,null,null,null,null,null,null,null,null,null,null,null,null,null,null,null,null,null,null,null,{"$f":"IF((Tabla2[[#This Row],[Disponibilidad]]+Tabla2[[#This Row],[Integridad]]+Tabla2[[#This Row],[Confidencialidad ]]<=4),\"Baja\",IF(AND(Tabla2[[#This Row],[Disponibilidad]]+Tabla2[[#This Row],[Integridad]]+Tabla2[[#This Row],[Confidencialidad ]]>=5,Tabla2[[#This Row],[Disponibilidad]]+Tabla2[[#This Row],[Integridad]]+Tabla2[[#This Row],[Confidencialidad ]]<=7),\"Media\",IF(Tabla2[[#This Row],[Disponibilidad]]+Tabla2[[#This Row],[Integridad]]+Tabla2[[#This Row],[Confidencialidad ]]>=8,\"Alta\",\"error\")))","v":"Baja"}]
["",null,null,null,null,null,null,null,null,null,null,null,null,null,null,null,null,null,null,null,null,null,null,null,null,{"$f":"IF((Tabla2[[#This Row],[Disponibilidad]]+Tabla2[[#This Row],[Integridad]]+Tabla2[[#This Row],[Confidencialidad ]]<=4),\"Baja\",IF(AND(Tabla2[[#This Row],[Disponibilidad]]+Tabla2[[#This Row],[Integridad]]+Tabla2[[#This Row],[Confidencialidad ]]>=5,Tabla2[[#This Row],[Disponibilidad]]+Tabla2[[#This Row],[Integridad]]+Tabla2[[#This Row],[Confidencialidad ]]<=7),\"Media\",IF(Tabla2[[#This Row],[Disponibilidad]]+Tabla2[[#This Row],[Integridad]]+Tabla2[[#This Row],[Confidencialidad ]]>=8,\"Alta\",\"error\")))","v":"Baja"}]
["",null,null,null,null,null,null,null,null,null,null,null,null,null,null,null,null,null,null,null,null,null,null,null,null,{"$f":"IF((Tabla2[[#This Row],[Disponibilidad]]+Tabla2[[#This Row],[Integridad]]+Tabla2[[#This Row],[Confidencialidad ]]<=4),\"Baja\",IF(AND(Tabla2[[#This Row],[Disponibilidad]]+Tabla2[[#This Row],[Integridad]]+Tabla2[[#This Row],[Confidencialidad ]]>=5,Tabla2[[#This Row],[Disponibilidad]]+Tabla2[[#This Row],[Integridad]]+Tabla2[[#This Row],[Confidencialidad ]]<=7),\"Media\",IF(Tabla2[[#This Row],[Disponibilidad]]+Tabla2[[#This Row],[Integridad]]+Tabla2[[#This Row],[Confidencialidad ]]>=8,\"Alta\",\"error\")))","v":"Baja"}]
["",null,null,null,null,null,null,null,null,null,null,null,null,null,null,null,null,null,null,null,null,null,null,null,null,{"$f":"IF((Tabla2[[#This Row],[Disponibilidad]]+Tabla2[[#This Row],[Integridad]]+Tabla2[[#This Row],[Confidencialidad ]]<=4),\"Baja\",IF(AND(Tabla2[[#This Row],[Disponibilidad]]+Tabla2[[#This Row],[Integridad]]+Tabla2[[#This Row],[Confidencialidad ]]>=5,Tabla2[[#This Row],[Disponibilidad]]+Tabla2[[#This Row],[Integridad]]+Tabla2[[#This Row],[Confidencialidad ]]<=7),\"Media\",IF(Tabla2[[#This Row],[Disponibilidad]]+Tabla2[[#This Row],[Integridad]]+Tabla2[[#This Row],[Confidencialidad ]]>=8,\"Alta\",\"error\")))","v":"Baja"}]
["",null,null,null,null,null,null,null,null,null,null,null,null,null,null,null,null,null,null,null,null,null,null,null,null,{"$f":"IF((Tabla2[[#This Row],[Disponibilidad]]+Tabla2[[#This Row],[Integridad]]+Tabla2[[#This Row],[Confidencialidad ]]<=4),\"Baja\",IF(AND(Tabla2[[#This Row],[Disponibilidad]]+Tabla2[[#This Row],[Integridad]]+Tabla2[[#This Row],[Confidencialidad ]]>=5,Tabla2[[#This Row],[Disponibilidad]]+Tabla2[[#This Row],[Integridad]]+Tabla2[[#This Row],[Confidencialidad ]]<=7),\"Media\",IF(Tabla2[[#This Row],[Disponibilidad]]+Tabla2[[#This Row],[Integridad]]+Tabla2[[#This Row],[Confidencialidad ]]>=8,\"Alta\",\"error\")))","v":"Baja"}]
["",null,null,null,null,null,null,null,null,null,null,null,null,null,null,null,null,null,null,null,null,null,null,null,null,{"$f":"IF((Tabla2[[#This Row],[Disponibilidad]]+Tabla2[[#This Row],[Integridad]]+Tabla2[[#This Row],[Confidencialidad ]]<=4),\"Baja\",IF(AND(Tabla2[[#This Row],[Disponibilidad]]+Tabla2[[#This Row],[Integridad]]+Tabla2[[#This Row],[Confidencialidad ]]>=5,Tabla2[[#This Row],[Disponibilidad]]+Tabla2[[#This Row],[Integridad]]+Tabla2[[#This Row],[Confidencialidad ]]<=7),\"Media\",IF(Tabla2[[#This Row],[Disponibilidad]]+Tabla2[[#This Row],[Integridad]]+Tabla2[[#This Row],[Confidencialidad ]]>=8,\"Alta\",\"error\")))","v":"Baja"}]
["",null,null,null,null,null,null,null,null,null,null,null,null,null,null,null,null,null,null,null,null,null,null,null,null,{"$f":"IF((Tabla2[[#This Row],[Disponibilidad]]+Tabla2[[#This Row],[Integridad]]+Tabla2[[#This Row],[Confidencialidad ]]<=4),\"Baja\",IF(AND(Tabla2[[#This Row],[Disponibilidad]]+Tabla2[[#This Row],[Integridad]]+Tabla2[[#This Row],[Confidencialidad ]]>=5,Tabla2[[#This Row],[Disponibilidad]]+Tabla2[[#This Row],[Integridad]]+Tabla2[[#This Row],[Confidencialidad ]]<=7),\"Media\",IF(Tabla2[[#This Row],[Disponibilidad]]+Tabla2[[#This Row],[Integridad]]+Tabla2[[#This Row],[Confidencialidad ]]>=8,\"Alta\",\"error\")))","v":"Baja"}]
["",null,null,null,null,null,null,null,null,null,null,null,null,null,null,null,null,null,null,null,null,null,null,null,null,{"$f":"IF((Tabla2[[#This Row],[Disponibilidad]]+Tabla2[[#This Row],[Integridad]]+Tabla2[[#This Row],[Confidencialidad ]]<=4),\"Baja\",IF(AND(Tabla2[[#This Row],[Disponibilidad]]+Tabla2[[#This Row],[Integridad]]+Tabla2[[#This Row],[Confidencialidad ]]>=5,Tabla2[[#This Row],[Disponibilidad]]+Tabla2[[#This Row],[Integridad]]+Tabla2[[#This Row],[Confidencialidad ]]<=7),\"Media\",IF(Tabla2[[#This Row],[Disponibilidad]]+Tabla2[[#This Row],[Integridad]]+Tabla2[[#This Row],[Confidencialidad ]]>=8,\"Alta\",\"error\")))","v":"Baja"}]
["",null,null,null,null,null,null,null,null,null,null,null,null,null,null,null,null,null,null,null,null,null,null,null,null,{"$f":"IF((Tabla2[[#This Row],[Disponibilidad]]+Tabla2[[#This Row],[Integridad]]+Tabla2[[#This Row],[Confidencialidad ]]<=4),\"Baja\",IF(AND(Tabla2[[#This Row],[Disponibilidad]]+Tabla2[[#This Row],[Integridad]]+Tabla2[[#This Row],[Confidencialidad ]]>=5,Tabla2[[#This Row],[Disponibilidad]]+Tabla2[[#This Row],[Integridad]]+Tabla2[[#This Row],[Confidencialidad ]]<=7),\"Media\",IF(Tabla2[[#This Row],[Disponibilidad]]+Tabla2[[#This Row],[Integridad]]+Tabla2[[#This Row],[Confidencialidad ]]>=8,\"Alta\",\"error\")))","v":"Baja"}]
["",null,null,null,null,null,null,null,null,null,null,null,null,null,null,null,null,null,null,null,null,null,null,null,null,{"$f":"IF((Tabla2[[#This Row],[Disponibilidad]]+Tabla2[[#This Row],[Integridad]]+Tabla2[[#This Row],[Confidencialidad ]]<=4),\"Baja\",IF(AND(Tabla2[[#This Row],[Disponibilidad]]+Tabla2[[#This Row],[Integridad]]+Tabla2[[#This Row],[Confidencialidad ]]>=5,Tabla2[[#This Row],[Disponibilidad]]+Tabla2[[#This Row],[Integridad]]+Tabla2[[#This Row],[Confidencialidad ]]<=7),\"Media\",IF(Tabla2[[#This Row],[Disponibilidad]]+Tabla2[[#This Row],[Integridad]]+Tabla2[[#This Row],[Confidencialidad ]]>=8,\"Alta\",\"error\")))","v":"Baja"}]
["",null,null,null,null,null,null,null,null,null,null,null,null,null,null,null,null,null,null,null,null,null,null,null,null,{"$f":"IF((Tabla2[[#This Row],[Disponibilidad]]+Tabla2[[#This Row],[Integridad]]+Tabla2[[#This Row],[Confidencialidad ]]<=4),\"Baja\",IF(AND(Tabla2[[#This Row],[Disponibilidad]]+Tabla2[[#This Row],[Integridad]]+Tabla2[[#This Row],[Confidencialidad ]]>=5,Tabla2[[#This Row],[Disponibilidad]]+Tabla2[[#This Row],[Integridad]]+Tabla2[[#This Row],[Confidencialidad ]]<=7),\"Media\",IF(Tabla2[[#This Row],[Disponibilidad]]+Tabla2[[#This Row],[Integridad]]+Tabla2[[#This Row],[Confidencialidad ]]>=8,\"Alta\",\"error\")))","v":"Baja"}]
["",null,null,null,null,null,null,null,null,null,null,null,null,null,null,null,null,null,null,null,null,null,null,null,null,{"$f":"IF((Tabla2[[#This Row],[Disponibilidad]]+Tabla2[[#This Row],[Integridad]]+Tabla2[[#This Row],[Confidencialidad ]]<=4),\"Baja\",IF(AND(Tabla2[[#This Row],[Disponibilidad]]+Tabla2[[#This Row],[Integridad]]+Tabla2[[#This Row],[Confidencialidad ]]>=5,Tabla2[[#This Row],[Disponibilidad]]+Tabla2[[#This Row],[Integridad]]+Tabla2[[#This Row],[Confidencialidad ]]<=7),\"Media\",IF(Tabla2[[#This Row],[Disponibilidad]]+Tabla2[[#This Row],[Integridad]]+Tabla2[[#This Row],[Confidencialidad ]]>=8,\"Alta\",\"error\")))","v":"Baja"}]
["",null,null,null,null,null,null,null,null,null,null,null,null,null,null,null,null,null,null,null,null,null,null,null,null,{"$f":"IF((Tabla2[[#This Row],[Disponibilidad]]+Tabla2[[#This Row],[Integridad]]+Tabla2[[#This Row],[Confidencialidad ]]<=4),\"Baja\",IF(AND(Tabla2[[#This Row],[Disponibilidad]]+Tabla2[[#This Row],[Integridad]]+Tabla2[[#This Row],[Confidencialidad ]]>=5,Tabla2[[#This Row],[Disponibilidad]]+Tabla2[[#This Row],[Integridad]]+Tabla2[[#This Row],[Confidencialidad ]]<=7),\"Media\",IF(Tabla2[[#This Row],[Disponibilidad]]+Tabla2[[#This Row],[Integridad]]+Tabla2[[#This Row],[Confidencialidad ]]>=8,\"Alta\",\"error\")))","v":"Baja"}]
["",null,null,null,null,null,null,null,null,null,null,null,null,null,null,null,null,null,null,null,null,null,null,null,null,{"$f":"IF((Tabla2[[#This Row],[Disponibilidad]]+Tabla2[[#This Row],[Integridad]]+Tabla2[[#This Row],[Confidencialidad ]]<=4),\"Baja\",IF(AND(Tabla2[[#This Row],[Disponibilidad]]+Tabla2[[#This Row],[Integridad]]+Tabla2[[#This Row],[Confidencialidad ]]>=5,Tabla2[[#This Row],[Disponibilidad]]+Tabla2[[#This Row],[Integridad]]+Tabla2[[#This Row],[Confidencialidad ]]<=7),\"Media\",IF(Tabla2[[#This Row],[Disponibilidad]]+Tabla2[[#This Row],[Integridad]]+Tabla2[[#This Row],[Confidencialidad ]]>=8,\"Alta\",\"error\")))","v":"Baja"}]
["",null,null,null,null,null,null,null,null,null,null,null,null,null,null,null,null,null,null,null,null,null,null,null,null,{"$f":"IF((Tabla2[[#This Row],[Disponibilidad]]+Tabla2[[#This Row],[Integridad]]+Tabla2[[#This Row],[Confidencialidad ]]<=4),\"Baja\",IF(AND(Tabla2[[#This Row],[Disponibilidad]]+Tabla2[[#This Row],[Integridad]]+Tabla2[[#This Row],[Confidencialidad ]]>=5,Tabla2[[#This Row],[Disponibilidad]]+Tabla2[[#This Row],[Integridad]]+Tabla2[[#This Row],[Confidencialidad ]]<=7),\"Media\",IF(Tabla2[[#This Row],[Disponibilidad]]+Tabla2[[#This Row],[Integridad]]+Tabla2[[#This Row],[Confidencialidad ]]>=8,\"Alta\",\"error\")))","v":"Baja"}]
["",null,null,null,null,null,null,null,null,null,null,null,null,null,null,null,null,null,null,null,null,null,null,null,null,{"$f":"IF((Tabla2[[#This Row],[Disponibilidad]]+Tabla2[[#This Row],[Integridad]]+Tabla2[[#This Row],[Confidencialidad ]]<=4),\"Baja\",IF(AND(Tabla2[[#This Row],[Disponibilidad]]+Tabla2[[#This Row],[Integridad]]+Tabla2[[#This Row],[Confidencialidad ]]>=5,Tabla2[[#This Row],[Disponibilidad]]+Tabla2[[#This Row],[Integridad]]+Tabla2[[#This Row],[Confidencialidad ]]<=7),\"Media\",IF(Tabla2[[#This Row],[Disponibilidad]]+Tabla2[[#This Row],[Integridad]]+Tabla2[[#This Row],[Confidencialidad ]]>=8,\"Alta\",\"error\")))","v":"Baja"}]
["",null,null,null,null,null,null,null,null,null,null,null,null,null,null,null,null,null,null,null,null,null,null,null,null,{"$f":"IF((Tabla2[[#This Row],[Disponibilidad]]+Tabla2[[#This Row],[Integridad]]+Tabla2[[#This Row],[Confidencialidad ]]<=4),\"Baja\",IF(AND(Tabla2[[#This Row],[Disponibilidad]]+Tabla2[[#This Row],[Integridad]]+Tabla2[[#This Row],[Confidencialidad ]]>=5,Tabla2[[#This Row],[Disponibilidad]]+Tabla2[[#This Row],[Integridad]]+Tabla2[[#This Row],[Confidencialidad ]]<=7),\"Media\",IF(Tabla2[[#This Row],[Disponibilidad]]+Tabla2[[#This Row],[Integridad]]+Tabla2[[#This Row],[Confidencialidad ]]>=8,\"Alta\",\"error\")))","v":"Baja"}]
["",null,null,null,null,null,null,null,null,null,null,null,null,null,null,null,null,null,null,null,null,null,null,null,null,{"$f":"IF((Tabla2[[#This Row],[Disponibilidad]]+Tabla2[[#This Row],[Integridad]]+Tabla2[[#This Row],[Confidencialidad ]]<=4),\"Baja\",IF(AND(Tabla2[[#This Row],[Disponibilidad]]+Tabla2[[#This Row],[Integridad]]+Tabla2[[#This Row],[Confidencialidad ]]>=5,Tabla2[[#This Row],[Disponibilidad]]+Tabla2[[#This Row],[Integridad]]+Tabla2[[#This Row],[Confidencialidad ]]<=7),\"Media\",IF(Tabla2[[#This Row],[Disponibilidad]]+Tabla2[[#This Row],[Integridad]]+Tabla2[[#This Row],[Confidencialidad ]]>=8,\"Alta\",\"error\")))","v":"Baja"}]
["",null,null,null,null,null,null,null,null,null,null,null,null,null,null,null,null,null,null,null,null,null,null,null,null,{"$f":"IF((Tabla2[[#This Row],[Disponibilidad]]+Tabla2[[#This Row],[Integridad]]+Tabla2[[#This Row],[Confidencialidad ]]<=4),\"Baja\",IF(AND(Tabla2[[#This Row],[Disponibilidad]]+Tabla2[[#This Row],[Integridad]]+Tabla2[[#This Row],[Confidencialidad ]]>=5,Tabla2[[#This Row],[Disponibilidad]]+Tabla2[[#This Row],[Integridad]]+Tabla2[[#This Row],[Confidencialidad ]]<=7),\"Media\",IF(Tabla2[[#This Row],[Disponibilidad]]+Tabla2[[#This Row],[Integridad]]+Tabla2[[#This Row],[Confidencialidad ]]>=8,\"Alta\",\"error\")))","v":"Baja"}]
["",null,null,null,null,null,null,null,null,null,null,null,null,null,null,null,null,null,null,null,null,null,null,null,null,{"$f":"IF((Tabla2[[#This Row],[Disponibilidad]]+Tabla2[[#This Row],[Integridad]]+Tabla2[[#This Row],[Confidencialidad ]]<=4),\"Baja\",IF(AND(Tabla2[[#This Row],[Disponibilidad]]+Tabla2[[#This Row],[Integridad]]+Tabla2[[#This Row],[Confidencialidad ]]>=5,Tabla2[[#This Row],[Disponibilidad]]+Tabla2[[#This Row],[Integridad]]+Tabla2[[#This Row],[Confidencialidad ]]<=7),\"Media\",IF(Tabla2[[#This Row],[Disponibilidad]]+Tabla2[[#This Row],[Integridad]]+Tabla2[[#This Row],[Confidencialidad ]]>=8,\"Alta\",\"error\")))","v":"Baja"}]
["",null,null,null,null,null,null,null,null,null,null,null,null,null,null,null,null,null,null,null,null,null,null,null,null,{"$f":"IF((Tabla2[[#This Row],[Disponibilidad]]+Tabla2[[#This Row],[Integridad]]+Tabla2[[#This Row],[Confidencialidad ]]<=4),\"Baja\",IF(AND(Tabla2[[#This Row],[Disponibilidad]]+Tabla2[[#This Row],[Integridad]]+Tabla2[[#This Row],[Confidencialidad ]]>=5,Tabla2[[#This Row],[Disponibilidad]]+Tabla2[[#This Row],[Integridad]]+Tabla2[[#This Row],[Confidencialidad ]]<=7),\"Media\",IF(Tabla2[[#This Row],[Disponibilidad]]+Tabla2[[#This Row],[Integridad]]+Tabla2[[#This Row],[Confidencialidad ]]>=8,\"Alta\",\"error\")))","v":"Baja"}]
["",null,null,null,null,null,null,null,null,null,null,null,null,null,null,null,null,null,null,null,null,null,null,null,null,{"$f":"IF((Tabla2[[#This Row],[Disponibilidad]]+Tabla2[[#This Row],[Integridad]]+Tabla2[[#This Row],[Confidencialidad ]]<=4),\"Baja\",IF(AND(Tabla2[[#This Row],[Disponibilidad]]+Tabla2[[#This Row],[Integridad]]+Tabla2[[#This Row],[Confidencialidad ]]>=5,Tabla2[[#This Row],[Disponibilidad]]+Tabla2[[#This Row],[Integridad]]+Tabla2[[#This Row],[Confidencialidad ]]<=7),\"Media\",IF(Tabla2[[#This Row],[Disponibilidad]]+Tabla2[[#This Row],[Integridad]]+Tabla2[[#This Row],[Confidencialidad ]]>=8,\"Alta\",\"error\")))","v":"Baja"}]
["",null,null,null,null,null,null,null,null,null,null,null,null,null,null,null,null,null,null,null,null,null,null,null,null,{"$f":"IF((Tabla2[[#This Row],[Disponibilidad]]+Tabla2[[#This Row],[Integridad]]+Tabla2[[#This Row],[Confidencialidad ]]<=4),\"Baja\",IF(AND(Tabla2[[#This Row],[Disponibilidad]]+Tabla2[[#This Row],[Integridad]]+Tabla2[[#This Row],[Confidencialidad ]]>=5,Tabla2[[#This Row],[Disponibilidad]]+Tabla2[[#This Row],[Integridad]]+Tabla2[[#This Row],[Confidencialidad ]]<=7),\"Media\",IF(Tabla2[[#This Row],[Disponibilidad]]+Tabla2[[#This Row],[Integridad]]+Tabla2[[#This Row],[Confidencialidad ]]>=8,\"Alta\",\"error\")))","v":"Baja"}]
["",null,null,null,null,null,null,null,null,null,null,null,null,null,null,null,null,null,null,null,null,null,null,null,null,{"$f":"IF((Tabla2[[#This Row],[Disponibilidad]]+Tabla2[[#This Row],[Integridad]]+Tabla2[[#This Row],[Confidencialidad ]]<=4),\"Baja\",IF(AND(Tabla2[[#This Row],[Disponibilidad]]+Tabla2[[#This Row],[Integridad]]+Tabla2[[#This Row],[Confidencialidad ]]>=5,Tabla2[[#This Row],[Disponibilidad]]+Tabla2[[#This Row],[Integridad]]+Tabla2[[#This Row],[Confidencialidad ]]<=7),\"Media\",IF(Tabla2[[#This Row],[Disponibilidad]]+Tabla2[[#This Row],[Integridad]]+Tabla2[[#This Row],[Confidencialidad ]]>=8,\"Alta\",\"error\")))","v":"Baja"}]
["",null,null,null,null,null,null,null,null,null,null,null,null,null,null,null,null,null,null,null,null,null,null,null,null,{"$f":"IF((Tabla2[[#This Row],[Disponibilidad]]+Tabla2[[#This Row],[Integridad]]+Tabla2[[#This Row],[Confidencialidad ]]<=4),\"Baja\",IF(AND(Tabla2[[#This Row],[Disponibilidad]]+Tabla2[[#This Row],[Integridad]]+Tabla2[[#This Row],[Confidencialidad ]]>=5,Tabla2[[#This Row],[Disponibilidad]]+Tabla2[[#This Row],[Integridad]]+Tabla2[[#This Row],[Confidencialidad ]]<=7),\"Media\",IF(Tabla2[[#This Row],[Disponibilidad]]+Tabla2[[#This Row],[Integridad]]+Tabla2[[#This Row],[Confidencialidad ]]>=8,\"Alta\",\"error\")))","v":"Baja"}]
["",null,null,null,null,null,null,null,null,null,null,null,null,null,null,null,null,null,null,null,null,null,null,null,null,{"$f":"IF((Tabla2[[#This Row],[Disponibilidad]]+Tabla2[[#This Row],[Integridad]]+Tabla2[[#This Row],[Confidencialidad ]]<=4),\"Baja\",IF(AND(Tabla2[[#This Row],[Disponibilidad]]+Tabla2[[#This Row],[Integridad]]+Tabla2[[#This Row],[Confidencialidad ]]>=5,Tabla2[[#This Row],[Disponibilidad]]+Tabla2[[#This Row],[Integridad]]+Tabla2[[#This Row],[Confidencialidad ]]<=7),\"Media\",IF(Tabla2[[#This Row],[Disponibilidad]]+Tabla2[[#This Row],[Integridad]]+Tabla2[[#This Row],[Confidencialidad ]]>=8,\"Alta\",\"error\")))","v":"Baja"}]
["",null,null,null,null,null,null,null,null,null,null,null,null,null,null,null,null,null,null,null,null,null,null,null,null,{"$f":"IF((Tabla2[[#This Row],[Disponibilidad]]+Tabla2[[#This Row],[Integridad]]+Tabla2[[#This Row],[Confidencialidad ]]<=4),\"Baja\",IF(AND(Tabla2[[#This Row],[Disponibilidad]]+Tabla2[[#This Row],[Integridad]]+Tabla2[[#This Row],[Confidencialidad ]]>=5,Tabla2[[#This Row],[Disponibilidad]]+Tabla2[[#This Row],[Integridad]]+Tabla2[[#This Row],[Confidencialidad ]]<=7),\"Media\",IF(Tabla2[[#This Row],[Disponibilidad]]+Tabla2[[#This Row],[Integridad]]+Tabla2[[#This Row],[Confidencialidad ]]>=8,\"Alta\",\"error\")))","v":"Baja"}]
["",null,null,null,null,null,null,null,null,null,null,null,null,null,null,null,null,null,null,null,null,null,null,null,null,{"$f":"IF((Tabla2[[#This Row],[Disponibilidad]]+Tabla2[[#This Row],[Integridad]]+Tabla2[[#This Row],[Confidencialidad ]]<=4),\"Baja\",IF(AND(Tabla2[[#This Row],[Disponibilidad]]+Tabla2[[#This Row],[Integridad]]+Tabla2[[#This Row],[Confidencialidad ]]>=5,Tabla2[[#This Row],[Disponibilidad]]+Tabla2[[#This Row],[Integridad]]+Tabla2[[#This Row],[Confidencialidad ]]<=7),\"Media\",IF(Tabla2[[#This Row],[Disponibilidad]]+Tabla2[[#This Row],[Integridad]]+Tabla2[[#This Row],[Confidencialidad ]]>=8,\"Alta\",\"error\")))","v":"Baja"}]
["",null,null,null,null,null,null,null,null,null,null,null,null,null,null,null,null,null,null,null,null,null,null,null,null,{"$f":"IF((Tabla2[[#This Row],[Disponibilidad]]+Tabla2[[#This Row],[Integridad]]+Tabla2[[#This Row],[Confidencialidad ]]<=4),\"Baja\",IF(AND(Tabla2[[#This Row],[Disponibilidad]]+Tabla2[[#This Row],[Integridad]]+Tabla2[[#This Row],[Confidencialidad ]]>=5,Tabla2[[#This Row],[Disponibilidad]]+Tabla2[[#This Row],[Integridad]]+Tabla2[[#This Row],[Confidencialidad ]]<=7),\"Media\",IF(Tabla2[[#This Row],[Disponibilidad]]+Tabla2[[#This Row],[Integridad]]+Tabla2[[#This Row],[Confidencialidad ]]>=8,\"Alta\",\"error\")))","v":"Baja"}]
["",null,null,null,null,null,null,null,null,null,null,null,null,null,null,null,null,null,null,null,null,null,null,null,null,{"$f":"IF((Tabla2[[#This Row],[Disponibilidad]]+Tabla2[[#This Row],[Integridad]]+Tabla2[[#This Row],[Confidencialidad ]]<=4),\"Baja\",IF(AND(Tabla2[[#This Row],[Disponibilidad]]+Tabla2[[#This Row],[Integridad]]+Tabla2[[#This Row],[Confidencialidad ]]>=5,Tabla2[[#This Row],[Disponibilidad]]+Tabla2[[#This Row],[Integridad]]+Tabla2[[#This Row],[Confidencialidad ]]<=7),\"Media\",IF(Tabla2[[#This Row],[Disponibilidad]]+Tabla2[[#This Row],[Integridad]]+Tabla2[[#This Row],[Confidencialidad ]]>=8,\"Alta\",\"error\")))","v":"Baja"}]
["",null,null,null,null,null,null,null,null,null,null,null,null,null,null,null,null,null,null,null,null,null,null,null,null,{"$f":"IF((Tabla2[[#This Row],[Disponibilidad]]+Tabla2[[#This Row],[Integridad]]+Tabla2[[#This Row],[Confidencialidad ]]<=4),\"Baja\",IF(AND(Tabla2[[#This Row],[Disponibilidad]]+Tabla2[[#This Row],[Integridad]]+Tabla2[[#This Row],[Confidencialidad ]]>=5,Tabla2[[#This Row],[Disponibilidad]]+Tabla2[[#This Row],[Integridad]]+Tabla2[[#This Row],[Confidencialidad ]]<=7),\"Media\",IF(Tabla2[[#This Row],[Disponibilidad]]+Tabla2[[#This Row],[Integridad]]+Tabla2[[#This Row],[Confidencialidad ]]>=8,\"Alta\",\"error\")))","v":"Baja"}]
["",null,null,null,null,null,null,null,null,null,null,null,null,null,null,null,null,null,null,null,null,null,null,null,null,{"$f":"IF((Tabla2[[#This Row],[Disponibilidad]]+Tabla2[[#This Row],[Integridad]]+Tabla2[[#This Row],[Confidencialidad ]]<=4),\"Baja\",IF(AND(Tabla2[[#This Row],[Disponibilidad]]+Tabla2[[#This Row],[Integridad]]+Tabla2[[#This Row],[Confidencialidad ]]>=5,Tabla2[[#This Row],[Disponibilidad]]+Tabla2[[#This Row],[Integridad]]+Tabla2[[#This Row],[Confidencialidad ]]<=7),\"Media\",IF(Tabla2[[#This Row],[Disponibilidad]]+Tabla2[[#This Row],[Integridad]]+Tabla2[[#This Row],[Confidencialidad ]]>=8,\"Alta\",\"error\")))","v":"Baja"}]
["",null,null,null,null,null,null,null,null,null,null,null,null,null,null,null,null,null,null,null,null,null,null,null,null,{"$f":"IF((Tabla2[[#This Row],[Disponibilidad]]+Tabla2[[#This Row],[Integridad]]+Tabla2[[#This Row],[Confidencialidad ]]<=4),\"Baja\",IF(AND(Tabla2[[#This Row],[Disponibilidad]]+Tabla2[[#This Row],[Integridad]]+Tabla2[[#This Row],[Confidencialidad ]]>=5,Tabla2[[#This Row],[Disponibilidad]]+Tabla2[[#This Row],[Integridad]]+Tabla2[[#This Row],[Confidencialidad ]]<=7),\"Media\",IF(Tabla2[[#This Row],[Disponibilidad]]+Tabla2[[#This Row],[Integridad]]+Tabla2[[#This Row],[Confidencialidad ]]>=8,\"Alta\",\"error\")))","v":"Baja"}]
["",null,null,null,null,null,null,null,null,null,null,null,null,null,null,null,null,null,null,null,null,null,null,null,null,{"$f":"IF((Tabla2[[#This Row],[Disponibilidad]]+Tabla2[[#This Row],[Integridad]]+Tabla2[[#This Row],[Confidencialidad ]]<=4),\"Baja\",IF(AND(Tabla2[[#This Row],[Disponibilidad]]+Tabla2[[#This Row],[Integridad]]+Tabla2[[#This Row],[Confidencialidad ]]>=5,Tabla2[[#This Row],[Disponibilidad]]+Tabla2[[#This Row],[Integridad]]+Tabla2[[#This Row],[Confidencialidad ]]<=7),\"Media\",IF(Tabla2[[#This Row],[Disponibilidad]]+Tabla2[[#This Row],[Integridad]]+Tabla2[[#This Row],[Confidencialidad ]]>=8,\"Alta\",\"error\")))","v":"Baja"}]
["",null,null,null,null,null,null,null,null,null,null,null,null,null,null,null,null,null,null,null,null,null,null,null,null,{"$f":"IF((Tabla2[[#This Row],[Disponibilidad]]+Tabla2[[#This Row],[Integridad]]+Tabla2[[#This Row],[Confidencialidad ]]<=4),\"Baja\",IF(AND(Tabla2[[#This Row],[Disponibilidad]]+Tabla2[[#This Row],[Integridad]]+Tabla2[[#This Row],[Confidencialidad ]]>=5,Tabla2[[#This Row],[Disponibilidad]]+Tabla2[[#This Row],[Integridad]]+Tabla2[[#This Row],[Confidencialidad ]]<=7),\"Media\",IF(Tabla2[[#This Row],[Disponibilidad]]+Tabla2[[#This Row],[Integridad]]+Tabla2[[#This Row],[Confidencialidad ]]>=8,\"Alta\",\"error\")))","v":"Baja"}]
["",null,null,null,null,null,null,null,null,null,null,null,null,null,null,null,null,null,null,null,null,null,null,null,null,{"$f":"IF((Tabla2[[#This Row],[Disponibilidad]]+Tabla2[[#This Row],[Integridad]]+Tabla2[[#This Row],[Confidencialidad ]]<=4),\"Baja\",IF(AND(Tabla2[[#This Row],[Disponibilidad]]+Tabla2[[#This Row],[Integridad]]+Tabla2[[#This Row],[Confidencialidad ]]>=5,Tabla2[[#This Row],[Disponibilidad]]+Tabla2[[#This Row],[Integridad]]+Tabla2[[#This Row],[Confidencialidad ]]<=7),\"Media\",IF(Tabla2[[#This Row],[Disponibilidad]]+Tabla2[[#This Row],[Integridad]]+Tabla2[[#This Row],[Confidencialidad ]]>=8,\"Alta\",\"error\")))","v":"Baja"}]
["",null,null,null,null,null,null,null,null,null,null,null,null,null,null,null,null,null,null,null,null,null,null,null,null,{"$f":"IF((Tabla2[[#This Row],[Disponibilidad]]+Tabla2[[#This Row],[Integridad]]+Tabla2[[#This Row],[Confidencialidad ]]<=4),\"Baja\",IF(AND(Tabla2[[#This Row],[Disponibilidad]]+Tabla2[[#This Row],[Integridad]]+Tabla2[[#This Row],[Confidencialidad ]]>=5,Tabla2[[#This Row],[Disponibilidad]]+Tabla2[[#This Row],[Integridad]]+Tabla2[[#This Row],[Confidencialidad ]]<=7),\"Media\",IF(Tabla2[[#This Row],[Disponibilidad]]+Tabla2[[#This Row],[Integridad]]+Tabla2[[#This Row],[Confidencialidad ]]>=8,\"Alta\",\"error\")))","v":"Baja"}]
["",null,null,null,null,null,null,null,null,null,null,null,null,null,null,null,null,null,null,null,null,null,null,null,null,{"$f":"IF((Tabla2[[#This Row],[Disponibilidad]]+Tabla2[[#This Row],[Integridad]]+Tabla2[[#This Row],[Confidencialidad ]]<=4),\"Baja\",IF(AND(Tabla2[[#This Row],[Disponibilidad]]+Tabla2[[#This Row],[Integridad]]+Tabla2[[#This Row],[Confidencialidad ]]>=5,Tabla2[[#This Row],[Disponibilidad]]+Tabla2[[#This Row],[Integridad]]+Tabla2[[#This Row],[Confidencialidad ]]<=7),\"Media\",IF(Tabla2[[#This Row],[Disponibilidad]]+Tabla2[[#This Row],[Integridad]]+Tabla2[[#This Row],[Confidencialidad ]]>=8,\"Alta\",\"error\")))","v":"Baja"}]
["",null,null,null,null,null,null,null,null,null,null,null,null,null,null,null,null,null,null,null,null,null,null,null,null,{"$f":"IF((Tabla2[[#This Row],[Disponibilidad]]+Tabla2[[#This Row],[Integridad]]+Tabla2[[#This Row],[Confidencialidad ]]<=4),\"Baja\",IF(AND(Tabla2[[#This Row],[Disponibilidad]]+Tabla2[[#This Row],[Integridad]]+Tabla2[[#This Row],[Confidencialidad ]]>=5,Tabla2[[#This Row],[Disponibilidad]]+Tabla2[[#This Row],[Integridad]]+Tabla2[[#This Row],[Confidencialidad ]]<=7),\"Media\",IF(Tabla2[[#This Row],[Disponibilidad]]+Tabla2[[#This Row],[Integridad]]+Tabla2[[#This Row],[Confidencialidad ]]>=8,\"Alta\",\"error\")))","v":"Baja"}]
["",null,null,null,null,null,null,null,null,null,null,null,null,null,null,null,null,null,null,null,null,null,null,null,null,{"$f":"IF((Tabla2[[#This Row],[Disponibilidad]]+Tabla2[[#This Row],[Integridad]]+Tabla2[[#This Row],[Confidencialidad ]]<=4),\"Baja\",IF(AND(Tabla2[[#This Row],[Disponibilidad]]+Tabla2[[#This Row],[Integridad]]+Tabla2[[#This Row],[Confidencialidad ]]>=5,Tabla2[[#This Row],[Disponibilidad]]+Tabla2[[#This Row],[Integridad]]+Tabla2[[#This Row],[Confidencialidad ]]<=7),\"Media\",IF(Tabla2[[#This Row],[Disponibilidad]]+Tabla2[[#This Row],[Integridad]]+Tabla2[[#This Row],[Confidencialidad ]]>=8,\"Alta\",\"error\")))","v":"Baja"}]
["",null,null,null,null,null,null,null,null,null,null,null,null,null,null,null,null,null,null,null,null,null,null,null,null,{"$f":"IF((Tabla2[[#This Row],[Disponibilidad]]+Tabla2[[#This Row],[Integridad]]+Tabla2[[#This Row],[Confidencialidad ]]<=4),\"Baja\",IF(AND(Tabla2[[#This Row],[Disponibilidad]]+Tabla2[[#This Row],[Integridad]]+Tabla2[[#This Row],[Confidencialidad ]]>=5,Tabla2[[#This Row],[Disponibilidad]]+Tabla2[[#This Row],[Integridad]]+Tabla2[[#This Row],[Confidencialidad ]]<=7),\"Media\",IF(Tabla2[[#This Row],[Disponibilidad]]+Tabla2[[#This Row],[Integridad]]+Tabla2[[#This Row],[Confidencialidad ]]>=8,\"Alta\",\"error\")))","v":"Baja"}]
["",null,null,null,null,null,null,null,null,null,null,null,null,null,null,null,null,null,null,null,null,null,null,null,null,{"$f":"IF((Tabla2[[#This Row],[Disponibilidad]]+Tabla2[[#This Row],[Integridad]]+Tabla2[[#This Row],[Confidencialidad ]]<=4),\"Baja\",IF(AND(Tabla2[[#This Row],[Disponibilidad]]+Tabla2[[#This Row],[Integridad]]+Tabla2[[#This Row],[Confidencialidad ]]>=5,Tabla2[[#This Row],[Disponibilidad]]+Tabla2[[#This Row],[Integridad]]+Tabla2[[#This Row],[Confidencialidad ]]<=7),\"Media\",IF(Tabla2[[#This Row],[Disponibilidad]]+Tabla2[[#This Row],[Integridad]]+Tabla2[[#This Row],[Confidencialidad ]]>=8,\"Alta\",\"error\")))","v":"Baja"}]
["",null,null,null,null,null,null,null,null,null,null,null,null,null,null,null,null,null,null,null,null,null,null,null,null,{"$f":"IF((Tabla2[[#This Row],[Disponibilidad]]+Tabla2[[#This Row],[Integridad]]+Tabla2[[#This Row],[Confidencialidad ]]<=4),\"Baja\",IF(AND(Tabla2[[#This Row],[Disponibilidad]]+Tabla2[[#This Row],[Integridad]]+Tabla2[[#This Row],[Confidencialidad ]]>=5,Tabla2[[#This Row],[Disponibilidad]]+Tabla2[[#This Row],[Integridad]]+Tabla2[[#This Row],[Confidencialidad ]]<=7),\"Media\",IF(Tabla2[[#This Row],[Disponibilidad]]+Tabla2[[#This Row],[Integridad]]+Tabla2[[#This Row],[Confidencialidad ]]>=8,\"Alta\",\"error\")))","v":"Baja"}]
["",null,null,null,null,null,null,null,null,null,null,null,null,null,null,null,null,null,null,null,null,null,null,null,null,{"$f":"IF((Tabla2[[#This Row],[Disponibilidad]]+Tabla2[[#This Row],[Integridad]]+Tabla2[[#This Row],[Confidencialidad ]]<=4),\"Baja\",IF(AND(Tabla2[[#This Row],[Disponibilidad]]+Tabla2[[#This Row],[Integridad]]+Tabla2[[#This Row],[Confidencialidad ]]>=5,Tabla2[[#This Row],[Disponibilidad]]+Tabla2[[#This Row],[Integridad]]+Tabla2[[#This Row],[Confidencialidad ]]<=7),\"Media\",IF(Tabla2[[#This Row],[Disponibilidad]]+Tabla2[[#This Row],[Integridad]]+Tabla2[[#This Row],[Confidencialidad ]]>=8,\"Alta\",\"error\")))","v":"Baja"}]
["",null,null,null,null,null,null,null,null,null,null,null,null,null,null,null,null,null,null,null,null,null,null,null,null,{"$f":"IF((Tabla2[[#This Row],[Disponibilidad]]+Tabla2[[#This Row],[Integridad]]+Tabla2[[#This Row],[Confidencialidad ]]<=4),\"Baja\",IF(AND(Tabla2[[#This Row],[Disponibilidad]]+Tabla2[[#This Row],[Integridad]]+Tabla2[[#This Row],[Confidencialidad ]]>=5,Tabla2[[#This Row],[Disponibilidad]]+Tabla2[[#This Row],[Integridad]]+Tabla2[[#This Row],[Confidencialidad ]]<=7),\"Media\",IF(Tabla2[[#This Row],[Disponibilidad]]+Tabla2[[#This Row],[Integridad]]+Tabla2[[#This Row],[Confidencialidad ]]>=8,\"Alta\",\"error\")))","v":"Baja"}]
["",null,null,null,null,null,null,null,null,null,null,null,null,null,null,null,null,null,null,null,null,null,null,null,null,{"$f":"IF((Tabla2[[#This Row],[Disponibilidad]]+Tabla2[[#This Row],[Integridad]]+Tabla2[[#This Row],[Confidencialidad ]]<=4),\"Baja\",IF(AND(Tabla2[[#This Row],[Disponibilidad]]+Tabla2[[#This Row],[Integridad]]+Tabla2[[#This Row],[Confidencialidad ]]>=5,Tabla2[[#This Row],[Disponibilidad]]+Tabla2[[#This Row],[Integridad]]+Tabla2[[#This Row],[Confidencialidad ]]<=7),\"Media\",IF(Tabla2[[#This Row],[Disponibilidad]]+Tabla2[[#This Row],[Integridad]]+Tabla2[[#This Row],[Confidencialidad ]]>=8,\"Alta\",\"error\")))","v":"Baja"}]
["",null,null,null,null,null,null,null,null,null,null,null,null,null,null,null,null,null,null,null,null,null,null,null,null,{"$f":"IF((Tabla2[[#This Row],[Disponibilidad]]+Tabla2[[#This Row],[Integridad]]+Tabla2[[#This Row],[Confidencialidad ]]<=4),\"Baja\",IF(AND(Tabla2[[#This Row],[Disponibilidad]]+Tabla2[[#This Row],[Integridad]]+Tabla2[[#This Row],[Confidencialidad ]]>=5,Tabla2[[#This Row],[Disponibilidad]]+Tabla2[[#This Row],[Integridad]]+Tabla2[[#This Row],[Confidencialidad ]]<=7),\"Media\",IF(Tabla2[[#This Row],[Disponibilidad]]+Tabla2[[#This Row],[Integridad]]+Tabla2[[#This Row],[Confidencialidad ]]>=8,\"Alta\",\"error\")))","v":"Baja"}]
["",null,null,null,null,null,null,null,null,null,null,null,null,null,null,null,null,null,null,null,null,null,null,null,null,{"$f":"IF((Tabla2[[#This Row],[Disponibilidad]]+Tabla2[[#This Row],[Integridad]]+Tabla2[[#This Row],[Confidencialidad ]]<=4),\"Baja\",IF(AND(Tabla2[[#This Row],[Disponibilidad]]+Tabla2[[#This Row],[Integridad]]+Tabla2[[#This Row],[Confidencialidad ]]>=5,Tabla2[[#This Row],[Disponibilidad]]+Tabla2[[#This Row],[Integridad]]+Tabla2[[#This Row],[Confidencialidad ]]<=7),\"Media\",IF(Tabla2[[#This Row],[Disponibilidad]]+Tabla2[[#This Row],[Integridad]]+Tabla2[[#This Row],[Confidencialidad ]]>=8,\"Alta\",\"error\")))","v":"Baja"}]
["",null,null,null,null,null,null,null,null,null,null,null,null,null,null,null,null,null,null,null,null,null,null,null,null,{"$f":"IF((Tabla2[[#This Row],[Disponibilidad]]+Tabla2[[#This Row],[Integridad]]+Tabla2[[#This Row],[Confidencialidad ]]<=4),\"Baja\",IF(AND(Tabla2[[#This Row],[Disponibilidad]]+Tabla2[[#This Row],[Integridad]]+Tabla2[[#This Row],[Confidencialidad ]]>=5,Tabla2[[#This Row],[Disponibilidad]]+Tabla2[[#This Row],[Integridad]]+Tabla2[[#This Row],[Confidencialidad ]]<=7),\"Media\",IF(Tabla2[[#This Row],[Disponibilidad]]+Tabla2[[#This Row],[Integridad]]+Tabla2[[#This Row],[Confidencialidad ]]>=8,\"Alta\",\"error\")))","v":"Baja"}]
["",null,null,null,null,null,null,null,null,null,null,null,null,null,null,null,null,null,null,null,null,null,null,null,null,{"$f":"IF((Tabla2[[#This Row],[Disponibilidad]]+Tabla2[[#This Row],[Integridad]]+Tabla2[[#This Row],[Confidencialidad ]]<=4),\"Baja\",IF(AND(Tabla2[[#This Row],[Disponibilidad]]+Tabla2[[#This Row],[Integridad]]+Tabla2[[#This Row],[Confidencialidad ]]>=5,Tabla2[[#This Row],[Disponibilidad]]+Tabla2[[#This Row],[Integridad]]+Tabla2[[#This Row],[Confidencialidad ]]<=7),\"Media\",IF(Tabla2[[#This Row],[Disponibilidad]]+Tabla2[[#This Row],[Integridad]]+Tabla2[[#This Row],[Confidencialidad ]]>=8,\"Alta\",\"error\")))","v":"Baja"}]
["",null,null,null,null,null,null,null,null,null,null,null,null,null,null,null,null,null,null,null,null,null,null,null,null,{"$f":"IF((Tabla2[[#This Row],[Disponibilidad]]+Tabla2[[#This Row],[Integridad]]+Tabla2[[#This Row],[Confidencialidad ]]<=4),\"Baja\",IF(AND(Tabla2[[#This Row],[Disponibilidad]]+Tabla2[[#This Row],[Integridad]]+Tabla2[[#This Row],[Confidencialidad ]]>=5,Tabla2[[#This Row],[Disponibilidad]]+Tabla2[[#This Row],[Integridad]]+Tabla2[[#This Row],[Confidencialidad ]]<=7),\"Media\",IF(Tabla2[[#This Row],[Disponibilidad]]+Tabla2[[#This Row],[Integridad]]+Tabla2[[#This Row],[Confidencialidad ]]>=8,\"Alta\",\"error\")))","v":"Baja"}]
["",null,null,null,null,null,null,null,null,null,null,null,null,null,null,null,null,null,null,null,null,null,null,null,null,{"$f":"IF((Tabla2[[#This Row],[Disponibilidad]]+Tabla2[[#This Row],[Integridad]]+Tabla2[[#This Row],[Confidencialidad ]]<=4),\"Baja\",IF(AND(Tabla2[[#This Row],[Disponibilidad]]+Tabla2[[#This Row],[Integridad]]+Tabla2[[#This Row],[Confidencialidad ]]>=5,Tabla2[[#This Row],[Disponibilidad]]+Tabla2[[#This Row],[Integridad]]+Tabla2[[#This Row],[Confidencialidad ]]<=7),\"Media\",IF(Tabla2[[#This Row],[Disponibilidad]]+Tabla2[[#This Row],[Integridad]]+Tabla2[[#This Row],[Confidencialidad ]]>=8,\"Alta\",\"error\")))","v":"Baja"}]
["",null,null,null,null,null,null,null,null,null,null,null,null,null,null,null,null,null,null,null,null,null,null,null,null,{"$f":"IF((Tabla2[[#This Row],[Disponibilidad]]+Tabla2[[#This Row],[Integridad]]+Tabla2[[#This Row],[Confidencialidad ]]<=4),\"Baja\",IF(AND(Tabla2[[#This Row],[Disponibilidad]]+Tabla2[[#This Row],[Integridad]]+Tabla2[[#This Row],[Confidencialidad ]]>=5,Tabla2[[#This Row],[Disponibilidad]]+Tabla2[[#This Row],[Integridad]]+Tabla2[[#This Row],[Confidencialidad ]]<=7),\"Media\",IF(Tabla2[[#This Row],[Disponibilidad]]+Tabla2[[#This Row],[Integridad]]+Tabla2[[#This Row],[Confidencialidad ]]>=8,\"Alta\",\"error\")))","v":"Baja"}]
["",null,null,null,null,null,null,null,null,null,null,null,null,null,null,null,null,null,null,null,null,null,null,null,null,{"$f":"IF((Tabla2[[#This Row],[Disponibilidad]]+Tabla2[[#This Row],[Integridad]]+Tabla2[[#This Row],[Confidencialidad ]]<=4),\"Baja\",IF(AND(Tabla2[[#This Row],[Disponibilidad]]+Tabla2[[#This Row],[Integridad]]+Tabla2[[#This Row],[Confidencialidad ]]>=5,Tabla2[[#This Row],[Disponibilidad]]+Tabla2[[#This Row],[Integridad]]+Tabla2[[#This Row],[Confidencialidad ]]<=7),\"Media\",IF(Tabla2[[#This Row],[Disponibilidad]]+Tabla2[[#This Row],[Integridad]]+Tabla2[[#This Row],[Confidencialidad ]]>=8,\"Alta\",\"error\")))","v":"Baja"}]
["",null,null,null,null,null,null,null,null,null,null,null,null,null,null,null,null,null,null,null,null,null,null,null,null,{"$f":"IF((Tabla2[[#This Row],[Disponibilidad]]+Tabla2[[#This Row],[Integridad]]+Tabla2[[#This Row],[Confidencialidad ]]<=4),\"Baja\",IF(AND(Tabla2[[#This Row],[Disponibilidad]]+Tabla2[[#This Row],[Integridad]]+Tabla2[[#This Row],[Confidencialidad ]]>=5,Tabla2[[#This Row],[Disponibilidad]]+Tabla2[[#This Row],[Integridad]]+Tabla2[[#This Row],[Confidencialidad ]]<=7),\"Media\",IF(Tabla2[[#This Row],[Disponibilidad]]+Tabla2[[#This Row],[Integridad]]+Tabla2[[#This Row],[Confidencialidad ]]>=8,\"Alta\",\"error\")))","v":"Baja"}]
["",null,null,null,null,null,null,null,null,null,null,null,null,null,null,null,null,null,null,null,null,null,null,null,null,{"$f":"IF((Tabla2[[#This Row],[Disponibilidad]]+Tabla2[[#This Row],[Integridad]]+Tabla2[[#This Row],[Confidencialidad ]]<=4),\"Baja\",IF(AND(Tabla2[[#This Row],[Disponibilidad]]+Tabla2[[#This Row],[Integridad]]+Tabla2[[#This Row],[Confidencialidad ]]>=5,Tabla2[[#This Row],[Disponibilidad]]+Tabla2[[#This Row],[Integridad]]+Tabla2[[#This Row],[Confidencialidad ]]<=7),\"Media\",IF(Tabla2[[#This Row],[Disponibilidad]]+Tabla2[[#This Row],[Integridad]]+Tabla2[[#This Row],[Confidencialidad ]]>=8,\"Alta\",\"error\")))","v":"Baja"}]
["",null,null,null,null,null,null,null,null,null,null,null,null,null,null,null,null,null,null,null,null,null,null,null,null,{"$f":"IF((Tabla2[[#This Row],[Disponibilidad]]+Tabla2[[#This Row],[Integridad]]+Tabla2[[#This Row],[Confidencialidad ]]<=4),\"Baja\",IF(AND(Tabla2[[#This Row],[Disponibilidad]]+Tabla2[[#This Row],[Integridad]]+Tabla2[[#This Row],[Confidencialidad ]]>=5,Tabla2[[#This Row],[Disponibilidad]]+Tabla2[[#This Row],[Integridad]]+Tabla2[[#This Row],[Confidencialidad ]]<=7),\"Media\",IF(Tabla2[[#This Row],[Disponibilidad]]+Tabla2[[#This Row],[Integridad]]+Tabla2[[#This Row],[Confidencialidad ]]>=8,\"Alta\",\"error\")))","v":"Baja"}]
["",null,null,null,null,null,null,null,null,null,null,null,null,null,null,null,null,null,null,null,null,null,null,null,null,{"$f":"IF((Tabla2[[#This Row],[Disponibilidad]]+Tabla2[[#This Row],[Integridad]]+Tabla2[[#This Row],[Confidencialidad ]]<=4),\"Baja\",IF(AND(Tabla2[[#This Row],[Disponibilidad]]+Tabla2[[#This Row],[Integridad]]+Tabla2[[#This Row],[Confidencialidad ]]>=5,Tabla2[[#This Row],[Disponibilidad]]+Tabla2[[#This Row],[Integridad]]+Tabla2[[#This Row],[Confidencialidad ]]<=7),\"Media\",IF(Tabla2[[#This Row],[Disponibilidad]]+Tabla2[[#This Row],[Integridad]]+Tabla2[[#This Row],[Confidencialidad ]]>=8,\"Alta\",\"error\")))","v":"Baja"}]
[{"$f":"IF(C264<>\"\",1,\"\")","v":""},null,null,null,null,null,null,null,null,null,null,null,null,null,null,null,null,null,null,null,null,null,null,null,null,{"$f":"IF((Tabla2[[#This Row],[Disponibilidad]]+Tabla2[[#This Row],[Integridad]]+Tabla2[[#This Row],[Confidencialidad ]]<=4),\"Baja\",IF(AND(Tabla2[[#This Row],[Disponibilidad]]+Tabla2[[#This Row],[Integridad]]+Tabla2[[#This Row],[Confidencialidad ]]>=5,Tabla2[[#This Row],[Disponibilidad]]+Tabla2[[#This Row],[Integridad]]+Tabla2[[#This Row],[Confidencialidad ]]<=7),\"Media\",IF(Tabla2[[#This Row],[Disponibilidad]]+Tabla2[[#This Row],[Integridad]]+Tabla2[[#This Row],[Confidencialidad ]]>=8,\"Alta\",\"error\")))","v":"Baja"}]
["",null,null,null,null,null,null,null,null,null,null,null,null,null,null,null,null,null,null,null,null,null,null,null,null,{"$f":"IF((Tabla2[[#This Row],[Disponibilidad]]+Tabla2[[#This Row],[Integridad]]+Tabla2[[#This Row],[Confidencialidad ]]<=4),\"Baja\",IF(AND(Tabla2[[#This Row],[Disponibilidad]]+Tabla2[[#This Row],[Integridad]]+Tabla2[[#This Row],[Confidencialidad ]]>=5,Tabla2[[#This Row],[Disponibilidad]]+Tabla2[[#This Row],[Integridad]]+Tabla2[[#This Row],[Confidencialidad ]]<=7),\"Media\",IF(Tabla2[[#This Row],[Disponibilidad]]+Tabla2[[#This Row],[Integridad]]+Tabla2[[#This Row],[Confidencialidad ]]>=8,\"Alta\",\"error\")))","v":"Baja"}]
["",null,null,null,null,null,null,null,null,null,null,null,null,null,null,null,null,null,null,null,null,null,null,null,null,{"$f":"IF((Tabla2[[#This Row],[Disponibilidad]]+Tabla2[[#This Row],[Integridad]]+Tabla2[[#This Row],[Confidencialidad ]]<=4),\"Baja\",IF(AND(Tabla2[[#This Row],[Disponibilidad]]+Tabla2[[#This Row],[Integridad]]+Tabla2[[#This Row],[Confidencialidad ]]>=5,Tabla2[[#This Row],[Disponibilidad]]+Tabla2[[#This Row],[Integridad]]+Tabla2[[#This Row],[Confidencialidad ]]<=7),\"Media\",IF(Tabla2[[#This Row],[Disponibilidad]]+Tabla2[[#This Row],[Integridad]]+Tabla2[[#This Row],[Confidencialidad ]]>=8,\"Alta\",\"error\")))","v":"Baja"}]
["",null,null,null,null,null,null,null,null,null,null,null,null,null,null,null,null,null,null,null,null,null,null,null,null,{"$f":"IF((Tabla2[[#This Row],[Disponibilidad]]+Tabla2[[#This Row],[Integridad]]+Tabla2[[#This Row],[Confidencialidad ]]<=4),\"Baja\",IF(AND(Tabla2[[#This Row],[Disponibilidad]]+Tabla2[[#This Row],[Integridad]]+Tabla2[[#This Row],[Confidencialidad ]]>=5,Tabla2[[#This Row],[Disponibilidad]]+Tabla2[[#This Row],[Integridad]]+Tabla2[[#This Row],[Confidencialidad ]]<=7),\"Media\",IF(Tabla2[[#This Row],[Disponibilidad]]+Tabla2[[#This Row],[Integridad]]+Tabla2[[#This Row],[Confidencialidad ]]>=8,\"Alta\",\"error\")))","v":"Baja"}]
["",null,null,null,null,null,null,null,null,null,null,null,null,null,null,null,null,null,null,null,null,null,null,null,null,{"$f":"IF((Tabla2[[#This Row],[Disponibilidad]]+Tabla2[[#This Row],[Integridad]]+Tabla2[[#This Row],[Confidencialidad ]]<=4),\"Baja\",IF(AND(Tabla2[[#This Row],[Disponibilidad]]+Tabla2[[#This Row],[Integridad]]+Tabla2[[#This Row],[Confidencialidad ]]>=5,Tabla2[[#This Row],[Disponibilidad]]+Tabla2[[#This Row],[Integridad]]+Tabla2[[#This Row],[Confidencialidad ]]<=7),\"Media\",IF(Tabla2[[#This Row],[Disponibilidad]]+Tabla2[[#This Row],[Integridad]]+Tabla2[[#This Row],[Confidencialidad ]]>=8,\"Alta\",\"error\")))","v":"Baja"}]
["",null,null,null,null,null,null,null,null,null,null,null,null,null,null,null,null,null,null,null,null,null,null,null,null,{"$f":"IF((Tabla2[[#This Row],[Disponibilidad]]+Tabla2[[#This Row],[Integridad]]+Tabla2[[#This Row],[Confidencialidad ]]<=4),\"Baja\",IF(AND(Tabla2[[#This Row],[Disponibilidad]]+Tabla2[[#This Row],[Integridad]]+Tabla2[[#This Row],[Confidencialidad ]]>=5,Tabla2[[#This Row],[Disponibilidad]]+Tabla2[[#This Row],[Integridad]]+Tabla2[[#This Row],[Confidencialidad ]]<=7),\"Media\",IF(Tabla2[[#This Row],[Disponibilidad]]+Tabla2[[#This Row],[Integridad]]+Tabla2[[#This Row],[Confidencialidad ]]>=8,\"Alta\",\"error\")))","v":"Baja"}]
["",null,null,null,null,null,null,null,null,null,null,null,null,null,null,null,null,null,null,null,null,null,null,null,null,{"$f":"IF((Tabla2[[#This Row],[Disponibilidad]]+Tabla2[[#This Row],[Integridad]]+Tabla2[[#This Row],[Confidencialidad ]]<=4),\"Baja\",IF(AND(Tabla2[[#This Row],[Disponibilidad]]+Tabla2[[#This Row],[Integridad]]+Tabla2[[#This Row],[Confidencialidad ]]>=5,Tabla2[[#This Row],[Disponibilidad]]+Tabla2[[#This Row],[Integridad]]+Tabla2[[#This Row],[Confidencialidad ]]<=7),\"Media\",IF(Tabla2[[#This Row],[Disponibilidad]]+Tabla2[[#This Row],[Integridad]]+Tabla2[[#This Row],[Confidencialidad ]]>=8,\"Alta\",\"error\")))","v":"Baja"}]
["",null,null,null,null,null,null,null,null,null,null,null,null,null,null,null,null,null,null,null,null,null,null,null,null,{"$f":"IF((Tabla2[[#This Row],[Disponibilidad]]+Tabla2[[#This Row],[Integridad]]+Tabla2[[#This Row],[Confidencialidad ]]<=4),\"Baja\",IF(AND(Tabla2[[#This Row],[Disponibilidad]]+Tabla2[[#This Row],[Integridad]]+Tabla2[[#This Row],[Confidencialidad ]]>=5,Tabla2[[#This Row],[Disponibilidad]]+Tabla2[[#This Row],[Integridad]]+Tabla2[[#This Row],[Confidencialidad ]]<=7),\"Media\",IF(Tabla2[[#This Row],[Disponibilidad]]+Tabla2[[#This Row],[Integridad]]+Tabla2[[#This Row],[Confidencialidad ]]>=8,\"Alta\",\"error\")))","v":"Baja"}]
["",null,null,null,null,null,null,null,null,null,null,null,null,null,null,null,null,null,null,null,null,null,null,null,null,{"$f":"IF((Tabla2[[#This Row],[Disponibilidad]]+Tabla2[[#This Row],[Integridad]]+Tabla2[[#This Row],[Confidencialidad ]]<=4),\"Baja\",IF(AND(Tabla2[[#This Row],[Disponibilidad]]+Tabla2[[#This Row],[Integridad]]+Tabla2[[#This Row],[Confidencialidad ]]>=5,Tabla2[[#This Row],[Disponibilidad]]+Tabla2[[#This Row],[Integridad]]+Tabla2[[#This Row],[Confidencialidad ]]<=7),\"Media\",IF(Tabla2[[#This Row],[Disponibilidad]]+Tabla2[[#This Row],[Integridad]]+Tabla2[[#This Row],[Confidencialidad ]]>=8,\"Alta\",\"error\")))","v":"Baja"}]
["",null,null,null,null,null,null,null,null,null,null,null,null,null,null,null,null,null,null,null,null,null,null,null,null,{"$f":"IF((Tabla2[[#This Row],[Disponibilidad]]+Tabla2[[#This Row],[Integridad]]+Tabla2[[#This Row],[Confidencialidad ]]<=4),\"Baja\",IF(AND(Tabla2[[#This Row],[Disponibilidad]]+Tabla2[[#This Row],[Integridad]]+Tabla2[[#This Row],[Confidencialidad ]]>=5,Tabla2[[#This Row],[Disponibilidad]]+Tabla2[[#This Row],[Integridad]]+Tabla2[[#This Row],[Confidencialidad ]]<=7),\"Media\",IF(Tabla2[[#This Row],[Disponibilidad]]+Tabla2[[#This Row],[Integridad]]+Tabla2[[#This Row],[Confidencialidad ]]>=8,\"Alta\",\"error\")))","v":"Baja"}]
["",null,null,null,null,null,null,null,null,null,null,null,null,null,null,null,null,null,null,null,null,null,null,null,null,{"$f":"IF((Tabla2[[#This Row],[Disponibilidad]]+Tabla2[[#This Row],[Integridad]]+Tabla2[[#This Row],[Confidencialidad ]]<=4),\"Baja\",IF(AND(Tabla2[[#This Row],[Disponibilidad]]+Tabla2[[#This Row],[Integridad]]+Tabla2[[#This Row],[Confidencialidad ]]>=5,Tabla2[[#This Row],[Disponibilidad]]+Tabla2[[#This Row],[Integridad]]+Tabla2[[#This Row],[Confidencialidad ]]<=7),\"Media\",IF(Tabla2[[#This Row],[Disponibilidad]]+Tabla2[[#This Row],[Integridad]]+Tabla2[[#This Row],[Confidencialidad ]]>=8,\"Alta\",\"error\")))","v":"Baja"}]
["",null,null,null,null,null,null,null,null,null,null,null,null,null,null,null,null,null,null,null,null,null,null,null,null,{"$f":"IF((Tabla2[[#This Row],[Disponibilidad]]+Tabla2[[#This Row],[Integridad]]+Tabla2[[#This Row],[Confidencialidad ]]<=4),\"Baja\",IF(AND(Tabla2[[#This Row],[Disponibilidad]]+Tabla2[[#This Row],[Integridad]]+Tabla2[[#This Row],[Confidencialidad ]]>=5,Tabla2[[#This Row],[Disponibilidad]]+Tabla2[[#This Row],[Integridad]]+Tabla2[[#This Row],[Confidencialidad ]]<=7),\"Media\",IF(Tabla2[[#This Row],[Disponibilidad]]+Tabla2[[#This Row],[Integridad]]+Tabla2[[#This Row],[Confidencialidad ]]>=8,\"Alta\",\"error\")))","v":"Baja"}]
["",null,null,null,null,null,null,null,null,null,null,null,null,null,null,null,null,null,null,null,null,null,null,null,null,{"$f":"IF((Tabla2[[#This Row],[Disponibilidad]]+Tabla2[[#This Row],[Integridad]]+Tabla2[[#This Row],[Confidencialidad ]]<=4),\"Baja\",IF(AND(Tabla2[[#This Row],[Disponibilidad]]+Tabla2[[#This Row],[Integridad]]+Tabla2[[#This Row],[Confidencialidad ]]>=5,Tabla2[[#This Row],[Disponibilidad]]+Tabla2[[#This Row],[Integridad]]+Tabla2[[#This Row],[Confidencialidad ]]<=7),\"Media\",IF(Tabla2[[#This Row],[Disponibilidad]]+Tabla2[[#This Row],[Integridad]]+Tabla2[[#This Row],[Confidencialidad ]]>=8,\"Alta\",\"error\")))","v":"Baja"}]
["",null,null,null,null,null,null,null,null,null,null,null,null,null,null,null,null,null,null,null,null,null,null,null,null,{"$f":"IF((Tabla2[[#This Row],[Disponibilidad]]+Tabla2[[#This Row],[Integridad]]+Tabla2[[#This Row],[Confidencialidad ]]<=4),\"Baja\",IF(AND(Tabla2[[#This Row],[Disponibilidad]]+Tabla2[[#This Row],[Integridad]]+Tabla2[[#This Row],[Confidencialidad ]]>=5,Tabla2[[#This Row],[Disponibilidad]]+Tabla2[[#This Row],[Integridad]]+Tabla2[[#This Row],[Confidencialidad ]]<=7),\"Media\",IF(Tabla2[[#This Row],[Disponibilidad]]+Tabla2[[#This Row],[Integridad]]+Tabla2[[#This Row],[Confidencialidad ]]>=8,\"Alta\",\"error\")))","v":"Baja"}]
["",null,null,null,null,null,null,null,null,null,null,null,null,null,null,null,null,null,null,null,null,null,null,null,null,{"$f":"IF((Tabla2[[#This Row],[Disponibilidad]]+Tabla2[[#This Row],[Integridad]]+Tabla2[[#This Row],[Confidencialidad ]]<=4),\"Baja\",IF(AND(Tabla2[[#This Row],[Disponibilidad]]+Tabla2[[#This Row],[Integridad]]+Tabla2[[#This Row],[Confidencialidad ]]>=5,Tabla2[[#This Row],[Disponibilidad]]+Tabla2[[#This Row],[Integridad]]+Tabla2[[#This Row],[Confidencialidad ]]<=7),\"Media\",IF(Tabla2[[#This Row],[Disponibilidad]]+Tabla2[[#This Row],[Integridad]]+Tabla2[[#This Row],[Confidencialidad ]]>=8,\"Alta\",\"error\")))","v":"Baja"}]
["",null,null,null,null,null,null,null,null,null,null,null,null,null,null,null,null,null,null,null,null,null,null,null,null,{"$f":"IF((Tabla2[[#This Row],[Disponibilidad]]+Tabla2[[#This Row],[Integridad]]+Tabla2[[#This Row],[Confidencialidad ]]<=4),\"Baja\",IF(AND(Tabla2[[#This Row],[Disponibilidad]]+Tabla2[[#This Row],[Integridad]]+Tabla2[[#This Row],[Confidencialidad ]]>=5,Tabla2[[#This Row],[Disponibilidad]]+Tabla2[[#This Row],[Integridad]]+Tabla2[[#This Row],[Confidencialidad ]]<=7),\"Media\",IF(Tabla2[[#This Row],[Disponibilidad]]+Tabla2[[#This Row],[Integridad]]+Tabla2[[#This Row],[Confidencialidad ]]>=8,\"Alta\",\"error\")))","v":"Baja"}]
["",null,null,null,null,null,null,null,null,null,null,null,null,null,null,null,null,null,null,null,null,null,null,null,null,{"$f":"IF((Tabla2[[#This Row],[Disponibilidad]]+Tabla2[[#This Row],[Integridad]]+Tabla2[[#This Row],[Confidencialidad ]]<=4),\"Baja\",IF(AND(Tabla2[[#This Row],[Disponibilidad]]+Tabla2[[#This Row],[Integridad]]+Tabla2[[#This Row],[Confidencialidad ]]>=5,Tabla2[[#This Row],[Disponibilidad]]+Tabla2[[#This Row],[Integridad]]+Tabla2[[#This Row],[Confidencialidad ]]<=7),\"Media\",IF(Tabla2[[#This Row],[Disponibilidad]]+Tabla2[[#This Row],[Integridad]]+Tabla2[[#This Row],[Confidencialidad ]]>=8,\"Alta\",\"error\")))","v":"Baja"}]
["",null,null,null,null,null,null,null,null,null,null,null,null,null,null,null,null,null,null,null,null,null,null,null,null,{"$f":"IF((Tabla2[[#This Row],[Disponibilidad]]+Tabla2[[#This Row],[Integridad]]+Tabla2[[#This Row],[Confidencialidad ]]<=4),\"Baja\",IF(AND(Tabla2[[#This Row],[Disponibilidad]]+Tabla2[[#This Row],[Integridad]]+Tabla2[[#This Row],[Confidencialidad ]]>=5,Tabla2[[#This Row],[Disponibilidad]]+Tabla2[[#This Row],[Integridad]]+Tabla2[[#This Row],[Confidencialidad ]]<=7),\"Media\",IF(Tabla2[[#This Row],[Disponibilidad]]+Tabla2[[#This Row],[Integridad]]+Tabla2[[#This Row],[Confidencialidad ]]>=8,\"Alta\",\"error\")))","v":"Baja"}]
["",null,null,null,null,null,null,null,null,null,null,null,null,null,null,null,null,null,null,null,null,null,null,null,null,{"$f":"IF((Tabla2[[#This Row],[Disponibilidad]]+Tabla2[[#This Row],[Integridad]]+Tabla2[[#This Row],[Confidencialidad ]]<=4),\"Baja\",IF(AND(Tabla2[[#This Row],[Disponibilidad]]+Tabla2[[#This Row],[Integridad]]+Tabla2[[#This Row],[Confidencialidad ]]>=5,Tabla2[[#This Row],[Disponibilidad]]+Tabla2[[#This Row],[Integridad]]+Tabla2[[#This Row],[Confidencialidad ]]<=7),\"Media\",IF(Tabla2[[#This Row],[Disponibilidad]]+Tabla2[[#This Row],[Integridad]]+Tabla2[[#This Row],[Confidencialidad ]]>=8,\"Alta\",\"error\")))","v":"Baja"}]
["",null,null,null,null,null,null,null,null,null,null,null,null,null,null,null,null,null,null,null,null,null,null,null,null,{"$f":"IF((Tabla2[[#This Row],[Disponibilidad]]+Tabla2[[#This Row],[Integridad]]+Tabla2[[#This Row],[Confidencialidad ]]<=4),\"Baja\",IF(AND(Tabla2[[#This Row],[Disponibilidad]]+Tabla2[[#This Row],[Integridad]]+Tabla2[[#This Row],[Confidencialidad ]]>=5,Tabla2[[#This Row],[Disponibilidad]]+Tabla2[[#This Row],[Integridad]]+Tabla2[[#This Row],[Confidencialidad ]]<=7),\"Media\",IF(Tabla2[[#This Row],[Disponibilidad]]+Tabla2[[#This Row],[Integridad]]+Tabla2[[#This Row],[Confidencialidad ]]>=8,\"Alta\",\"error\")))","v":"Baja"}]
["",null,null,null,null,null,null,null,null,null,null,null,null,null,null,null,null,null,null,null,null,null,null,null,null,{"$f":"IF((Tabla2[[#This Row],[Disponibilidad]]+Tabla2[[#This Row],[Integridad]]+Tabla2[[#This Row],[Confidencialidad ]]<=4),\"Baja\",IF(AND(Tabla2[[#This Row],[Disponibilidad]]+Tabla2[[#This Row],[Integridad]]+Tabla2[[#This Row],[Confidencialidad ]]>=5,Tabla2[[#This Row],[Disponibilidad]]+Tabla2[[#This Row],[Integridad]]+Tabla2[[#This Row],[Confidencialidad ]]<=7),\"Media\",IF(Tabla2[[#This Row],[Disponibilidad]]+Tabla2[[#This Row],[Integridad]]+Tabla2[[#This Row],[Confidencialidad ]]>=8,\"Alta\",\"error\")))","v":"Baja"}]
["",null,null,null,null,null,null,null,null,null,null,null,null,null,null,null,null,null,null,null,null,null,null,null,null,{"$f":"IF((Tabla2[[#This Row],[Disponibilidad]]+Tabla2[[#This Row],[Integridad]]+Tabla2[[#This Row],[Confidencialidad ]]<=4),\"Baja\",IF(AND(Tabla2[[#This Row],[Disponibilidad]]+Tabla2[[#This Row],[Integridad]]+Tabla2[[#This Row],[Confidencialidad ]]>=5,Tabla2[[#This Row],[Disponibilidad]]+Tabla2[[#This Row],[Integridad]]+Tabla2[[#This Row],[Confidencialidad ]]<=7),\"Media\",IF(Tabla2[[#This Row],[Disponibilidad]]+Tabla2[[#This Row],[Integridad]]+Tabla2[[#This Row],[Confidencialidad ]]>=8,\"Alta\",\"error\")))","v":"Baja"}]
["",null,null,null,null,null,null,null,null,null,null,null,null,null,null,null,null,null,null,null,null,null,null,null,null,{"$f":"IF((Tabla2[[#This Row],[Disponibilidad]]+Tabla2[[#This Row],[Integridad]]+Tabla2[[#This Row],[Confidencialidad ]]<=4),\"Baja\",IF(AND(Tabla2[[#This Row],[Disponibilidad]]+Tabla2[[#This Row],[Integridad]]+Tabla2[[#This Row],[Confidencialidad ]]>=5,Tabla2[[#This Row],[Disponibilidad]]+Tabla2[[#This Row],[Integridad]]+Tabla2[[#This Row],[Confidencialidad ]]<=7),\"Media\",IF(Tabla2[[#This Row],[Disponibilidad]]+Tabla2[[#This Row],[Integridad]]+Tabla2[[#This Row],[Confidencialidad ]]>=8,\"Alta\",\"error\")))","v":"Baja"}]
["",null,null,null,null,null,null,null,null,null,null,null,null,null,null,null,null,null,null,null,null,null,null,null,null,{"$f":"IF((Tabla2[[#This Row],[Disponibilidad]]+Tabla2[[#This Row],[Integridad]]+Tabla2[[#This Row],[Confidencialidad ]]<=4),\"Baja\",IF(AND(Tabla2[[#This Row],[Disponibilidad]]+Tabla2[[#This Row],[Integridad]]+Tabla2[[#This Row],[Confidencialidad ]]>=5,Tabla2[[#This Row],[Disponibilidad]]+Tabla2[[#This Row],[Integridad]]+Tabla2[[#This Row],[Confidencialidad ]]<=7),\"Media\",IF(Tabla2[[#This Row],[Disponibilidad]]+Tabla2[[#This Row],[Integridad]]+Tabla2[[#This Row],[Confidencialidad ]]>=8,\"Alta\",\"error\")))","v":"Baja"}]
["",null,null,null,null,null,null,null,null,null,null,null,null,null,null,null,null,null,null,null,null,null,null,null,null,{"$f":"IF((Tabla2[[#This Row],[Disponibilidad]]+Tabla2[[#This Row],[Integridad]]+Tabla2[[#This Row],[Confidencialidad ]]<=4),\"Baja\",IF(AND(Tabla2[[#This Row],[Disponibilidad]]+Tabla2[[#This Row],[Integridad]]+Tabla2[[#This Row],[Confidencialidad ]]>=5,Tabla2[[#This Row],[Disponibilidad]]+Tabla2[[#This Row],[Integridad]]+Tabla2[[#This Row],[Confidencialidad ]]<=7),\"Media\",IF(Tabla2[[#This Row],[Disponibilidad]]+Tabla2[[#This Row],[Integridad]]+Tabla2[[#This Row],[Confidencialidad ]]>=8,\"Alta\",\"error\")))","v":"Baja"}]
["",null,null,null,null,null,null,null,null,null,null,null,null,null,null,null,null,null,null,null,null,null,null,null,null,{"$f":"IF((Tabla2[[#This Row],[Disponibilidad]]+Tabla2[[#This Row],[Integridad]]+Tabla2[[#This Row],[Confidencialidad ]]<=4),\"Baja\",IF(AND(Tabla2[[#This Row],[Disponibilidad]]+Tabla2[[#This Row],[Integridad]]+Tabla2[[#This Row],[Confidencialidad ]]>=5,Tabla2[[#This Row],[Disponibilidad]]+Tabla2[[#This Row],[Integridad]]+Tabla2[[#This Row],[Confidencialidad ]]<=7),\"Media\",IF(Tabla2[[#This Row],[Disponibilidad]]+Tabla2[[#This Row],[Integridad]]+Tabla2[[#This Row],[Confidencialidad ]]>=8,\"Alta\",\"error\")))","v":"Baja"}]
["",null,null,null,null,null,null,null,null,null,null,null,null,null,null,null,null,null,null,null,null,null,null,null,null,{"$f":"IF((Tabla2[[#This Row],[Disponibilidad]]+Tabla2[[#This Row],[Integridad]]+Tabla2[[#This Row],[Confidencialidad ]]<=4),\"Baja\",IF(AND(Tabla2[[#This Row],[Disponibilidad]]+Tabla2[[#This Row],[Integridad]]+Tabla2[[#This Row],[Confidencialidad ]]>=5,Tabla2[[#This Row],[Disponibilidad]]+Tabla2[[#This Row],[Integridad]]+Tabla2[[#This Row],[Confidencialidad ]]<=7),\"Media\",IF(Tabla2[[#This Row],[Disponibilidad]]+Tabla2[[#This Row],[Integridad]]+Tabla2[[#This Row],[Confidencialidad ]]>=8,\"Alta\",\"error\")))","v":"Baja"}]
["",null,null,null,null,null,null,null,null,null,null,null,null,null,null,null,null,null,null,null,null,null,null,null,null,{"$f":"IF((Tabla2[[#This Row],[Disponibilidad]]+Tabla2[[#This Row],[Integridad]]+Tabla2[[#This Row],[Confidencialidad ]]<=4),\"Baja\",IF(AND(Tabla2[[#This Row],[Disponibilidad]]+Tabla2[[#This Row],[Integridad]]+Tabla2[[#This Row],[Confidencialidad ]]>=5,Tabla2[[#This Row],[Disponibilidad]]+Tabla2[[#This Row],[Integridad]]+Tabla2[[#This Row],[Confidencialidad ]]<=7),\"Media\",IF(Tabla2[[#This Row],[Disponibilidad]]+Tabla2[[#This Row],[Integridad]]+Tabla2[[#This Row],[Confidencialidad ]]>=8,\"Alta\",\"error\")))","v":"Baja"}]
["",null,null,null,null,null,null,null,null,null,null,null,null,null,null,null,null,null,null,null,null,null,null,null,null,{"$f":"IF((Tabla2[[#This Row],[Disponibilidad]]+Tabla2[[#This Row],[Integridad]]+Tabla2[[#This Row],[Confidencialidad ]]<=4),\"Baja\",IF(AND(Tabla2[[#This Row],[Disponibilidad]]+Tabla2[[#This Row],[Integridad]]+Tabla2[[#This Row],[Confidencialidad ]]>=5,Tabla2[[#This Row],[Disponibilidad]]+Tabla2[[#This Row],[Integridad]]+Tabla2[[#This Row],[Confidencialidad ]]<=7),\"Media\",IF(Tabla2[[#This Row],[Disponibilidad]]+Tabla2[[#This Row],[Integridad]]+Tabla2[[#This Row],[Confidencialidad ]]>=8,\"Alta\",\"error\")))","v":"Baja"}]
["",null,null,null,null,null,null,null,null,null,null,null,null,null,null,null,null,null,null,null,null,null,null,null,null,{"$f":"IF((Tabla2[[#This Row],[Disponibilidad]]+Tabla2[[#This Row],[Integridad]]+Tabla2[[#This Row],[Confidencialidad ]]<=4),\"Baja\",IF(AND(Tabla2[[#This Row],[Disponibilidad]]+Tabla2[[#This Row],[Integridad]]+Tabla2[[#This Row],[Confidencialidad ]]>=5,Tabla2[[#This Row],[Disponibilidad]]+Tabla2[[#This Row],[Integridad]]+Tabla2[[#This Row],[Confidencialidad ]]<=7),\"Media\",IF(Tabla2[[#This Row],[Disponibilidad]]+Tabla2[[#This Row],[Integridad]]+Tabla2[[#This Row],[Confidencialidad ]]>=8,\"Alta\",\"error\")))","v":"Baja"}]
["",null,null,null,null,null,null,null,null,null,null,null,null,null,null,null,null,null,null,null,null,null,null,null,null,{"$f":"IF((Tabla2[[#This Row],[Disponibilidad]]+Tabla2[[#This Row],[Integridad]]+Tabla2[[#This Row],[Confidencialidad ]]<=4),\"Baja\",IF(AND(Tabla2[[#This Row],[Disponibilidad]]+Tabla2[[#This Row],[Integridad]]+Tabla2[[#This Row],[Confidencialidad ]]>=5,Tabla2[[#This Row],[Disponibilidad]]+Tabla2[[#This Row],[Integridad]]+Tabla2[[#This Row],[Confidencialidad ]]<=7),\"Media\",IF(Tabla2[[#This Row],[Disponibilidad]]+Tabla2[[#This Row],[Integridad]]+Tabla2[[#This Row],[Confidencialidad ]]>=8,\"Alta\",\"error\")))","v":"Baja"}]
["",null,null,null,null,null,null,null,null,null,null,null,null,null,null,null,null,null,null,null,null,null,null,null,null,{"$f":"IF((Tabla2[[#This Row],[Disponibilidad]]+Tabla2[[#This Row],[Integridad]]+Tabla2[[#This Row],[Confidencialidad ]]<=4),\"Baja\",IF(AND(Tabla2[[#This Row],[Disponibilidad]]+Tabla2[[#This Row],[Integridad]]+Tabla2[[#This Row],[Confidencialidad ]]>=5,Tabla2[[#This Row],[Disponibilidad]]+Tabla2[[#This Row],[Integridad]]+Tabla2[[#This Row],[Confidencialidad ]]<=7),\"Media\",IF(Tabla2[[#This Row],[Disponibilidad]]+Tabla2[[#This Row],[Integridad]]+Tabla2[[#This Row],[Confidencialidad ]]>=8,\"Alta\",\"error\")))","v":"Baja"}]
["",null,null,null,null,null,null,null,null,null,null,null,null,null,null,null,null,null,null,null,null,null,null,null,null,{"$f":"IF((Tabla2[[#This Row],[Disponibilidad]]+Tabla2[[#This Row],[Integridad]]+Tabla2[[#This Row],[Confidencialidad ]]<=4),\"Baja\",IF(AND(Tabla2[[#This Row],[Disponibilidad]]+Tabla2[[#This Row],[Integridad]]+Tabla2[[#This Row],[Confidencialidad ]]>=5,Tabla2[[#This Row],[Disponibilidad]]+Tabla2[[#This Row],[Integridad]]+Tabla2[[#This Row],[Confidencialidad ]]<=7),\"Media\",IF(Tabla2[[#This Row],[Disponibilidad]]+Tabla2[[#This Row],[Integridad]]+Tabla2[[#This Row],[Confidencialidad ]]>=8,\"Alta\",\"error\")))","v":"Baja"}]
["",null,null,null,null,null,null,null,null,null,null,null,null,null,null,null,null,null,null,null,null,null,null,null,null,{"$f":"IF((Tabla2[[#This Row],[Disponibilidad]]+Tabla2[[#This Row],[Integridad]]+Tabla2[[#This Row],[Confidencialidad ]]<=4),\"Baja\",IF(AND(Tabla2[[#This Row],[Disponibilidad]]+Tabla2[[#This Row],[Integridad]]+Tabla2[[#This Row],[Confidencialidad ]]>=5,Tabla2[[#This Row],[Disponibilidad]]+Tabla2[[#This Row],[Integridad]]+Tabla2[[#This Row],[Confidencialidad ]]<=7),\"Media\",IF(Tabla2[[#This Row],[Disponibilidad]]+Tabla2[[#This Row],[Integridad]]+Tabla2[[#This Row],[Confidencialidad ]]>=8,\"Alta\",\"error\")))","v":"Baja"}]
["",null,null,null,null,null,null,null,null,null,null,null,null,null,null,null,null,null,null,null,null,null,null,null,null,{"$f":"IF((Tabla2[[#This Row],[Disponibilidad]]+Tabla2[[#This Row],[Integridad]]+Tabla2[[#This Row],[Confidencialidad ]]<=4),\"Baja\",IF(AND(Tabla2[[#This Row],[Disponibilidad]]+Tabla2[[#This Row],[Integridad]]+Tabla2[[#This Row],[Confidencialidad ]]>=5,Tabla2[[#This Row],[Disponibilidad]]+Tabla2[[#This Row],[Integridad]]+Tabla2[[#This Row],[Confidencialidad ]]<=7),\"Media\",IF(Tabla2[[#This Row],[Disponibilidad]]+Tabla2[[#This Row],[Integridad]]+Tabla2[[#This Row],[Confidencialidad ]]>=8,\"Alta\",\"error\")))","v":"Baja"}]
["",null,null,null,null,null,null,null,null,null,null,null,null,null,null,null,null,null,null,null,null,null,null,null,null,{"$f":"IF((Tabla2[[#This Row],[Disponibilidad]]+Tabla2[[#This Row],[Integridad]]+Tabla2[[#This Row],[Confidencialidad ]]<=4),\"Baja\",IF(AND(Tabla2[[#This Row],[Disponibilidad]]+Tabla2[[#This Row],[Integridad]]+Tabla2[[#This Row],[Confidencialidad ]]>=5,Tabla2[[#This Row],[Disponibilidad]]+Tabla2[[#This Row],[Integridad]]+Tabla2[[#This Row],[Confidencialidad ]]<=7),\"Media\",IF(Tabla2[[#This Row],[Disponibilidad]]+Tabla2[[#This Row],[Integridad]]+Tabla2[[#This Row],[Confidencialidad ]]>=8,\"Alta\",\"error\")))","v":"Baja"}]
["",null,null,null,null,null,null,null,null,null,null,null,null,null,null,null,null,null,null,null,null,null,null,null,null,{"$f":"IF((Tabla2[[#This Row],[Disponibilidad]]+Tabla2[[#This Row],[Integridad]]+Tabla2[[#This Row],[Confidencialidad ]]<=4),\"Baja\",IF(AND(Tabla2[[#This Row],[Disponibilidad]]+Tabla2[[#This Row],[Integridad]]+Tabla2[[#This Row],[Confidencialidad ]]>=5,Tabla2[[#This Row],[Disponibilidad]]+Tabla2[[#This Row],[Integridad]]+Tabla2[[#This Row],[Confidencialidad ]]<=7),\"Media\",IF(Tabla2[[#This Row],[Disponibilidad]]+Tabla2[[#This Row],[Integridad]]+Tabla2[[#This Row],[Confidencialidad ]]>=8,\"Alta\",\"error\")))","v":"Baja"}]
["",null,null,null,null,null,null,null,null,null,null,null,null,null,null,null,null,null,null,null,null,null,null,null,null,{"$f":"IF((Tabla2[[#This Row],[Disponibilidad]]+Tabla2[[#This Row],[Integridad]]+Tabla2[[#This Row],[Confidencialidad ]]<=4),\"Baja\",IF(AND(Tabla2[[#This Row],[Disponibilidad]]+Tabla2[[#This Row],[Integridad]]+Tabla2[[#This Row],[Confidencialidad ]]>=5,Tabla2[[#This Row],[Disponibilidad]]+Tabla2[[#This Row],[Integridad]]+Tabla2[[#This Row],[Confidencialidad ]]<=7),\"Media\",IF(Tabla2[[#This Row],[Disponibilidad]]+Tabla2[[#This Row],[Integridad]]+Tabla2[[#This Row],[Confidencialidad ]]>=8,\"Alta\",\"error\")))","v":"Baja"}]
["",null,null,null,null,null,null,null,null,null,null,null,null,null,null,null,null,null,null,null,null,null,null,null,null,{"$f":"IF((Tabla2[[#This Row],[Disponibilidad]]+Tabla2[[#This Row],[Integridad]]+Tabla2[[#This Row],[Confidencialidad ]]<=4),\"Baja\",IF(AND(Tabla2[[#This Row],[Disponibilidad]]+Tabla2[[#This Row],[Integridad]]+Tabla2[[#This Row],[Confidencialidad ]]>=5,Tabla2[[#This Row],[Disponibilidad]]+Tabla2[[#This Row],[Integridad]]+Tabla2[[#This Row],[Confidencialidad ]]<=7),\"Media\",IF(Tabla2[[#This Row],[Disponibilidad]]+Tabla2[[#This Row],[Integridad]]+Tabla2[[#This Row],[Confidencialidad ]]>=8,\"Alta\",\"error\")))","v":"Baja"}]
["",null,null,null,null,null,null,null,null,null,null,null,null,null,null,null,null,null,null,null,null,null,null,null,null,{"$f":"IF((Tabla2[[#This Row],[Disponibilidad]]+Tabla2[[#This Row],[Integridad]]+Tabla2[[#This Row],[Confidencialidad ]]<=4),\"Baja\",IF(AND(Tabla2[[#This Row],[Disponibilidad]]+Tabla2[[#This Row],[Integridad]]+Tabla2[[#This Row],[Confidencialidad ]]>=5,Tabla2[[#This Row],[Disponibilidad]]+Tabla2[[#This Row],[Integridad]]+Tabla2[[#This Row],[Confidencialidad ]]<=7),\"Media\",IF(Tabla2[[#This Row],[Disponibilidad]]+Tabla2[[#This Row],[Integridad]]+Tabla2[[#This Row],[Confidencialidad ]]>=8,\"Alta\",\"error\")))","v":"Baja"}]
["",null,null,null,null,null,null,null,null,null,null,null,null,null,null,null,null,null,null,null,null,null,null,null,null,{"$f":"IF((Tabla2[[#This Row],[Disponibilidad]]+Tabla2[[#This Row],[Integridad]]+Tabla2[[#This Row],[Confidencialidad ]]<=4),\"Baja\",IF(AND(Tabla2[[#This Row],[Disponibilidad]]+Tabla2[[#This Row],[Integridad]]+Tabla2[[#This Row],[Confidencialidad ]]>=5,Tabla2[[#This Row],[Disponibilidad]]+Tabla2[[#This Row],[Integridad]]+Tabla2[[#This Row],[Confidencialidad ]]<=7),\"Media\",IF(Tabla2[[#This Row],[Disponibilidad]]+Tabla2[[#This Row],[Integridad]]+Tabla2[[#This Row],[Confidencialidad ]]>=8,\"Alta\",\"error\")))","v":"Baja"}]
["",null,null,null,null,null,null,null,null,null,null,null,null,null,null,null,null,null,null,null,null,null,null,null,null,{"$f":"IF((Tabla2[[#This Row],[Disponibilidad]]+Tabla2[[#This Row],[Integridad]]+Tabla2[[#This Row],[Confidencialidad ]]<=4),\"Baja\",IF(AND(Tabla2[[#This Row],[Disponibilidad]]+Tabla2[[#This Row],[Integridad]]+Tabla2[[#This Row],[Confidencialidad ]]>=5,Tabla2[[#This Row],[Disponibilidad]]+Tabla2[[#This Row],[Integridad]]+Tabla2[[#This Row],[Confidencialidad ]]<=7),\"Media\",IF(Tabla2[[#This Row],[Disponibilidad]]+Tabla2[[#This Row],[Integridad]]+Tabla2[[#This Row],[Confidencialidad ]]>=8,\"Alta\",\"error\")))","v":"Baja"}]
["",null,null,null,null,null,null,null,null,null,null,null,null,null,null,null,null,null,null,null,null,null,null,null,null,{"$f":"IF((Tabla2[[#This Row],[Disponibilidad]]+Tabla2[[#This Row],[Integridad]]+Tabla2[[#This Row],[Confidencialidad ]]<=4),\"Baja\",IF(AND(Tabla2[[#This Row],[Disponibilidad]]+Tabla2[[#This Row],[Integridad]]+Tabla2[[#This Row],[Confidencialidad ]]>=5,Tabla2[[#This Row],[Disponibilidad]]+Tabla2[[#This Row],[Integridad]]+Tabla2[[#This Row],[Confidencialidad ]]<=7),\"Media\",IF(Tabla2[[#This Row],[Disponibilidad]]+Tabla2[[#This Row],[Integridad]]+Tabla2[[#This Row],[Confidencialidad ]]>=8,\"Alta\",\"error\")))","v":"Baja"}]
["",null,null,null,null,null,null,null,null,null,null,null,null,null,null,null,null,null,null,null,null,null,null,null,null,{"$f":"IF((Tabla2[[#This Row],[Disponibilidad]]+Tabla2[[#This Row],[Integridad]]+Tabla2[[#This Row],[Confidencialidad ]]<=4),\"Baja\",IF(AND(Tabla2[[#This Row],[Disponibilidad]]+Tabla2[[#This Row],[Integridad]]+Tabla2[[#This Row],[Confidencialidad ]]>=5,Tabla2[[#This Row],[Disponibilidad]]+Tabla2[[#This Row],[Integridad]]+Tabla2[[#This Row],[Confidencialidad ]]<=7),\"Media\",IF(Tabla2[[#This Row],[Disponibilidad]]+Tabla2[[#This Row],[Integridad]]+Tabla2[[#This Row],[Confidencialidad ]]>=8,\"Alta\",\"error\")))","v":"Baja"}]
["",null,null,null,null,null,null,null,null,null,null,null,null,null,null,null,null,null,null,null,null,null,null,null,null,{"$f":"IF((Tabla2[[#This Row],[Disponibilidad]]+Tabla2[[#This Row],[Integridad]]+Tabla2[[#This Row],[Confidencialidad ]]<=4),\"Baja\",IF(AND(Tabla2[[#This Row],[Disponibilidad]]+Tabla2[[#This Row],[Integridad]]+Tabla2[[#This Row],[Confidencialidad ]]>=5,Tabla2[[#This Row],[Disponibilidad]]+Tabla2[[#This Row],[Integridad]]+Tabla2[[#This Row],[Confidencialidad ]]<=7),\"Media\",IF(Tabla2[[#This Row],[Disponibilidad]]+Tabla2[[#This Row],[Integridad]]+Tabla2[[#This Row],[Confidencialidad ]]>=8,\"Alta\",\"error\")))","v":"Baja"}]
["",null,null,null,null,null,null,null,null,null,null,null,null,null,null,null,null,null,null,null,null,null,null,null,null,{"$f":"IF((Tabla2[[#This Row],[Disponibilidad]]+Tabla2[[#This Row],[Integridad]]+Tabla2[[#This Row],[Confidencialidad ]]<=4),\"Baja\",IF(AND(Tabla2[[#This Row],[Disponibilidad]]+Tabla2[[#This Row],[Integridad]]+Tabla2[[#This Row],[Confidencialidad ]]>=5,Tabla2[[#This Row],[Disponibilidad]]+Tabla2[[#This Row],[Integridad]]+Tabla2[[#This Row],[Confidencialidad ]]<=7),\"Media\",IF(Tabla2[[#This Row],[Disponibilidad]]+Tabla2[[#This Row],[Integridad]]+Tabla2[[#This Row],[Confidencialidad ]]>=8,\"Alta\",\"error\")))","v":"Baja"}]
["",null,null,null,null,null,null,null,null,null,null,null,null,null,null,null,null,null,null,null,null,null,null,null,null,{"$f":"IF((Tabla2[[#This Row],[Disponibilidad]]+Tabla2[[#This Row],[Integridad]]+Tabla2[[#This Row],[Confidencialidad ]]<=4),\"Baja\",IF(AND(Tabla2[[#This Row],[Disponibilidad]]+Tabla2[[#This Row],[Integridad]]+Tabla2[[#This Row],[Confidencialidad ]]>=5,Tabla2[[#This Row],[Disponibilidad]]+Tabla2[[#This Row],[Integridad]]+Tabla2[[#This Row],[Confidencialidad ]]<=7),\"Media\",IF(Tabla2[[#This Row],[Disponibilidad]]+Tabla2[[#This Row],[Integridad]]+Tabla2[[#This Row],[Confidencialidad ]]>=8,\"Alta\",\"error\")))","v":"Baja"}]
["",null,null,null,null,null,null,null,null,null,null,null,null,null,null,null,null,null,null,null,null,null,null,null,null,{"$f":"IF((Tabla2[[#This Row],[Disponibilidad]]+Tabla2[[#This Row],[Integridad]]+Tabla2[[#This Row],[Confidencialidad ]]<=4),\"Baja\",IF(AND(Tabla2[[#This Row],[Disponibilidad]]+Tabla2[[#This Row],[Integridad]]+Tabla2[[#This Row],[Confidencialidad ]]>=5,Tabla2[[#This Row],[Disponibilidad]]+Tabla2[[#This Row],[Integridad]]+Tabla2[[#This Row],[Confidencialidad ]]<=7),\"Media\",IF(Tabla2[[#This Row],[Disponibilidad]]+Tabla2[[#This Row],[Integridad]]+Tabla2[[#This Row],[Confidencialidad ]]>=8,\"Alta\",\"error\")))","v":"Baja"}]
["",null,null,null,null,null,null,null,null,null,null,null,null,null,null,null,null,null,null,null,null,null,null,null,null,{"$f":"IF((Tabla2[[#This Row],[Disponibilidad]]+Tabla2[[#This Row],[Integridad]]+Tabla2[[#This Row],[Confidencialidad ]]<=4),\"Baja\",IF(AND(Tabla2[[#This Row],[Disponibilidad]]+Tabla2[[#This Row],[Integridad]]+Tabla2[[#This Row],[Confidencialidad ]]>=5,Tabla2[[#This Row],[Disponibilidad]]+Tabla2[[#This Row],[Integridad]]+Tabla2[[#This Row],[Confidencialidad ]]<=7),\"Media\",IF(Tabla2[[#This Row],[Disponibilidad]]+Tabla2[[#This Row],[Integridad]]+Tabla2[[#This Row],[Confidencialidad ]]>=8,\"Alta\",\"error\")))","v":"Baja"}]
["",null,null,null,null,null,null,null,null,null,null,null,null,null,null,null,null,null,null,null,null,null,null,null,null,{"$f":"IF((Tabla2[[#This Row],[Disponibilidad]]+Tabla2[[#This Row],[Integridad]]+Tabla2[[#This Row],[Confidencialidad ]]<=4),\"Baja\",IF(AND(Tabla2[[#This Row],[Disponibilidad]]+Tabla2[[#This Row],[Integridad]]+Tabla2[[#This Row],[Confidencialidad ]]>=5,Tabla2[[#This Row],[Disponibilidad]]+Tabla2[[#This Row],[Integridad]]+Tabla2[[#This Row],[Confidencialidad ]]<=7),\"Media\",IF(Tabla2[[#This Row],[Disponibilidad]]+Tabla2[[#This Row],[Integridad]]+Tabla2[[#This Row],[Confidencialidad ]]>=8,\"Alta\",\"error\")))","v":"Baja"}]
["",null,null,null,null,null,null,null,null,null,null,null,null,null,null,null,null,null,null,null,null,null,null,null,null,{"$f":"IF((Tabla2[[#This Row],[Disponibilidad]]+Tabla2[[#This Row],[Integridad]]+Tabla2[[#This Row],[Confidencialidad ]]<=4),\"Baja\",IF(AND(Tabla2[[#This Row],[Disponibilidad]]+Tabla2[[#This Row],[Integridad]]+Tabla2[[#This Row],[Confidencialidad ]]>=5,Tabla2[[#This Row],[Disponibilidad]]+Tabla2[[#This Row],[Integridad]]+Tabla2[[#This Row],[Confidencialidad ]]<=7),\"Media\",IF(Tabla2[[#This Row],[Disponibilidad]]+Tabla2[[#This Row],[Integridad]]+Tabla2[[#This Row],[Confidencialidad ]]>=8,\"Alta\",\"error\")))","v":"Baja"}]
["",null,null,null,null,null,null,null,null,null,null,null,null,null,null,null,null,null,null,null,null,null,null,null,null,{"$f":"IF((Tabla2[[#This Row],[Disponibilidad]]+Tabla2[[#This Row],[Integridad]]+Tabla2[[#This Row],[Confidencialidad ]]<=4),\"Baja\",IF(AND(Tabla2[[#This Row],[Disponibilidad]]+Tabla2[[#This Row],[Integridad]]+Tabla2[[#This Row],[Confidencialidad ]]>=5,Tabla2[[#This Row],[Disponibilidad]]+Tabla2[[#This Row],[Integridad]]+Tabla2[[#This Row],[Confidencialidad ]]<=7),\"Media\",IF(Tabla2[[#This Row],[Disponibilidad]]+Tabla2[[#This Row],[Integridad]]+Tabla2[[#This Row],[Confidencialidad ]]>=8,\"Alta\",\"error\")))","v":"Baja"}]
["",null,null,null,null,null,null,null,null,null,null,null,null,null,null,null,null,null,null,null,null,null,null,null,null,{"$f":"IF((Tabla2[[#This Row],[Disponibilidad]]+Tabla2[[#This Row],[Integridad]]+Tabla2[[#This Row],[Confidencialidad ]]<=4),\"Baja\",IF(AND(Tabla2[[#This Row],[Disponibilidad]]+Tabla2[[#This Row],[Integridad]]+Tabla2[[#This Row],[Confidencialidad ]]>=5,Tabla2[[#This Row],[Disponibilidad]]+Tabla2[[#This Row],[Integridad]]+Tabla2[[#This Row],[Confidencialidad ]]<=7),\"Media\",IF(Tabla2[[#This Row],[Disponibilidad]]+Tabla2[[#This Row],[Integridad]]+Tabla2[[#This Row],[Confidencialidad ]]>=8,\"Alta\",\"error\")))","v":"Baja"}]
["",null,null,null,null,null,null,null,null,null,null,null,null,null,null,null,null,null,null,null,null,null,null,null,null,{"$f":"IF((Tabla2[[#This Row],[Disponibilidad]]+Tabla2[[#This Row],[Integridad]]+Tabla2[[#This Row],[Confidencialidad ]]<=4),\"Baja\",IF(AND(Tabla2[[#This Row],[Disponibilidad]]+Tabla2[[#This Row],[Integridad]]+Tabla2[[#This Row],[Confidencialidad ]]>=5,Tabla2[[#This Row],[Disponibilidad]]+Tabla2[[#This Row],[Integridad]]+Tabla2[[#This Row],[Confidencialidad ]]<=7),\"Media\",IF(Tabla2[[#This Row],[Disponibilidad]]+Tabla2[[#This Row],[Integridad]]+Tabla2[[#This Row],[Confidencialidad ]]>=8,\"Alta\",\"error\")))","v":"Baja"}]
["",null,null,null,null,null,null,null,null,null,null,null,null,null,null,null,null,null,null,null,null,null,null,null,null,{"$f":"IF((Tabla2[[#This Row],[Disponibilidad]]+Tabla2[[#This Row],[Integridad]]+Tabla2[[#This Row],[Confidencialidad ]]<=4),\"Baja\",IF(AND(Tabla2[[#This Row],[Disponibilidad]]+Tabla2[[#This Row],[Integridad]]+Tabla2[[#This Row],[Confidencialidad ]]>=5,Tabla2[[#This Row],[Disponibilidad]]+Tabla2[[#This Row],[Integridad]]+Tabla2[[#This Row],[Confidencialidad ]]<=7),\"Media\",IF(Tabla2[[#This Row],[Disponibilidad]]+Tabla2[[#This Row],[Integridad]]+Tabla2[[#This Row],[Confidencialidad ]]>=8,\"Alta\",\"error\")))","v":"Baja"}]
["",null,null,null,null,null,null,null,null,null,null,null,null,null,null,null,null,null,null,null,null,null,null,null,null,{"$f":"IF((Tabla2[[#This Row],[Disponibilidad]]+Tabla2[[#This Row],[Integridad]]+Tabla2[[#This Row],[Confidencialidad ]]<=4),\"Baja\",IF(AND(Tabla2[[#This Row],[Disponibilidad]]+Tabla2[[#This Row],[Integridad]]+Tabla2[[#This Row],[Confidencialidad ]]>=5,Tabla2[[#This Row],[Disponibilidad]]+Tabla2[[#This Row],[Integridad]]+Tabla2[[#This Row],[Confidencialidad ]]<=7),\"Media\",IF(Tabla2[[#This Row],[Disponibilidad]]+Tabla2[[#This Row],[Integridad]]+Tabla2[[#This Row],[Confidencialidad ]]>=8,\"Alta\",\"error\")))","v":"Baja"}]
["",null,null,null,null,null,null,null,null,null,null,null,null,null,null,null,null,null,null,null,null,null,null,null,null,{"$f":"IF((Tabla2[[#This Row],[Disponibilidad]]+Tabla2[[#This Row],[Integridad]]+Tabla2[[#This Row],[Confidencialidad ]]<=4),\"Baja\",IF(AND(Tabla2[[#This Row],[Disponibilidad]]+Tabla2[[#This Row],[Integridad]]+Tabla2[[#This Row],[Confidencialidad ]]>=5,Tabla2[[#This Row],[Disponibilidad]]+Tabla2[[#This Row],[Integridad]]+Tabla2[[#This Row],[Confidencialidad ]]<=7),\"Media\",IF(Tabla2[[#This Row],[Disponibilidad]]+Tabla2[[#This Row],[Integridad]]+Tabla2[[#This Row],[Confidencialidad ]]>=8,\"Alta\",\"error\")))","v":"Baja"}]
["",null,null,null,null,null,null,null,null,null,null,null,null,null,null,null,null,null,null,null,null,null,null,null,null,{"$f":"IF((Tabla2[[#This Row],[Disponibilidad]]+Tabla2[[#This Row],[Integridad]]+Tabla2[[#This Row],[Confidencialidad ]]<=4),\"Baja\",IF(AND(Tabla2[[#This Row],[Disponibilidad]]+Tabla2[[#This Row],[Integridad]]+Tabla2[[#This Row],[Confidencialidad ]]>=5,Tabla2[[#This Row],[Disponibilidad]]+Tabla2[[#This Row],[Integridad]]+Tabla2[[#This Row],[Confidencialidad ]]<=7),\"Media\",IF(Tabla2[[#This Row],[Disponibilidad]]+Tabla2[[#This Row],[Integridad]]+Tabla2[[#This Row],[Confidencialidad ]]>=8,\"Alta\",\"error\")))","v":"Baja"}]
["",null,null,null,null,null,null,null,null,null,null,null,null,null,null,null,null,null,null,null,null,null,null,null,null,{"$f":"IF((Tabla2[[#This Row],[Disponibilidad]]+Tabla2[[#This Row],[Integridad]]+Tabla2[[#This Row],[Confidencialidad ]]<=4),\"Baja\",IF(AND(Tabla2[[#This Row],[Disponibilidad]]+Tabla2[[#This Row],[Integridad]]+Tabla2[[#This Row],[Confidencialidad ]]>=5,Tabla2[[#This Row],[Disponibilidad]]+Tabla2[[#This Row],[Integridad]]+Tabla2[[#This Row],[Confidencialidad ]]<=7),\"Media\",IF(Tabla2[[#This Row],[Disponibilidad]]+Tabla2[[#This Row],[Integridad]]+Tabla2[[#This Row],[Confidencialidad ]]>=8,\"Alta\",\"error\")))","v":"Baja"}]
["",null,null,null,null,null,null,null,null,null,null,null,null,null,null,null,null,null,null,null,null,null,null,null,null,{"$f":"IF((Tabla2[[#This Row],[Disponibilidad]]+Tabla2[[#This Row],[Integridad]]+Tabla2[[#This Row],[Confidencialidad ]]<=4),\"Baja\",IF(AND(Tabla2[[#This Row],[Disponibilidad]]+Tabla2[[#This Row],[Integridad]]+Tabla2[[#This Row],[Confidencialidad ]]>=5,Tabla2[[#This Row],[Disponibilidad]]+Tabla2[[#This Row],[Integridad]]+Tabla2[[#This Row],[Confidencialidad ]]<=7),\"Media\",IF(Tabla2[[#This Row],[Disponibilidad]]+Tabla2[[#This Row],[Integridad]]+Tabla2[[#This Row],[Confidencialidad ]]>=8,\"Alta\",\"error\")))","v":"Baja"}]
["",null,null,null,null,null,null,null,null,null,null,null,null,null,null,null,null,null,null,null,null,null,null,null,null,{"$f":"IF((Tabla2[[#This Row],[Disponibilidad]]+Tabla2[[#This Row],[Integridad]]+Tabla2[[#This Row],[Confidencialidad ]]<=4),\"Baja\",IF(AND(Tabla2[[#This Row],[Disponibilidad]]+Tabla2[[#This Row],[Integridad]]+Tabla2[[#This Row],[Confidencialidad ]]>=5,Tabla2[[#This Row],[Disponibilidad]]+Tabla2[[#This Row],[Integridad]]+Tabla2[[#This Row],[Confidencialidad ]]<=7),\"Media\",IF(Tabla2[[#This Row],[Disponibilidad]]+Tabla2[[#This Row],[Integridad]]+Tabla2[[#This Row],[Confidencialidad ]]>=8,\"Alta\",\"error\")))","v":"Baja"}]
["",null,null,null,null,null,null,null,null,null,null,null,null,null,null,null,null,null,null,null,null,null,null,null,null,{"$f":"IF((Tabla2[[#This Row],[Disponibilidad]]+Tabla2[[#This Row],[Integridad]]+Tabla2[[#This Row],[Confidencialidad ]]<=4),\"Baja\",IF(AND(Tabla2[[#This Row],[Disponibilidad]]+Tabla2[[#This Row],[Integridad]]+Tabla2[[#This Row],[Confidencialidad ]]>=5,Tabla2[[#This Row],[Disponibilidad]]+Tabla2[[#This Row],[Integridad]]+Tabla2[[#This Row],[Confidencialidad ]]<=7),\"Media\",IF(Tabla2[[#This Row],[Disponibilidad]]+Tabla2[[#This Row],[Integridad]]+Tabla2[[#This Row],[Confidencialidad ]]>=8,\"Alta\",\"error\")))","v":"Baja"}]
["",null,null,null,null,null,null,null,null,null,null,null,null,null,null,null,null,null,null,null,null,null,null,null,null,{"$f":"IF((Tabla2[[#This Row],[Disponibilidad]]+Tabla2[[#This Row],[Integridad]]+Tabla2[[#This Row],[Confidencialidad ]]<=4),\"Baja\",IF(AND(Tabla2[[#This Row],[Disponibilidad]]+Tabla2[[#This Row],[Integridad]]+Tabla2[[#This Row],[Confidencialidad ]]>=5,Tabla2[[#This Row],[Disponibilidad]]+Tabla2[[#This Row],[Integridad]]+Tabla2[[#This Row],[Confidencialidad ]]<=7),\"Media\",IF(Tabla2[[#This Row],[Disponibilidad]]+Tabla2[[#This Row],[Integridad]]+Tabla2[[#This Row],[Confidencialidad ]]>=8,\"Alta\",\"error\")))","v":"Baja"}]
["",null,null,null,null,null,null,null,null,null,null,null,null,null,null,null,null,null,null,null,null,null,null,null,null,{"$f":"IF((Tabla2[[#This Row],[Disponibilidad]]+Tabla2[[#This Row],[Integridad]]+Tabla2[[#This Row],[Confidencialidad ]]<=4),\"Baja\",IF(AND(Tabla2[[#This Row],[Disponibilidad]]+Tabla2[[#This Row],[Integridad]]+Tabla2[[#This Row],[Confidencialidad ]]>=5,Tabla2[[#This Row],[Disponibilidad]]+Tabla2[[#This Row],[Integridad]]+Tabla2[[#This Row],[Confidencialidad ]]<=7),\"Media\",IF(Tabla2[[#This Row],[Disponibilidad]]+Tabla2[[#This Row],[Integridad]]+Tabla2[[#This Row],[Confidencialidad ]]>=8,\"Alta\",\"error\")))","v":"Baja"}]
[{"$f":"IF(C328<>\"\",1,\"\")","v":""},null,null,null,null,null,null,null,null,null,null,null,null,null,null,null,null,null,null,null,null,null,null,null,null,{"$f":"IF((Tabla2[[#This Row],[Disponibilidad]]+Tabla2[[#This Row],[Integridad]]+Tabla2[[#This Row],[Confidencialidad ]]<=4),\"Baja\",IF(AND(Tabla2[[#This Row],[Disponibilidad]]+Tabla2[[#This Row],[Integridad]]+Tabla2[[#This Row],[Confidencialidad ]]>=5,Tabla2[[#This Row],[Disponibilidad]]+Tabla2[[#This Row],[Integridad]]+Tabla2[[#This Row],[Confidencialidad ]]<=7),\"Media\",IF(Tabla2[[#This Row],[Disponibilidad]]+Tabla2[[#This Row],[Integridad]]+Tabla2[[#This Row],[Confidencialidad ]]>=8,\"Alta\",\"error\")))","v":"Baja"}]
["",null,null,null,null,null,null,null,null,null,null,null,null,null,null,null,null,null,null,null,null,null,null,null,null,{"$f":"IF((Tabla2[[#This Row],[Disponibilidad]]+Tabla2[[#This Row],[Integridad]]+Tabla2[[#This Row],[Confidencialidad ]]<=4),\"Baja\",IF(AND(Tabla2[[#This Row],[Disponibilidad]]+Tabla2[[#This Row],[Integridad]]+Tabla2[[#This Row],[Confidencialidad ]]>=5,Tabla2[[#This Row],[Disponibilidad]]+Tabla2[[#This Row],[Integridad]]+Tabla2[[#This Row],[Confidencialidad ]]<=7),\"Media\",IF(Tabla2[[#This Row],[Disponibilidad]]+Tabla2[[#This Row],[Integridad]]+Tabla2[[#This Row],[Confidencialidad ]]>=8,\"Alta\",\"error\")))","v":"Baja"}]
["",null,null,null,null,null,null,null,null,null,null,null,null,null,null,null,null,null,null,null,null,null,null,null,null,{"$f":"IF((Tabla2[[#This Row],[Disponibilidad]]+Tabla2[[#This Row],[Integridad]]+Tabla2[[#This Row],[Confidencialidad ]]<=4),\"Baja\",IF(AND(Tabla2[[#This Row],[Disponibilidad]]+Tabla2[[#This Row],[Integridad]]+Tabla2[[#This Row],[Confidencialidad ]]>=5,Tabla2[[#This Row],[Disponibilidad]]+Tabla2[[#This Row],[Integridad]]+Tabla2[[#This Row],[Confidencialidad ]]<=7),\"Media\",IF(Tabla2[[#This Row],[Disponibilidad]]+Tabla2[[#This Row],[Integridad]]+Tabla2[[#This Row],[Confidencialidad ]]>=8,\"Alta\",\"error\")))","v":"Baja"}]
["",null,null,null,null,null,null,null,null,null,null,null,null,null,null,null,null,null,null,null,null,null,null,null,null,{"$f":"IF((Tabla2[[#This Row],[Disponibilidad]]+Tabla2[[#This Row],[Integridad]]+Tabla2[[#This Row],[Confidencialidad ]]<=4),\"Baja\",IF(AND(Tabla2[[#This Row],[Disponibilidad]]+Tabla2[[#This Row],[Integridad]]+Tabla2[[#This Row],[Confidencialidad ]]>=5,Tabla2[[#This Row],[Disponibilidad]]+Tabla2[[#This Row],[Integridad]]+Tabla2[[#This Row],[Confidencialidad ]]<=7),\"Media\",IF(Tabla2[[#This Row],[Disponibilidad]]+Tabla2[[#This Row],[Integridad]]+Tabla2[[#This Row],[Confidencialidad ]]>=8,\"Alta\",\"error\")))","v":"Baja"}]
["",null,null,null,null,null,null,null,null,null,null,null,null,null,null,null,null,null,null,null,null,null,null,null,null,{"$f":"IF((Tabla2[[#This Row],[Disponibilidad]]+Tabla2[[#This Row],[Integridad]]+Tabla2[[#This Row],[Confidencialidad ]]<=4),\"Baja\",IF(AND(Tabla2[[#This Row],[Disponibilidad]]+Tabla2[[#This Row],[Integridad]]+Tabla2[[#This Row],[Confidencialidad ]]>=5,Tabla2[[#This Row],[Disponibilidad]]+Tabla2[[#This Row],[Integridad]]+Tabla2[[#This Row],[Confidencialidad ]]<=7),\"Media\",IF(Tabla2[[#This Row],[Disponibilidad]]+Tabla2[[#This Row],[Integridad]]+Tabla2[[#This Row],[Confidencialidad ]]>=8,\"Alta\",\"error\")))","v":"Baja"}]
["",null,null,null,null,null,null,null,null,null,null,null,null,null,null,null,null,null,null,null,null,null,null,null,null,{"$f":"IF((Tabla2[[#This Row],[Disponibilidad]]+Tabla2[[#This Row],[Integridad]]+Tabla2[[#This Row],[Confidencialidad ]]<=4),\"Baja\",IF(AND(Tabla2[[#This Row],[Disponibilidad]]+Tabla2[[#This Row],[Integridad]]+Tabla2[[#This Row],[Confidencialidad ]]>=5,Tabla2[[#This Row],[Disponibilidad]]+Tabla2[[#This Row],[Integridad]]+Tabla2[[#This Row],[Confidencialidad ]]<=7),\"Media\",IF(Tabla2[[#This Row],[Disponibilidad]]+Tabla2[[#This Row],[Integridad]]+Tabla2[[#This Row],[Confidencialidad ]]>=8,\"Alta\",\"error\")))","v":"Baja"}]
["",null,null,null,null,null,null,null,null,null,null,null,null,null,null,null,null,null,null,null,null,null,null,null,null,{"$f":"IF((Tabla2[[#This Row],[Disponibilidad]]+Tabla2[[#This Row],[Integridad]]+Tabla2[[#This Row],[Confidencialidad ]]<=4),\"Baja\",IF(AND(Tabla2[[#This Row],[Disponibilidad]]+Tabla2[[#This Row],[Integridad]]+Tabla2[[#This Row],[Confidencialidad ]]>=5,Tabla2[[#This Row],[Disponibilidad]]+Tabla2[[#This Row],[Integridad]]+Tabla2[[#This Row],[Confidencialidad ]]<=7),\"Media\",IF(Tabla2[[#This Row],[Disponibilidad]]+Tabla2[[#This Row],[Integridad]]+Tabla2[[#This Row],[Confidencialidad ]]>=8,\"Alta\",\"error\")))","v":"Baja"}]
["",null,null,null,null,null,null,null,null,null,null,null,null,null,null,null,null,null,null,null,null,null,null,null,null,{"$f":"IF((Tabla2[[#This Row],[Disponibilidad]]+Tabla2[[#This Row],[Integridad]]+Tabla2[[#This Row],[Confidencialidad ]]<=4),\"Baja\",IF(AND(Tabla2[[#This Row],[Disponibilidad]]+Tabla2[[#This Row],[Integridad]]+Tabla2[[#This Row],[Confidencialidad ]]>=5,Tabla2[[#This Row],[Disponibilidad]]+Tabla2[[#This Row],[Integridad]]+Tabla2[[#This Row],[Confidencialidad ]]<=7),\"Media\",IF(Tabla2[[#This Row],[Disponibilidad]]+Tabla2[[#This Row],[Integridad]]+Tabla2[[#This Row],[Confidencialidad ]]>=8,\"Alta\",\"error\")))","v":"Baja"}]
["",null,null,null,null,null,null,null,null,null,null,null,null,null,null,null,null,null,null,null,null,null,null,null,null,{"$f":"IF((Tabla2[[#This Row],[Disponibilidad]]+Tabla2[[#This Row],[Integridad]]+Tabla2[[#This Row],[Confidencialidad ]]<=4),\"Baja\",IF(AND(Tabla2[[#This Row],[Disponibilidad]]+Tabla2[[#This Row],[Integridad]]+Tabla2[[#This Row],[Confidencialidad ]]>=5,Tabla2[[#This Row],[Disponibilidad]]+Tabla2[[#This Row],[Integridad]]+Tabla2[[#This Row],[Confidencialidad ]]<=7),\"Media\",IF(Tabla2[[#This Row],[Disponibilidad]]+Tabla2[[#This Row],[Integridad]]+Tabla2[[#This Row],[Confidencialidad ]]>=8,\"Alta\",\"error\")))","v":"Baja"}]
["",null,null,null,null,null,null,null,null,null,null,null,null,null,null,null,null,null,null,null,null,null,null,null,null,{"$f":"IF((Tabla2[[#This Row],[Disponibilidad]]+Tabla2[[#This Row],[Integridad]]+Tabla2[[#This Row],[Confidencialidad ]]<=4),\"Baja\",IF(AND(Tabla2[[#This Row],[Disponibilidad]]+Tabla2[[#This Row],[Integridad]]+Tabla2[[#This Row],[Confidencialidad ]]>=5,Tabla2[[#This Row],[Disponibilidad]]+Tabla2[[#This Row],[Integridad]]+Tabla2[[#This Row],[Confidencialidad ]]<=7),\"Media\",IF(Tabla2[[#This Row],[Disponibilidad]]+Tabla2[[#This Row],[Integridad]]+Tabla2[[#This Row],[Confidencialidad ]]>=8,\"Alta\",\"error\")))","v":"Baja"}]
["",null,null,null,null,null,null,null,null,null,null,null,null,null,null,null,null,null,null,null,null,null,null,null,null,{"$f":"IF((Tabla2[[#This Row],[Disponibilidad]]+Tabla2[[#This Row],[Integridad]]+Tabla2[[#This Row],[Confidencialidad ]]<=4),\"Baja\",IF(AND(Tabla2[[#This Row],[Disponibilidad]]+Tabla2[[#This Row],[Integridad]]+Tabla2[[#This Row],[Confidencialidad ]]>=5,Tabla2[[#This Row],[Disponibilidad]]+Tabla2[[#This Row],[Integridad]]+Tabla2[[#This Row],[Confidencialidad ]]<=7),\"Media\",IF(Tabla2[[#This Row],[Disponibilidad]]+Tabla2[[#This Row],[Integridad]]+Tabla2[[#This Row],[Confidencialidad ]]>=8,\"Alta\",\"error\")))","v":"Baja"}]
["",null,null,null,null,null,null,null,null,null,null,null,null,null,null,null,null,null,null,null,null,null,null,null,null,{"$f":"IF((Tabla2[[#This Row],[Disponibilidad]]+Tabla2[[#This Row],[Integridad]]+Tabla2[[#This Row],[Confidencialidad ]]<=4),\"Baja\",IF(AND(Tabla2[[#This Row],[Disponibilidad]]+Tabla2[[#This Row],[Integridad]]+Tabla2[[#This Row],[Confidencialidad ]]>=5,Tabla2[[#This Row],[Disponibilidad]]+Tabla2[[#This Row],[Integridad]]+Tabla2[[#This Row],[Confidencialidad ]]<=7),\"Media\",IF(Tabla2[[#This Row],[Disponibilidad]]+Tabla2[[#This Row],[Integridad]]+Tabla2[[#This Row],[Confidencialidad ]]>=8,\"Alta\",\"error\")))","v":"Baja"}]
["",null,null,null,null,null,null,null,null,null,null,null,null,null,null,null,null,null,null,null,null,null,null,null,null,{"$f":"IF((Tabla2[[#This Row],[Disponibilidad]]+Tabla2[[#This Row],[Integridad]]+Tabla2[[#This Row],[Confidencialidad ]]<=4),\"Baja\",IF(AND(Tabla2[[#This Row],[Disponibilidad]]+Tabla2[[#This Row],[Integridad]]+Tabla2[[#This Row],[Confidencialidad ]]>=5,Tabla2[[#This Row],[Disponibilidad]]+Tabla2[[#This Row],[Integridad]]+Tabla2[[#This Row],[Confidencialidad ]]<=7),\"Media\",IF(Tabla2[[#This Row],[Disponibilidad]]+Tabla2[[#This Row],[Integridad]]+Tabla2[[#This Row],[Confidencialidad ]]>=8,\"Alta\",\"error\")))","v":"Baja"}]
["",null,null,null,null,null,null,null,null,null,null,null,null,null,null,null,null,null,null,null,null,null,null,null,null,{"$f":"IF((Tabla2[[#This Row],[Disponibilidad]]+Tabla2[[#This Row],[Integridad]]+Tabla2[[#This Row],[Confidencialidad ]]<=4),\"Baja\",IF(AND(Tabla2[[#This Row],[Disponibilidad]]+Tabla2[[#This Row],[Integridad]]+Tabla2[[#This Row],[Confidencialidad ]]>=5,Tabla2[[#This Row],[Disponibilidad]]+Tabla2[[#This Row],[Integridad]]+Tabla2[[#This Row],[Confidencialidad ]]<=7),\"Media\",IF(Tabla2[[#This Row],[Disponibilidad]]+Tabla2[[#This Row],[Integridad]]+Tabla2[[#This Row],[Confidencialidad ]]>=8,\"Alta\",\"error\")))","v":"Baja"}]
["",null,null,null,null,null,null,null,null,null,null,null,null,null,null,null,null,null,null,null,null,null,null,null,null,{"$f":"IF((Tabla2[[#This Row],[Disponibilidad]]+Tabla2[[#This Row],[Integridad]]+Tabla2[[#This Row],[Confidencialidad ]]<=4),\"Baja\",IF(AND(Tabla2[[#This Row],[Disponibilidad]]+Tabla2[[#This Row],[Integridad]]+Tabla2[[#This Row],[Confidencialidad ]]>=5,Tabla2[[#This Row],[Disponibilidad]]+Tabla2[[#This Row],[Integridad]]+Tabla2[[#This Row],[Confidencialidad ]]<=7),\"Media\",IF(Tabla2[[#This Row],[Disponibilidad]]+Tabla2[[#This Row],[Integridad]]+Tabla2[[#This Row],[Confidencialidad ]]>=8,\"Alta\",\"error\")))","v":"Baja"}]
["",null,null,null,null,null,null,null,null,null,null,null,null,null,null,null,null,null,null,null,null,null,null,null,null,{"$f":"IF((Tabla2[[#This Row],[Disponibilidad]]+Tabla2[[#This Row],[Integridad]]+Tabla2[[#This Row],[Confidencialidad ]]<=4),\"Baja\",IF(AND(Tabla2[[#This Row],[Disponibilidad]]+Tabla2[[#This Row],[Integridad]]+Tabla2[[#This Row],[Confidencialidad ]]>=5,Tabla2[[#This Row],[Disponibilidad]]+Tabla2[[#This Row],[Integridad]]+Tabla2[[#This Row],[Confidencialidad ]]<=7),\"Media\",IF(Tabla2[[#This Row],[Disponibilidad]]+Tabla2[[#This Row],[Integridad]]+Tabla2[[#This Row],[Confidencialidad ]]>=8,\"Alta\",\"error\")))","v":"Baja"}]
["",null,null,null,null,null,null,null,null,null,null,null,null,null,null,null,null,null,null,null,null,null,null,null,null,{"$f":"IF((Tabla2[[#This Row],[Disponibilidad]]+Tabla2[[#This Row],[Integridad]]+Tabla2[[#This Row],[Confidencialidad ]]<=4),\"Baja\",IF(AND(Tabla2[[#This Row],[Disponibilidad]]+Tabla2[[#This Row],[Integridad]]+Tabla2[[#This Row],[Confidencialidad ]]>=5,Tabla2[[#This Row],[Disponibilidad]]+Tabla2[[#This Row],[Integridad]]+Tabla2[[#This Row],[Confidencialidad ]]<=7),\"Media\",IF(Tabla2[[#This Row],[Disponibilidad]]+Tabla2[[#This Row],[Integridad]]+Tabla2[[#This Row],[Confidencialidad ]]>=8,\"Alta\",\"error\")))","v":"Baja"}]
["",null,null,null,null,null,null,null,null,null,null,null,null,null,null,null,null,null,null,null,null,null,null,null,null,{"$f":"IF((Tabla2[[#This Row],[Disponibilidad]]+Tabla2[[#This Row],[Integridad]]+Tabla2[[#This Row],[Confidencialidad ]]<=4),\"Baja\",IF(AND(Tabla2[[#This Row],[Disponibilidad]]+Tabla2[[#This Row],[Integridad]]+Tabla2[[#This Row],[Confidencialidad ]]>=5,Tabla2[[#This Row],[Disponibilidad]]+Tabla2[[#This Row],[Integridad]]+Tabla2[[#This Row],[Confidencialidad ]]<=7),\"Media\",IF(Tabla2[[#This Row],[Disponibilidad]]+Tabla2[[#This Row],[Integridad]]+Tabla2[[#This Row],[Confidencialidad ]]>=8,\"Alta\",\"error\")))","v":"Baja"}]
["",null,null,null,null,null,null,null,null,null,null,null,null,null,null,null,null,null,null,null,null,null,null,null,null,{"$f":"IF((Tabla2[[#This Row],[Disponibilidad]]+Tabla2[[#This Row],[Integridad]]+Tabla2[[#This Row],[Confidencialidad ]]<=4),\"Baja\",IF(AND(Tabla2[[#This Row],[Disponibilidad]]+Tabla2[[#This Row],[Integridad]]+Tabla2[[#This Row],[Confidencialidad ]]>=5,Tabla2[[#This Row],[Disponibilidad]]+Tabla2[[#This Row],[Integridad]]+Tabla2[[#This Row],[Confidencialidad ]]<=7),\"Media\",IF(Tabla2[[#This Row],[Disponibilidad]]+Tabla2[[#This Row],[Integridad]]+Tabla2[[#This Row],[Confidencialidad ]]>=8,\"Alta\",\"error\")))","v":"Baja"}]
["",null,null,null,null,null,null,null,null,null,null,null,null,null,null,null,null,null,null,null,null,null,null,null,null,{"$f":"IF((Tabla2[[#This Row],[Disponibilidad]]+Tabla2[[#This Row],[Integridad]]+Tabla2[[#This Row],[Confidencialidad ]]<=4),\"Baja\",IF(AND(Tabla2[[#This Row],[Disponibilidad]]+Tabla2[[#This Row],[Integridad]]+Tabla2[[#This Row],[Confidencialidad ]]>=5,Tabla2[[#This Row],[Disponibilidad]]+Tabla2[[#This Row],[Integridad]]+Tabla2[[#This Row],[Confidencialidad ]]<=7),\"Media\",IF(Tabla2[[#This Row],[Disponibilidad]]+Tabla2[[#This Row],[Integridad]]+Tabla2[[#This Row],[Confidencialidad ]]>=8,\"Alta\",\"error\")))","v":"Baja"}]
["",null,null,null,null,null,null,null,null,null,null,null,null,null,null,null,null,null,null,null,null,null,null,null,null,{"$f":"IF((Tabla2[[#This Row],[Disponibilidad]]+Tabla2[[#This Row],[Integridad]]+Tabla2[[#This Row],[Confidencialidad ]]<=4),\"Baja\",IF(AND(Tabla2[[#This Row],[Disponibilidad]]+Tabla2[[#This Row],[Integridad]]+Tabla2[[#This Row],[Confidencialidad ]]>=5,Tabla2[[#This Row],[Disponibilidad]]+Tabla2[[#This Row],[Integridad]]+Tabla2[[#This Row],[Confidencialidad ]]<=7),\"Media\",IF(Tabla2[[#This Row],[Disponibilidad]]+Tabla2[[#This Row],[Integridad]]+Tabla2[[#This Row],[Confidencialidad ]]>=8,\"Alta\",\"error\")))","v":"Baja"}]
["",null,null,null,null,null,null,null,null,null,null,null,null,null,null,null,null,null,null,null,null,null,null,null,null,{"$f":"IF((Tabla2[[#This Row],[Disponibilidad]]+Tabla2[[#This Row],[Integridad]]+Tabla2[[#This Row],[Confidencialidad ]]<=4),\"Baja\",IF(AND(Tabla2[[#This Row],[Disponibilidad]]+Tabla2[[#This Row],[Integridad]]+Tabla2[[#This Row],[Confidencialidad ]]>=5,Tabla2[[#This Row],[Disponibilidad]]+Tabla2[[#This Row],[Integridad]]+Tabla2[[#This Row],[Confidencialidad ]]<=7),\"Media\",IF(Tabla2[[#This Row],[Disponibilidad]]+Tabla2[[#This Row],[Integridad]]+Tabla2[[#This Row],[Confidencialidad ]]>=8,\"Alta\",\"error\")))","v":"Baja"}]
["",null,null,null,null,null,null,null,null,null,null,null,null,null,null,null,null,null,null,null,null,null,null,null,null,{"$f":"IF((Tabla2[[#This Row],[Disponibilidad]]+Tabla2[[#This Row],[Integridad]]+Tabla2[[#This Row],[Confidencialidad ]]<=4),\"Baja\",IF(AND(Tabla2[[#This Row],[Disponibilidad]]+Tabla2[[#This Row],[Integridad]]+Tabla2[[#This Row],[Confidencialidad ]]>=5,Tabla2[[#This Row],[Disponibilidad]]+Tabla2[[#This Row],[Integridad]]+Tabla2[[#This Row],[Confidencialidad ]]<=7),\"Media\",IF(Tabla2[[#This Row],[Disponibilidad]]+Tabla2[[#This Row],[Integridad]]+Tabla2[[#This Row],[Confidencialidad ]]>=8,\"Alta\",\"error\")))","v":"Baja"}]
["",null,null,null,null,null,null,null,null,null,null,null,null,null,null,null,null,null,null,null,null,null,null,null,null,{"$f":"IF((Tabla2[[#This Row],[Disponibilidad]]+Tabla2[[#This Row],[Integridad]]+Tabla2[[#This Row],[Confidencialidad ]]<=4),\"Baja\",IF(AND(Tabla2[[#This Row],[Disponibilidad]]+Tabla2[[#This Row],[Integridad]]+Tabla2[[#This Row],[Confidencialidad ]]>=5,Tabla2[[#This Row],[Disponibilidad]]+Tabla2[[#This Row],[Integridad]]+Tabla2[[#This Row],[Confidencialidad ]]<=7),\"Media\",IF(Tabla2[[#This Row],[Disponibilidad]]+Tabla2[[#This Row],[Integridad]]+Tabla2[[#This Row],[Confidencialidad ]]>=8,\"Alta\",\"error\")))","v":"Baja"}]
["",null,null,null,null,null,null,null,null,null,null,null,null,null,null,null,null,null,null,null,null,null,null,null,null,{"$f":"IF((Tabla2[[#This Row],[Disponibilidad]]+Tabla2[[#This Row],[Integridad]]+Tabla2[[#This Row],[Confidencialidad ]]<=4),\"Baja\",IF(AND(Tabla2[[#This Row],[Disponibilidad]]+Tabla2[[#This Row],[Integridad]]+Tabla2[[#This Row],[Confidencialidad ]]>=5,Tabla2[[#This Row],[Disponibilidad]]+Tabla2[[#This Row],[Integridad]]+Tabla2[[#This Row],[Confidencialidad ]]<=7),\"Media\",IF(Tabla2[[#This Row],[Disponibilidad]]+Tabla2[[#This Row],[Integridad]]+Tabla2[[#This Row],[Confidencialidad ]]>=8,\"Alta\",\"error\")))","v":"Baja"}]
["",null,null,null,null,null,null,null,null,null,null,null,null,null,null,null,null,null,null,null,null,null,null,null,null,{"$f":"IF((Tabla2[[#This Row],[Disponibilidad]]+Tabla2[[#This Row],[Integridad]]+Tabla2[[#This Row],[Confidencialidad ]]<=4),\"Baja\",IF(AND(Tabla2[[#This Row],[Disponibilidad]]+Tabla2[[#This Row],[Integridad]]+Tabla2[[#This Row],[Confidencialidad ]]>=5,Tabla2[[#This Row],[Disponibilidad]]+Tabla2[[#This Row],[Integridad]]+Tabla2[[#This Row],[Confidencialidad ]]<=7),\"Media\",IF(Tabla2[[#This Row],[Disponibilidad]]+Tabla2[[#This Row],[Integridad]]+Tabla2[[#This Row],[Confidencialidad ]]>=8,\"Alta\",\"error\")))","v":"Baja"}]
["",null,null,null,null,null,null,null,null,null,null,null,null,null,null,null,null,null,null,null,null,null,null,null,null,{"$f":"IF((Tabla2[[#This Row],[Disponibilidad]]+Tabla2[[#This Row],[Integridad]]+Tabla2[[#This Row],[Confidencialidad ]]<=4),\"Baja\",IF(AND(Tabla2[[#This Row],[Disponibilidad]]+Tabla2[[#This Row],[Integridad]]+Tabla2[[#This Row],[Confidencialidad ]]>=5,Tabla2[[#This Row],[Disponibilidad]]+Tabla2[[#This Row],[Integridad]]+Tabla2[[#This Row],[Confidencialidad ]]<=7),\"Media\",IF(Tabla2[[#This Row],[Disponibilidad]]+Tabla2[[#This Row],[Integridad]]+Tabla2[[#This Row],[Confidencialidad ]]>=8,\"Alta\",\"error\")))","v":"Baja"}]
["",null,null,null,null,null,null,null,null,null,null,null,null,null,null,null,null,null,null,null,null,null,null,null,null,{"$f":"IF((Tabla2[[#This Row],[Disponibilidad]]+Tabla2[[#This Row],[Integridad]]+Tabla2[[#This Row],[Confidencialidad ]]<=4),\"Baja\",IF(AND(Tabla2[[#This Row],[Disponibilidad]]+Tabla2[[#This Row],[Integridad]]+Tabla2[[#This Row],[Confidencialidad ]]>=5,Tabla2[[#This Row],[Disponibilidad]]+Tabla2[[#This Row],[Integridad]]+Tabla2[[#This Row],[Confidencialidad ]]<=7),\"Media\",IF(Tabla2[[#This Row],[Disponibilidad]]+Tabla2[[#This Row],[Integridad]]+Tabla2[[#This Row],[Confidencialidad ]]>=8,\"Alta\",\"error\")))","v":"Baja"}]
["",null,null,null,null,null,null,null,null,null,null,null,null,null,null,null,null,null,null,null,null,null,null,null,null,{"$f":"IF((Tabla2[[#This Row],[Disponibilidad]]+Tabla2[[#This Row],[Integridad]]+Tabla2[[#This Row],[Confidencialidad ]]<=4),\"Baja\",IF(AND(Tabla2[[#This Row],[Disponibilidad]]+Tabla2[[#This Row],[Integridad]]+Tabla2[[#This Row],[Confidencialidad ]]>=5,Tabla2[[#This Row],[Disponibilidad]]+Tabla2[[#This Row],[Integridad]]+Tabla2[[#This Row],[Confidencialidad ]]<=7),\"Media\",IF(Tabla2[[#This Row],[Disponibilidad]]+Tabla2[[#This Row],[Integridad]]+Tabla2[[#This Row],[Confidencialidad ]]>=8,\"Alta\",\"error\")))","v":"Baja"}]
["",null,null,null,null,null,null,null,null,null,null,null,null,null,null,null,null,null,null,null,null,null,null,null,null,{"$f":"IF((Tabla2[[#This Row],[Disponibilidad]]+Tabla2[[#This Row],[Integridad]]+Tabla2[[#This Row],[Confidencialidad ]]<=4),\"Baja\",IF(AND(Tabla2[[#This Row],[Disponibilidad]]+Tabla2[[#This Row],[Integridad]]+Tabla2[[#This Row],[Confidencialidad ]]>=5,Tabla2[[#This Row],[Disponibilidad]]+Tabla2[[#This Row],[Integridad]]+Tabla2[[#This Row],[Confidencialidad ]]<=7),\"Media\",IF(Tabla2[[#This Row],[Disponibilidad]]+Tabla2[[#This Row],[Integridad]]+Tabla2[[#This Row],[Confidencialidad ]]>=8,\"Alta\",\"error\")))","v":"Baja"}]
["",null,null,null,null,null,null,null,null,null,null,null,null,null,null,null,null,null,null,null,null,null,null,null,null,{"$f":"IF((Tabla2[[#This Row],[Disponibilidad]]+Tabla2[[#This Row],[Integridad]]+Tabla2[[#This Row],[Confidencialidad ]]<=4),\"Baja\",IF(AND(Tabla2[[#This Row],[Disponibilidad]]+Tabla2[[#This Row],[Integridad]]+Tabla2[[#This Row],[Confidencialidad ]]>=5,Tabla2[[#This Row],[Disponibilidad]]+Tabla2[[#This Row],[Integridad]]+Tabla2[[#This Row],[Confidencialidad ]]<=7),\"Media\",IF(Tabla2[[#This Row],[Disponibilidad]]+Tabla2[[#This Row],[Integridad]]+Tabla2[[#This Row],[Confidencialidad ]]>=8,\"Alta\",\"error\")))","v":"Baja"}]
["",null,null,null,null,null,null,null,null,null,null,null,null,null,null,null,null,null,null,null,null,null,null,null,null,{"$f":"IF((Tabla2[[#This Row],[Disponibilidad]]+Tabla2[[#This Row],[Integridad]]+Tabla2[[#This Row],[Confidencialidad ]]<=4),\"Baja\",IF(AND(Tabla2[[#This Row],[Disponibilidad]]+Tabla2[[#This Row],[Integridad]]+Tabla2[[#This Row],[Confidencialidad ]]>=5,Tabla2[[#This Row],[Disponibilidad]]+Tabla2[[#This Row],[Integridad]]+Tabla2[[#This Row],[Confidencialidad ]]<=7),\"Media\",IF(Tabla2[[#This Row],[Disponibilidad]]+Tabla2[[#This Row],[Integridad]]+Tabla2[[#This Row],[Confidencialidad ]]>=8,\"Alta\",\"error\")))","v":"Baja"}]
["",null,null,null,null,null,null,null,null,null,null,null,null,null,null,null,null,null,null,null,null,null,null,null,null,{"$f":"IF((Tabla2[[#This Row],[Disponibilidad]]+Tabla2[[#This Row],[Integridad]]+Tabla2[[#This Row],[Confidencialidad ]]<=4),\"Baja\",IF(AND(Tabla2[[#This Row],[Disponibilidad]]+Tabla2[[#This Row],[Integridad]]+Tabla2[[#This Row],[Confidencialidad ]]>=5,Tabla2[[#This Row],[Disponibilidad]]+Tabla2[[#This Row],[Integridad]]+Tabla2[[#This Row],[Confidencialidad ]]<=7),\"Media\",IF(Tabla2[[#This Row],[Disponibilidad]]+Tabla2[[#This Row],[Integridad]]+Tabla2[[#This Row],[Confidencialidad ]]>=8,\"Alta\",\"error\")))","v":"Baja"}]
["",null,null,null,null,null,null,null,null,null,null,null,null,null,null,null,null,null,null,null,null,null,null,null,null,{"$f":"IF((Tabla2[[#This Row],[Disponibilidad]]+Tabla2[[#This Row],[Integridad]]+Tabla2[[#This Row],[Confidencialidad ]]<=4),\"Baja\",IF(AND(Tabla2[[#This Row],[Disponibilidad]]+Tabla2[[#This Row],[Integridad]]+Tabla2[[#This Row],[Confidencialidad ]]>=5,Tabla2[[#This Row],[Disponibilidad]]+Tabla2[[#This Row],[Integridad]]+Tabla2[[#This Row],[Confidencialidad ]]<=7),\"Media\",IF(Tabla2[[#This Row],[Disponibilidad]]+Tabla2[[#This Row],[Integridad]]+Tabla2[[#This Row],[Confidencialidad ]]>=8,\"Alta\",\"error\")))","v":"Baja"}]
["",null,null,null,null,null,null,null,null,null,null,null,null,null,null,null,null,null,null,null,null,null,null,null,null,{"$f":"IF((Tabla2[[#This Row],[Disponibilidad]]+Tabla2[[#This Row],[Integridad]]+Tabla2[[#This Row],[Confidencialidad ]]<=4),\"Baja\",IF(AND(Tabla2[[#This Row],[Disponibilidad]]+Tabla2[[#This Row],[Integridad]]+Tabla2[[#This Row],[Confidencialidad ]]>=5,Tabla2[[#This Row],[Disponibilidad]]+Tabla2[[#This Row],[Integridad]]+Tabla2[[#This Row],[Confidencialidad ]]<=7),\"Media\",IF(Tabla2[[#This Row],[Disponibilidad]]+Tabla2[[#This Row],[Integridad]]+Tabla2[[#This Row],[Confidencialidad ]]>=8,\"Alta\",\"error\")))","v":"Baja"}]
["",null,null,null,null,null,null,null,null,null,null,null,null,null,null,null,null,null,null,null,null,null,null,null,null,{"$f":"IF((Tabla2[[#This Row],[Disponibilidad]]+Tabla2[[#This Row],[Integridad]]+Tabla2[[#This Row],[Confidencialidad ]]<=4),\"Baja\",IF(AND(Tabla2[[#This Row],[Disponibilidad]]+Tabla2[[#This Row],[Integridad]]+Tabla2[[#This Row],[Confidencialidad ]]>=5,Tabla2[[#This Row],[Disponibilidad]]+Tabla2[[#This Row],[Integridad]]+Tabla2[[#This Row],[Confidencialidad ]]<=7),\"Media\",IF(Tabla2[[#This Row],[Disponibilidad]]+Tabla2[[#This Row],[Integridad]]+Tabla2[[#This Row],[Confidencialidad ]]>=8,\"Alta\",\"error\")))","v":"Baja"}]
["",null,null,null,null,null,null,null,null,null,null,null,null,null,null,null,null,null,null,null,null,null,null,null,null,{"$f":"IF((Tabla2[[#This Row],[Disponibilidad]]+Tabla2[[#This Row],[Integridad]]+Tabla2[[#This Row],[Confidencialidad ]]<=4),\"Baja\",IF(AND(Tabla2[[#This Row],[Disponibilidad]]+Tabla2[[#This Row],[Integridad]]+Tabla2[[#This Row],[Confidencialidad ]]>=5,Tabla2[[#This Row],[Disponibilidad]]+Tabla2[[#This Row],[Integridad]]+Tabla2[[#This Row],[Confidencialidad ]]<=7),\"Media\",IF(Tabla2[[#This Row],[Disponibilidad]]+Tabla2[[#This Row],[Integridad]]+Tabla2[[#This Row],[Confidencialidad ]]>=8,\"Alta\",\"error\")))","v":"Baja"}]
["",null,null,null,null,null,null,null,null,null,null,null,null,null,null,null,null,null,null,null,null,null,null,null,null,{"$f":"IF((Tabla2[[#This Row],[Disponibilidad]]+Tabla2[[#This Row],[Integridad]]+Tabla2[[#This Row],[Confidencialidad ]]<=4),\"Baja\",IF(AND(Tabla2[[#This Row],[Disponibilidad]]+Tabla2[[#This Row],[Integridad]]+Tabla2[[#This Row],[Confidencialidad ]]>=5,Tabla2[[#This Row],[Disponibilidad]]+Tabla2[[#This Row],[Integridad]]+Tabla2[[#This Row],[Confidencialidad ]]<=7),\"Media\",IF(Tabla2[[#This Row],[Disponibilidad]]+Tabla2[[#This Row],[Integridad]]+Tabla2[[#This Row],[Confidencialidad ]]>=8,\"Alta\",\"error\")))","v":"Baja"}]
["",null,null,null,null,null,null,null,null,null,null,null,null,null,null,null,null,null,null,null,null,null,null,null,null,{"$f":"IF((Tabla2[[#This Row],[Disponibilidad]]+Tabla2[[#This Row],[Integridad]]+Tabla2[[#This Row],[Confidencialidad ]]<=4),\"Baja\",IF(AND(Tabla2[[#This Row],[Disponibilidad]]+Tabla2[[#This Row],[Integridad]]+Tabla2[[#This Row],[Confidencialidad ]]>=5,Tabla2[[#This Row],[Disponibilidad]]+Tabla2[[#This Row],[Integridad]]+Tabla2[[#This Row],[Confidencialidad ]]<=7),\"Media\",IF(Tabla2[[#This Row],[Disponibilidad]]+Tabla2[[#This Row],[Integridad]]+Tabla2[[#This Row],[Confidencialidad ]]>=8,\"Alta\",\"error\")))","v":"Baja"}]
["",null,null,null,null,null,null,null,null,null,null,null,null,null,null,null,null,null,null,null,null,null,null,null,null,{"$f":"IF((Tabla2[[#This Row],[Disponibilidad]]+Tabla2[[#This Row],[Integridad]]+Tabla2[[#This Row],[Confidencialidad ]]<=4),\"Baja\",IF(AND(Tabla2[[#This Row],[Disponibilidad]]+Tabla2[[#This Row],[Integridad]]+Tabla2[[#This Row],[Confidencialidad ]]>=5,Tabla2[[#This Row],[Disponibilidad]]+Tabla2[[#This Row],[Integridad]]+Tabla2[[#This Row],[Confidencialidad ]]<=7),\"Media\",IF(Tabla2[[#This Row],[Disponibilidad]]+Tabla2[[#This Row],[Integridad]]+Tabla2[[#This Row],[Confidencialidad ]]>=8,\"Alta\",\"error\")))","v":"Baja"}]
["",null,null,null,null,null,null,null,null,null,null,null,null,null,null,null,null,null,null,null,null,null,null,null,null,{"$f":"IF((Tabla2[[#This Row],[Disponibilidad]]+Tabla2[[#This Row],[Integridad]]+Tabla2[[#This Row],[Confidencialidad ]]<=4),\"Baja\",IF(AND(Tabla2[[#This Row],[Disponibilidad]]+Tabla2[[#This Row],[Integridad]]+Tabla2[[#This Row],[Confidencialidad ]]>=5,Tabla2[[#This Row],[Disponibilidad]]+Tabla2[[#This Row],[Integridad]]+Tabla2[[#This Row],[Confidencialidad ]]<=7),\"Media\",IF(Tabla2[[#This Row],[Disponibilidad]]+Tabla2[[#This Row],[Integridad]]+Tabla2[[#This Row],[Confidencialidad ]]>=8,\"Alta\",\"error\")))","v":"Baja"}]
["",null,null,null,null,null,null,null,null,null,null,null,null,null,null,null,null,null,null,null,null,null,null,null,null,{"$f":"IF((Tabla2[[#This Row],[Disponibilidad]]+Tabla2[[#This Row],[Integridad]]+Tabla2[[#This Row],[Confidencialidad ]]<=4),\"Baja\",IF(AND(Tabla2[[#This Row],[Disponibilidad]]+Tabla2[[#This Row],[Integridad]]+Tabla2[[#This Row],[Confidencialidad ]]>=5,Tabla2[[#This Row],[Disponibilidad]]+Tabla2[[#This Row],[Integridad]]+Tabla2[[#This Row],[Confidencialidad ]]<=7),\"Media\",IF(Tabla2[[#This Row],[Disponibilidad]]+Tabla2[[#This Row],[Integridad]]+Tabla2[[#This Row],[Confidencialidad ]]>=8,\"Alta\",\"error\")))","v":"Baja"}]
["",null,null,null,null,null,null,null,null,null,null,null,null,null,null,null,null,null,null,null,null,null,null,null,null,{"$f":"IF((Tabla2[[#This Row],[Disponibilidad]]+Tabla2[[#This Row],[Integridad]]+Tabla2[[#This Row],[Confidencialidad ]]<=4),\"Baja\",IF(AND(Tabla2[[#This Row],[Disponibilidad]]+Tabla2[[#This Row],[Integridad]]+Tabla2[[#This Row],[Confidencialidad ]]>=5,Tabla2[[#This Row],[Disponibilidad]]+Tabla2[[#This Row],[Integridad]]+Tabla2[[#This Row],[Confidencialidad ]]<=7),\"Media\",IF(Tabla2[[#This Row],[Disponibilidad]]+Tabla2[[#This Row],[Integridad]]+Tabla2[[#This Row],[Confidencialidad ]]>=8,\"Alta\",\"error\")))","v":"Baja"}]
["",null,null,null,null,null,null,null,null,null,null,null,null,null,null,null,null,null,null,null,null,null,null,null,null,{"$f":"IF((Tabla2[[#This Row],[Disponibilidad]]+Tabla2[[#This Row],[Integridad]]+Tabla2[[#This Row],[Confidencialidad ]]<=4),\"Baja\",IF(AND(Tabla2[[#This Row],[Disponibilidad]]+Tabla2[[#This Row],[Integridad]]+Tabla2[[#This Row],[Confidencialidad ]]>=5,Tabla2[[#This Row],[Disponibilidad]]+Tabla2[[#This Row],[Integridad]]+Tabla2[[#This Row],[Confidencialidad ]]<=7),\"Media\",IF(Tabla2[[#This Row],[Disponibilidad]]+Tabla2[[#This Row],[Integridad]]+Tabla2[[#This Row],[Confidencialidad ]]>=8,\"Alta\",\"error\")))","v":"Baja"}]
["",null,null,null,null,null,null,null,null,null,null,null,null,null,null,null,null,null,null,null,null,null,null,null,null,{"$f":"IF((Tabla2[[#This Row],[Disponibilidad]]+Tabla2[[#This Row],[Integridad]]+Tabla2[[#This Row],[Confidencialidad ]]<=4),\"Baja\",IF(AND(Tabla2[[#This Row],[Disponibilidad]]+Tabla2[[#This Row],[Integridad]]+Tabla2[[#This Row],[Confidencialidad ]]>=5,Tabla2[[#This Row],[Disponibilidad]]+Tabla2[[#This Row],[Integridad]]+Tabla2[[#This Row],[Confidencialidad ]]<=7),\"Media\",IF(Tabla2[[#This Row],[Disponibilidad]]+Tabla2[[#This Row],[Integridad]]+Tabla2[[#This Row],[Confidencialidad ]]>=8,\"Alta\",\"error\")))","v":"Baja"}]
["",null,null,null,null,null,null,null,null,null,null,null,null,null,null,null,null,null,null,null,null,null,null,null,null,{"$f":"IF((Tabla2[[#This Row],[Disponibilidad]]+Tabla2[[#This Row],[Integridad]]+Tabla2[[#This Row],[Confidencialidad ]]<=4),\"Baja\",IF(AND(Tabla2[[#This Row],[Disponibilidad]]+Tabla2[[#This Row],[Integridad]]+Tabla2[[#This Row],[Confidencialidad ]]>=5,Tabla2[[#This Row],[Disponibilidad]]+Tabla2[[#This Row],[Integridad]]+Tabla2[[#This Row],[Confidencialidad ]]<=7),\"Media\",IF(Tabla2[[#This Row],[Disponibilidad]]+Tabla2[[#This Row],[Integridad]]+Tabla2[[#This Row],[Confidencialidad ]]>=8,\"Alta\",\"error\")))","v":"Baja"}]
["",null,null,null,null,null,null,null,null,null,null,null,null,null,null,null,null,null,null,null,null,null,null,null,null,{"$f":"IF((Tabla2[[#This Row],[Disponibilidad]]+Tabla2[[#This Row],[Integridad]]+Tabla2[[#This Row],[Confidencialidad ]]<=4),\"Baja\",IF(AND(Tabla2[[#This Row],[Disponibilidad]]+Tabla2[[#This Row],[Integridad]]+Tabla2[[#This Row],[Confidencialidad ]]>=5,Tabla2[[#This Row],[Disponibilidad]]+Tabla2[[#This Row],[Integridad]]+Tabla2[[#This Row],[Confidencialidad ]]<=7),\"Media\",IF(Tabla2[[#This Row],[Disponibilidad]]+Tabla2[[#This Row],[Integridad]]+Tabla2[[#This Row],[Confidencialidad ]]>=8,\"Alta\",\"error\")))","v":"Baja"}]
["",null,null,null,null,null,null,null,null,null,null,null,null,null,null,null,null,null,null,null,null,null,null,null,null,{"$f":"IF((Tabla2[[#This Row],[Disponibilidad]]+Tabla2[[#This Row],[Integridad]]+Tabla2[[#This Row],[Confidencialidad ]]<=4),\"Baja\",IF(AND(Tabla2[[#This Row],[Disponibilidad]]+Tabla2[[#This Row],[Integridad]]+Tabla2[[#This Row],[Confidencialidad ]]>=5,Tabla2[[#This Row],[Disponibilidad]]+Tabla2[[#This Row],[Integridad]]+Tabla2[[#This Row],[Confidencialidad ]]<=7),\"Media\",IF(Tabla2[[#This Row],[Disponibilidad]]+Tabla2[[#This Row],[Integridad]]+Tabla2[[#This Row],[Confidencialidad ]]>=8,\"Alta\",\"error\")))","v":"Baja"}]
["",null,null,null,null,null,null,null,null,null,null,null,null,null,null,null,null,null,null,null,null,null,null,null,null,{"$f":"IF((Tabla2[[#This Row],[Disponibilidad]]+Tabla2[[#This Row],[Integridad]]+Tabla2[[#This Row],[Confidencialidad ]]<=4),\"Baja\",IF(AND(Tabla2[[#This Row],[Disponibilidad]]+Tabla2[[#This Row],[Integridad]]+Tabla2[[#This Row],[Confidencialidad ]]>=5,Tabla2[[#This Row],[Disponibilidad]]+Tabla2[[#This Row],[Integridad]]+Tabla2[[#This Row],[Confidencialidad ]]<=7),\"Media\",IF(Tabla2[[#This Row],[Disponibilidad]]+Tabla2[[#This Row],[Integridad]]+Tabla2[[#This Row],[Confidencialidad ]]>=8,\"Alta\",\"error\")))","v":"Baja"}]
["",null,null,null,null,null,null,null,null,null,null,null,null,null,null,null,null,null,null,null,null,null,null,null,null,{"$f":"IF((Tabla2[[#This Row],[Disponibilidad]]+Tabla2[[#This Row],[Integridad]]+Tabla2[[#This Row],[Confidencialidad ]]<=4),\"Baja\",IF(AND(Tabla2[[#This Row],[Disponibilidad]]+Tabla2[[#This Row],[Integridad]]+Tabla2[[#This Row],[Confidencialidad ]]>=5,Tabla2[[#This Row],[Disponibilidad]]+Tabla2[[#This Row],[Integridad]]+Tabla2[[#This Row],[Confidencialidad ]]<=7),\"Media\",IF(Tabla2[[#This Row],[Disponibilidad]]+Tabla2[[#This Row],[Integridad]]+Tabla2[[#This Row],[Confidencialidad ]]>=8,\"Alta\",\"error\")))","v":"Baja"}]
["",null,null,null,null,null,null,null,null,null,null,null,null,null,null,null,null,null,null,null,null,null,null,null,null,{"$f":"IF((Tabla2[[#This Row],[Disponibilidad]]+Tabla2[[#This Row],[Integridad]]+Tabla2[[#This Row],[Confidencialidad ]]<=4),\"Baja\",IF(AND(Tabla2[[#This Row],[Disponibilidad]]+Tabla2[[#This Row],[Integridad]]+Tabla2[[#This Row],[Confidencialidad ]]>=5,Tabla2[[#This Row],[Disponibilidad]]+Tabla2[[#This Row],[Integridad]]+Tabla2[[#This Row],[Confidencialidad ]]<=7),\"Media\",IF(Tabla2[[#This Row],[Disponibilidad]]+Tabla2[[#This Row],[Integridad]]+Tabla2[[#This Row],[Confidencialidad ]]>=8,\"Alta\",\"error\")))","v":"Baja"}]
["",null,null,null,null,null,null,null,null,null,null,null,null,null,null,null,null,null,null,null,null,null,null,null,null,{"$f":"IF((Tabla2[[#This Row],[Disponibilidad]]+Tabla2[[#This Row],[Integridad]]+Tabla2[[#This Row],[Confidencialidad ]]<=4),\"Baja\",IF(AND(Tabla2[[#This Row],[Disponibilidad]]+Tabla2[[#This Row],[Integridad]]+Tabla2[[#This Row],[Confidencialidad ]]>=5,Tabla2[[#This Row],[Disponibilidad]]+Tabla2[[#This Row],[Integridad]]+Tabla2[[#This Row],[Confidencialidad ]]<=7),\"Media\",IF(Tabla2[[#This Row],[Disponibilidad]]+Tabla2[[#This Row],[Integridad]]+Tabla2[[#This Row],[Confidencialidad ]]>=8,\"Alta\",\"error\")))","v":"Baja"}]
["",null,null,null,null,null,null,null,null,null,null,null,null,null,null,null,null,null,null,null,null,null,null,null,null,{"$f":"IF((Tabla2[[#This Row],[Disponibilidad]]+Tabla2[[#This Row],[Integridad]]+Tabla2[[#This Row],[Confidencialidad ]]<=4),\"Baja\",IF(AND(Tabla2[[#This Row],[Disponibilidad]]+Tabla2[[#This Row],[Integridad]]+Tabla2[[#This Row],[Confidencialidad ]]>=5,Tabla2[[#This Row],[Disponibilidad]]+Tabla2[[#This Row],[Integridad]]+Tabla2[[#This Row],[Confidencialidad ]]<=7),\"Media\",IF(Tabla2[[#This Row],[Disponibilidad]]+Tabla2[[#This Row],[Integridad]]+Tabla2[[#This Row],[Confidencialidad ]]>=8,\"Alta\",\"error\")))","v":"Baja"}]
["",null,null,null,null,null,null,null,null,null,null,null,null,null,null,null,null,null,null,null,null,null,null,null,null,{"$f":"IF((Tabla2[[#This Row],[Disponibilidad]]+Tabla2[[#This Row],[Integridad]]+Tabla2[[#This Row],[Confidencialidad ]]<=4),\"Baja\",IF(AND(Tabla2[[#This Row],[Disponibilidad]]+Tabla2[[#This Row],[Integridad]]+Tabla2[[#This Row],[Confidencialidad ]]>=5,Tabla2[[#This Row],[Disponibilidad]]+Tabla2[[#This Row],[Integridad]]+Tabla2[[#This Row],[Confidencialidad ]]<=7),\"Media\",IF(Tabla2[[#This Row],[Disponibilidad]]+Tabla2[[#This Row],[Integridad]]+Tabla2[[#This Row],[Confidencialidad ]]>=8,\"Alta\",\"error\")))","v":"Baja"}]
["",null,null,null,null,null,null,null,null,null,null,null,null,null,null,null,null,null,null,null,null,null,null,null,null,{"$f":"IF((Tabla2[[#This Row],[Disponibilidad]]+Tabla2[[#This Row],[Integridad]]+Tabla2[[#This Row],[Confidencialidad ]]<=4),\"Baja\",IF(AND(Tabla2[[#This Row],[Disponibilidad]]+Tabla2[[#This Row],[Integridad]]+Tabla2[[#This Row],[Confidencialidad ]]>=5,Tabla2[[#This Row],[Disponibilidad]]+Tabla2[[#This Row],[Integridad]]+Tabla2[[#This Row],[Confidencialidad ]]<=7),\"Media\",IF(Tabla2[[#This Row],[Disponibilidad]]+Tabla2[[#This Row],[Integridad]]+Tabla2[[#This Row],[Confidencialidad ]]>=8,\"Alta\",\"error\")))","v":"Baja"}]
["",null,null,null,null,null,null,null,null,null,null,null,null,null,null,null,null,null,null,null,null,null,null,null,null,{"$f":"IF((Tabla2[[#This Row],[Disponibilidad]]+Tabla2[[#This Row],[Integridad]]+Tabla2[[#This Row],[Confidencialidad ]]<=4),\"Baja\",IF(AND(Tabla2[[#This Row],[Disponibilidad]]+Tabla2[[#This Row],[Integridad]]+Tabla2[[#This Row],[Confidencialidad ]]>=5,Tabla2[[#This Row],[Disponibilidad]]+Tabla2[[#This Row],[Integridad]]+Tabla2[[#This Row],[Confidencialidad ]]<=7),\"Media\",IF(Tabla2[[#This Row],[Disponibilidad]]+Tabla2[[#This Row],[Integridad]]+Tabla2[[#This Row],[Confidencialidad ]]>=8,\"Alta\",\"error\")))","v":"Baja"}]
["",null,null,null,null,null,null,null,null,null,null,null,null,null,null,null,null,null,null,null,null,null,null,null,null,{"$f":"IF((Tabla2[[#This Row],[Disponibilidad]]+Tabla2[[#This Row],[Integridad]]+Tabla2[[#This Row],[Confidencialidad ]]<=4),\"Baja\",IF(AND(Tabla2[[#This Row],[Disponibilidad]]+Tabla2[[#This Row],[Integridad]]+Tabla2[[#This Row],[Confidencialidad ]]>=5,Tabla2[[#This Row],[Disponibilidad]]+Tabla2[[#This Row],[Integridad]]+Tabla2[[#This Row],[Confidencialidad ]]<=7),\"Media\",IF(Tabla2[[#This Row],[Disponibilidad]]+Tabla2[[#This Row],[Integridad]]+Tabla2[[#This Row],[Confidencialidad ]]>=8,\"Alta\",\"error\")))","v":"Baja"}]
["",null,null,null,null,null,null,null,null,null,null,null,null,null,null,null,null,null,null,null,null,null,null,null,null,{"$f":"IF((Tabla2[[#This Row],[Disponibilidad]]+Tabla2[[#This Row],[Integridad]]+Tabla2[[#This Row],[Confidencialidad ]]<=4),\"Baja\",IF(AND(Tabla2[[#This Row],[Disponibilidad]]+Tabla2[[#This Row],[Integridad]]+Tabla2[[#This Row],[Confidencialidad ]]>=5,Tabla2[[#This Row],[Disponibilidad]]+Tabla2[[#This Row],[Integridad]]+Tabla2[[#This Row],[Confidencialidad ]]<=7),\"Media\",IF(Tabla2[[#This Row],[Disponibilidad]]+Tabla2[[#This Row],[Integridad]]+Tabla2[[#This Row],[Confidencialidad ]]>=8,\"Alta\",\"error\")))","v":"Baja"}]
["",null,null,null,null,null,null,null,null,null,null,null,null,null,null,null,null,null,null,null,null,null,null,null,null,{"$f":"IF((Tabla2[[#This Row],[Disponibilidad]]+Tabla2[[#This Row],[Integridad]]+Tabla2[[#This Row],[Confidencialidad ]]<=4),\"Baja\",IF(AND(Tabla2[[#This Row],[Disponibilidad]]+Tabla2[[#This Row],[Integridad]]+Tabla2[[#This Row],[Confidencialidad ]]>=5,Tabla2[[#This Row],[Disponibilidad]]+Tabla2[[#This Row],[Integridad]]+Tabla2[[#This Row],[Confidencialidad ]]<=7),\"Media\",IF(Tabla2[[#This Row],[Disponibilidad]]+Tabla2[[#This Row],[Integridad]]+Tabla2[[#This Row],[Confidencialidad ]]>=8,\"Alta\",\"error\")))","v":"Baja"}]
["",null,null,null,null,null,null,null,null,null,null,null,null,null,null,null,null,null,null,null,null,null,null,null,null,{"$f":"IF((Tabla2[[#This Row],[Disponibilidad]]+Tabla2[[#This Row],[Integridad]]+Tabla2[[#This Row],[Confidencialidad ]]<=4),\"Baja\",IF(AND(Tabla2[[#This Row],[Disponibilidad]]+Tabla2[[#This Row],[Integridad]]+Tabla2[[#This Row],[Confidencialidad ]]>=5,Tabla2[[#This Row],[Disponibilidad]]+Tabla2[[#This Row],[Integridad]]+Tabla2[[#This Row],[Confidencialidad ]]<=7),\"Media\",IF(Tabla2[[#This Row],[Disponibilidad]]+Tabla2[[#This Row],[Integridad]]+Tabla2[[#This Row],[Confidencialidad ]]>=8,\"Alta\",\"error\")))","v":"Baja"}]
["",null,null,null,null,null,null,null,null,null,null,null,null,null,null,null,null,null,null,null,null,null,null,null,null,{"$f":"IF((Tabla2[[#This Row],[Disponibilidad]]+Tabla2[[#This Row],[Integridad]]+Tabla2[[#This Row],[Confidencialidad ]]<=4),\"Baja\",IF(AND(Tabla2[[#This Row],[Disponibilidad]]+Tabla2[[#This Row],[Integridad]]+Tabla2[[#This Row],[Confidencialidad ]]>=5,Tabla2[[#This Row],[Disponibilidad]]+Tabla2[[#This Row],[Integridad]]+Tabla2[[#This Row],[Confidencialidad ]]<=7),\"Media\",IF(Tabla2[[#This Row],[Disponibilidad]]+Tabla2[[#This Row],[Integridad]]+Tabla2[[#This Row],[Confidencialidad ]]>=8,\"Alta\",\"error\")))","v":"Baja"}]
["",null,null,null,null,null,null,null,null,null,null,null,null,null,null,null,null,null,null,null,null,null,null,null,null,{"$f":"IF((Tabla2[[#This Row],[Disponibilidad]]+Tabla2[[#This Row],[Integridad]]+Tabla2[[#This Row],[Confidencialidad ]]<=4),\"Baja\",IF(AND(Tabla2[[#This Row],[Disponibilidad]]+Tabla2[[#This Row],[Integridad]]+Tabla2[[#This Row],[Confidencialidad ]]>=5,Tabla2[[#This Row],[Disponibilidad]]+Tabla2[[#This Row],[Integridad]]+Tabla2[[#This Row],[Confidencialidad ]]<=7),\"Media\",IF(Tabla2[[#This Row],[Disponibilidad]]+Tabla2[[#This Row],[Integridad]]+Tabla2[[#This Row],[Confidencialidad ]]>=8,\"Alta\",\"error\")))","v":"Baja"}]
["",null,null,null,null,null,null,null,null,null,null,null,null,null,null,null,null,null,null,null,null,null,null,null,null,{"$f":"IF((Tabla2[[#This Row],[Disponibilidad]]+Tabla2[[#This Row],[Integridad]]+Tabla2[[#This Row],[Confidencialidad ]]<=4),\"Baja\",IF(AND(Tabla2[[#This Row],[Disponibilidad]]+Tabla2[[#This Row],[Integridad]]+Tabla2[[#This Row],[Confidencialidad ]]>=5,Tabla2[[#This Row],[Disponibilidad]]+Tabla2[[#This Row],[Integridad]]+Tabla2[[#This Row],[Confidencialidad ]]<=7),\"Media\",IF(Tabla2[[#This Row],[Disponibilidad]]+Tabla2[[#This Row],[Integridad]]+Tabla2[[#This Row],[Confidencialidad ]]>=8,\"Alta\",\"error\")))","v":"Baja"}]
["",null,null,null,null,null,null,null,null,null,null,null,null,null,null,null,null,null,null,null,null,null,null,null,null,{"$f":"IF((Tabla2[[#This Row],[Disponibilidad]]+Tabla2[[#This Row],[Integridad]]+Tabla2[[#This Row],[Confidencialidad ]]<=4),\"Baja\",IF(AND(Tabla2[[#This Row],[Disponibilidad]]+Tabla2[[#This Row],[Integridad]]+Tabla2[[#This Row],[Confidencialidad ]]>=5,Tabla2[[#This Row],[Disponibilidad]]+Tabla2[[#This Row],[Integridad]]+Tabla2[[#This Row],[Confidencialidad ]]<=7),\"Media\",IF(Tabla2[[#This Row],[Disponibilidad]]+Tabla2[[#This Row],[Integridad]]+Tabla2[[#This Row],[Confidencialidad ]]>=8,\"Alta\",\"error\")))","v":"Baja"}]
[{"$f":"IF(C392<>\"\",1,\"\")","v":""},null,null,null,null,null,null,null,null,null,null,null,null,null,null,null,null,null,null,null,null,null,null,null,null,{"$f":"IF((Tabla2[[#This Row],[Disponibilidad]]+Tabla2[[#This Row],[Integridad]]+Tabla2[[#This Row],[Confidencialidad ]]<=4),\"Baja\",IF(AND(Tabla2[[#This Row],[Disponibilidad]]+Tabla2[[#This Row],[Integridad]]+Tabla2[[#This Row],[Confidencialidad ]]>=5,Tabla2[[#This Row],[Disponibilidad]]+Tabla2[[#This Row],[Integridad]]+Tabla2[[#This Row],[Confidencialidad ]]<=7),\"Media\",IF(Tabla2[[#This Row],[Disponibilidad]]+Tabla2[[#This Row],[Integridad]]+Tabla2[[#This Row],[Confidencialidad ]]>=8,\"Alta\",\"error\")))","v":"Baja"}]
["",null,null,null,null,null,null,null,null,null,null,null,null,null,null,null,null,null,null,null,null,null,null,null,null,{"$f":"IF((Tabla2[[#This Row],[Disponibilidad]]+Tabla2[[#This Row],[Integridad]]+Tabla2[[#This Row],[Confidencialidad ]]<=4),\"Baja\",IF(AND(Tabla2[[#This Row],[Disponibilidad]]+Tabla2[[#This Row],[Integridad]]+Tabla2[[#This Row],[Confidencialidad ]]>=5,Tabla2[[#This Row],[Disponibilidad]]+Tabla2[[#This Row],[Integridad]]+Tabla2[[#This Row],[Confidencialidad ]]<=7),\"Media\",IF(Tabla2[[#This Row],[Disponibilidad]]+Tabla2[[#This Row],[Integridad]]+Tabla2[[#This Row],[Confidencialidad ]]>=8,\"Alta\",\"error\")))","v":"Baja"}]
["",null,null,null,null,null,null,null,null,null,null,null,null,null,null,null,null,null,null,null,null,null,null,null,null,{"$f":"IF((Tabla2[[#This Row],[Disponibilidad]]+Tabla2[[#This Row],[Integridad]]+Tabla2[[#This Row],[Confidencialidad ]]<=4),\"Baja\",IF(AND(Tabla2[[#This Row],[Disponibilidad]]+Tabla2[[#This Row],[Integridad]]+Tabla2[[#This Row],[Confidencialidad ]]>=5,Tabla2[[#This Row],[Disponibilidad]]+Tabla2[[#This Row],[Integridad]]+Tabla2[[#This Row],[Confidencialidad ]]<=7),\"Media\",IF(Tabla2[[#This Row],[Disponibilidad]]+Tabla2[[#This Row],[Integridad]]+Tabla2[[#This Row],[Confidencialidad ]]>=8,\"Alta\",\"error\")))","v":"Baja"}]
["",null,null,null,null,null,null,null,null,null,null,null,null,null,null,null,null,null,null,null,null,null,null,null,null,{"$f":"IF((Tabla2[[#This Row],[Disponibilidad]]+Tabla2[[#This Row],[Integridad]]+Tabla2[[#This Row],[Confidencialidad ]]<=4),\"Baja\",IF(AND(Tabla2[[#This Row],[Disponibilidad]]+Tabla2[[#This Row],[Integridad]]+Tabla2[[#This Row],[Confidencialidad ]]>=5,Tabla2[[#This Row],[Disponibilidad]]+Tabla2[[#This Row],[Integridad]]+Tabla2[[#This Row],[Confidencialidad ]]<=7),\"Media\",IF(Tabla2[[#This Row],[Disponibilidad]]+Tabla2[[#This Row],[Integridad]]+Tabla2[[#This Row],[Confidencialidad ]]>=8,\"Alta\",\"error\")))","v":"Baja"}]
["",null,null,null,null,null,null,null,null,null,null,null,null,null,null,null,null,null,null,null,null,null,null,null,null,{"$f":"IF((Tabla2[[#This Row],[Disponibilidad]]+Tabla2[[#This Row],[Integridad]]+Tabla2[[#This Row],[Confidencialidad ]]<=4),\"Baja\",IF(AND(Tabla2[[#This Row],[Disponibilidad]]+Tabla2[[#This Row],[Integridad]]+Tabla2[[#This Row],[Confidencialidad ]]>=5,Tabla2[[#This Row],[Disponibilidad]]+Tabla2[[#This Row],[Integridad]]+Tabla2[[#This Row],[Confidencialidad ]]<=7),\"Media\",IF(Tabla2[[#This Row],[Disponibilidad]]+Tabla2[[#This Row],[Integridad]]+Tabla2[[#This Row],[Confidencialidad ]]>=8,\"Alta\",\"error\")))","v":"Baja"}]
["",null,null,null,null,null,null,null,null,null,null,null,null,null,null,null,null,null,null,null,null,null,null,null,null,{"$f":"IF((Tabla2[[#This Row],[Disponibilidad]]+Tabla2[[#This Row],[Integridad]]+Tabla2[[#This Row],[Confidencialidad ]]<=4),\"Baja\",IF(AND(Tabla2[[#This Row],[Disponibilidad]]+Tabla2[[#This Row],[Integridad]]+Tabla2[[#This Row],[Confidencialidad ]]>=5,Tabla2[[#This Row],[Disponibilidad]]+Tabla2[[#This Row],[Integridad]]+Tabla2[[#This Row],[Confidencialidad ]]<=7),\"Media\",IF(Tabla2[[#This Row],[Disponibilidad]]+Tabla2[[#This Row],[Integridad]]+Tabla2[[#This Row],[Confidencialidad ]]>=8,\"Alta\",\"error\")))","v":"Baja"}]
["",null,null,null,null,null,null,null,null,null,null,null,null,null,null,null,null,null,null,null,null,null,null,null,null,{"$f":"IF((Tabla2[[#This Row],[Disponibilidad]]+Tabla2[[#This Row],[Integridad]]+Tabla2[[#This Row],[Confidencialidad ]]<=4),\"Baja\",IF(AND(Tabla2[[#This Row],[Disponibilidad]]+Tabla2[[#This Row],[Integridad]]+Tabla2[[#This Row],[Confidencialidad ]]>=5,Tabla2[[#This Row],[Disponibilidad]]+Tabla2[[#This Row],[Integridad]]+Tabla2[[#This Row],[Confidencialidad ]]<=7),\"Media\",IF(Tabla2[[#This Row],[Disponibilidad]]+Tabla2[[#This Row],[Integridad]]+Tabla2[[#This Row],[Confidencialidad ]]>=8,\"Alta\",\"error\")))","v":"Baja"}]
["",null,null,null,null,null,null,null,null,null,null,null,null,null,null,null,null,null,null,null,null,null,null,null,null,{"$f":"IF((Tabla2[[#This Row],[Disponibilidad]]+Tabla2[[#This Row],[Integridad]]+Tabla2[[#This Row],[Confidencialidad ]]<=4),\"Baja\",IF(AND(Tabla2[[#This Row],[Disponibilidad]]+Tabla2[[#This Row],[Integridad]]+Tabla2[[#This Row],[Confidencialidad ]]>=5,Tabla2[[#This Row],[Disponibilidad]]+Tabla2[[#This Row],[Integridad]]+Tabla2[[#This Row],[Confidencialidad ]]<=7),\"Media\",IF(Tabla2[[#This Row],[Disponibilidad]]+Tabla2[[#This Row],[Integridad]]+Tabla2[[#This Row],[Confidencialidad ]]>=8,\"Alta\",\"error\")))","v":"Baja"}]
["",null,null,null,null,null,null,null,null,null,null,null,null,null,null,null,null,null,null,null,null,null,null,null,null,{"$f":"IF((Tabla2[[#This Row],[Disponibilidad]]+Tabla2[[#This Row],[Integridad]]+Tabla2[[#This Row],[Confidencialidad ]]<=4),\"Baja\",IF(AND(Tabla2[[#This Row],[Disponibilidad]]+Tabla2[[#This Row],[Integridad]]+Tabla2[[#This Row],[Confidencialidad ]]>=5,Tabla2[[#This Row],[Disponibilidad]]+Tabla2[[#This Row],[Integridad]]+Tabla2[[#This Row],[Confidencialidad ]]<=7),\"Media\",IF(Tabla2[[#This Row],[Disponibilidad]]+Tabla2[[#This Row],[Integridad]]+Tabla2[[#This Row],[Confidencialidad ]]>=8,\"Alta\",\"error\")))","v":"Baja"}]
["",null,null,null,null,null,null,null,null,null,null,null,null,null,null,null,null,null,null,null,null,null,null,null,null,{"$f":"IF((Tabla2[[#This Row],[Disponibilidad]]+Tabla2[[#This Row],[Integridad]]+Tabla2[[#This Row],[Confidencialidad ]]<=4),\"Baja\",IF(AND(Tabla2[[#This Row],[Disponibilidad]]+Tabla2[[#This Row],[Integridad]]+Tabla2[[#This Row],[Confidencialidad ]]>=5,Tabla2[[#This Row],[Disponibilidad]]+Tabla2[[#This Row],[Integridad]]+Tabla2[[#This Row],[Confidencialidad ]]<=7),\"Media\",IF(Tabla2[[#This Row],[Disponibilidad]]+Tabla2[[#This Row],[Integridad]]+Tabla2[[#This Row],[Confidencialidad ]]>=8,\"Alta\",\"error\")))","v":"Baja"}]
["",null,null,null,null,null,null,null,null,null,null,null,null,null,null,null,null,null,null,null,null,null,null,null,null,{"$f":"IF((Tabla2[[#This Row],[Disponibilidad]]+Tabla2[[#This Row],[Integridad]]+Tabla2[[#This Row],[Confidencialidad ]]<=4),\"Baja\",IF(AND(Tabla2[[#This Row],[Disponibilidad]]+Tabla2[[#This Row],[Integridad]]+Tabla2[[#This Row],[Confidencialidad ]]>=5,Tabla2[[#This Row],[Disponibilidad]]+Tabla2[[#This Row],[Integridad]]+Tabla2[[#This Row],[Confidencialidad ]]<=7),\"Media\",IF(Tabla2[[#This Row],[Disponibilidad]]+Tabla2[[#This Row],[Integridad]]+Tabla2[[#This Row],[Confidencialidad ]]>=8,\"Alta\",\"error\")))","v":"Baja"}]
["",null,null,null,null,null,null,null,null,null,null,null,null,null,null,null,null,null,null,null,null,null,null,null,null,{"$f":"IF((Tabla2[[#This Row],[Disponibilidad]]+Tabla2[[#This Row],[Integridad]]+Tabla2[[#This Row],[Confidencialidad ]]<=4),\"Baja\",IF(AND(Tabla2[[#This Row],[Disponibilidad]]+Tabla2[[#This Row],[Integridad]]+Tabla2[[#This Row],[Confidencialidad ]]>=5,Tabla2[[#This Row],[Disponibilidad]]+Tabla2[[#This Row],[Integridad]]+Tabla2[[#This Row],[Confidencialidad ]]<=7),\"Media\",IF(Tabla2[[#This Row],[Disponibilidad]]+Tabla2[[#This Row],[Integridad]]+Tabla2[[#This Row],[Confidencialidad ]]>=8,\"Alta\",\"error\")))","v":"Baja"}]
["",null,null,null,null,null,null,null,null,null,null,null,null,null,null,null,null,null,null,null,null,null,null,null,null,{"$f":"IF((Tabla2[[#This Row],[Disponibilidad]]+Tabla2[[#This Row],[Integridad]]+Tabla2[[#This Row],[Confidencialidad ]]<=4),\"Baja\",IF(AND(Tabla2[[#This Row],[Disponibilidad]]+Tabla2[[#This Row],[Integridad]]+Tabla2[[#This Row],[Confidencialidad ]]>=5,Tabla2[[#This Row],[Disponibilidad]]+Tabla2[[#This Row],[Integridad]]+Tabla2[[#This Row],[Confidencialidad ]]<=7),\"Media\",IF(Tabla2[[#This Row],[Disponibilidad]]+Tabla2[[#This Row],[Integridad]]+Tabla2[[#This Row],[Confidencialidad ]]>=8,\"Alta\",\"error\")))","v":"Baja"}]
["",null,null,null,null,null,null,null,null,null,null,null,null,null,null,null,null,null,null,null,null,null,null,null,null,{"$f":"IF((Tabla2[[#This Row],[Disponibilidad]]+Tabla2[[#This Row],[Integridad]]+Tabla2[[#This Row],[Confidencialidad ]]<=4),\"Baja\",IF(AND(Tabla2[[#This Row],[Disponibilidad]]+Tabla2[[#This Row],[Integridad]]+Tabla2[[#This Row],[Confidencialidad ]]>=5,Tabla2[[#This Row],[Disponibilidad]]+Tabla2[[#This Row],[Integridad]]+Tabla2[[#This Row],[Confidencialidad ]]<=7),\"Media\",IF(Tabla2[[#This Row],[Disponibilidad]]+Tabla2[[#This Row],[Integridad]]+Tabla2[[#This Row],[Confidencialidad ]]>=8,\"Alta\",\"error\")))","v":"Baja"}]
["",null,null,null,null,null,null,null,null,null,null,null,null,null,null,null,null,null,null,null,null,null,null,null,null,{"$f":"IF((Tabla2[[#This Row],[Disponibilidad]]+Tabla2[[#This Row],[Integridad]]+Tabla2[[#This Row],[Confidencialidad ]]<=4),\"Baja\",IF(AND(Tabla2[[#This Row],[Disponibilidad]]+Tabla2[[#This Row],[Integridad]]+Tabla2[[#This Row],[Confidencialidad ]]>=5,Tabla2[[#This Row],[Disponibilidad]]+Tabla2[[#This Row],[Integridad]]+Tabla2[[#This Row],[Confidencialidad ]]<=7),\"Media\",IF(Tabla2[[#This Row],[Disponibilidad]]+Tabla2[[#This Row],[Integridad]]+Tabla2[[#This Row],[Confidencialidad ]]>=8,\"Alta\",\"error\")))","v":"Baja"}]
["",null,null,null,null,null,null,null,null,null,null,null,null,null,null,null,null,null,null,null,null,null,null,null,null,{"$f":"IF((Tabla2[[#This Row],[Disponibilidad]]+Tabla2[[#This Row],[Integridad]]+Tabla2[[#This Row],[Confidencialidad ]]<=4),\"Baja\",IF(AND(Tabla2[[#This Row],[Disponibilidad]]+Tabla2[[#This Row],[Integridad]]+Tabla2[[#This Row],[Confidencialidad ]]>=5,Tabla2[[#This Row],[Disponibilidad]]+Tabla2[[#This Row],[Integridad]]+Tabla2[[#This Row],[Confidencialidad ]]<=7),\"Media\",IF(Tabla2[[#This Row],[Disponibilidad]]+Tabla2[[#This Row],[Integridad]]+Tabla2[[#This Row],[Confidencialidad ]]>=8,\"Alta\",\"error\")))","v":"Baja"}]
["",null,null,null,null,null,null,null,null,null,null,null,null,null,null,null,null,null,null,null,null,null,null,null,null,{"$f":"IF((Tabla2[[#This Row],[Disponibilidad]]+Tabla2[[#This Row],[Integridad]]+Tabla2[[#This Row],[Confidencialidad ]]<=4),\"Baja\",IF(AND(Tabla2[[#This Row],[Disponibilidad]]+Tabla2[[#This Row],[Integridad]]+Tabla2[[#This Row],[Confidencialidad ]]>=5,Tabla2[[#This Row],[Disponibilidad]]+Tabla2[[#This Row],[Integridad]]+Tabla2[[#This Row],[Confidencialidad ]]<=7),\"Media\",IF(Tabla2[[#This Row],[Disponibilidad]]+Tabla2[[#This Row],[Integridad]]+Tabla2[[#This Row],[Confidencialidad ]]>=8,\"Alta\",\"error\")))","v":"Baja"}]
["",null,null,null,null,null,null,null,null,null,null,null,null,null,null,null,null,null,null,null,null,null,null,null,null,{"$f":"IF((Tabla2[[#This Row],[Disponibilidad]]+Tabla2[[#This Row],[Integridad]]+Tabla2[[#This Row],[Confidencialidad ]]<=4),\"Baja\",IF(AND(Tabla2[[#This Row],[Disponibilidad]]+Tabla2[[#This Row],[Integridad]]+Tabla2[[#This Row],[Confidencialidad ]]>=5,Tabla2[[#This Row],[Disponibilidad]]+Tabla2[[#This Row],[Integridad]]+Tabla2[[#This Row],[Confidencialidad ]]<=7),\"Media\",IF(Tabla2[[#This Row],[Disponibilidad]]+Tabla2[[#This Row],[Integridad]]+Tabla2[[#This Row],[Confidencialidad ]]>=8,\"Alta\",\"error\")))","v":"Baja"}]
["",null,null,null,null,null,null,null,null,null,null,null,null,null,null,null,null,null,null,null,null,null,null,null,null,{"$f":"IF((Tabla2[[#This Row],[Disponibilidad]]+Tabla2[[#This Row],[Integridad]]+Tabla2[[#This Row],[Confidencialidad ]]<=4),\"Baja\",IF(AND(Tabla2[[#This Row],[Disponibilidad]]+Tabla2[[#This Row],[Integridad]]+Tabla2[[#This Row],[Confidencialidad ]]>=5,Tabla2[[#This Row],[Disponibilidad]]+Tabla2[[#This Row],[Integridad]]+Tabla2[[#This Row],[Confidencialidad ]]<=7),\"Media\",IF(Tabla2[[#This Row],[Disponibilidad]]+Tabla2[[#This Row],[Integridad]]+Tabla2[[#This Row],[Confidencialidad ]]>=8,\"Alta\",\"error\")))","v":"Baja"}]
["",null,null,null,null,null,null,null,null,null,null,null,null,null,null,null,null,null,null,null,null,null,null,null,null,{"$f":"IF((Tabla2[[#This Row],[Disponibilidad]]+Tabla2[[#This Row],[Integridad]]+Tabla2[[#This Row],[Confidencialidad ]]<=4),\"Baja\",IF(AND(Tabla2[[#This Row],[Disponibilidad]]+Tabla2[[#This Row],[Integridad]]+Tabla2[[#This Row],[Confidencialidad ]]>=5,Tabla2[[#This Row],[Disponibilidad]]+Tabla2[[#This Row],[Integridad]]+Tabla2[[#This Row],[Confidencialidad ]]<=7),\"Media\",IF(Tabla2[[#This Row],[Disponibilidad]]+Tabla2[[#This Row],[Integridad]]+Tabla2[[#This Row],[Confidencialidad ]]>=8,\"Alta\",\"error\")))","v":"Baja"}]
["",null,null,null,null,null,null,null,null,null,null,null,null,null,null,null,null,null,null,null,null,null,null,null,null,{"$f":"IF((Tabla2[[#This Row],[Disponibilidad]]+Tabla2[[#This Row],[Integridad]]+Tabla2[[#This Row],[Confidencialidad ]]<=4),\"Baja\",IF(AND(Tabla2[[#This Row],[Disponibilidad]]+Tabla2[[#This Row],[Integridad]]+Tabla2[[#This Row],[Confidencialidad ]]>=5,Tabla2[[#This Row],[Disponibilidad]]+Tabla2[[#This Row],[Integridad]]+Tabla2[[#This Row],[Confidencialidad ]]<=7),\"Media\",IF(Tabla2[[#This Row],[Disponibilidad]]+Tabla2[[#This Row],[Integridad]]+Tabla2[[#This Row],[Confidencialidad ]]>=8,\"Alta\",\"error\")))","v":"Baja"}]
["",null,null,null,null,null,null,null,null,null,null,null,null,null,null,null,null,null,null,null,null,null,null,null,null,{"$f":"IF((Tabla2[[#This Row],[Disponibilidad]]+Tabla2[[#This Row],[Integridad]]+Tabla2[[#This Row],[Confidencialidad ]]<=4),\"Baja\",IF(AND(Tabla2[[#This Row],[Disponibilidad]]+Tabla2[[#This Row],[Integridad]]+Tabla2[[#This Row],[Confidencialidad ]]>=5,Tabla2[[#This Row],[Disponibilidad]]+Tabla2[[#This Row],[Integridad]]+Tabla2[[#This Row],[Confidencialidad ]]<=7),\"Media\",IF(Tabla2[[#This Row],[Disponibilidad]]+Tabla2[[#This Row],[Integridad]]+Tabla2[[#This Row],[Confidencialidad ]]>=8,\"Alta\",\"error\")))","v":"Baja"}]
["",null,null,null,null,null,null,null,null,null,null,null,null,null,null,null,null,null,null,null,null,null,null,null,null,{"$f":"IF((Tabla2[[#This Row],[Disponibilidad]]+Tabla2[[#This Row],[Integridad]]+Tabla2[[#This Row],[Confidencialidad ]]<=4),\"Baja\",IF(AND(Tabla2[[#This Row],[Disponibilidad]]+Tabla2[[#This Row],[Integridad]]+Tabla2[[#This Row],[Confidencialidad ]]>=5,Tabla2[[#This Row],[Disponibilidad]]+Tabla2[[#This Row],[Integridad]]+Tabla2[[#This Row],[Confidencialidad ]]<=7),\"Media\",IF(Tabla2[[#This Row],[Disponibilidad]]+Tabla2[[#This Row],[Integridad]]+Tabla2[[#This Row],[Confidencialidad ]]>=8,\"Alta\",\"error\")))","v":"Baja"}]
["",null,null,null,null,null,null,null,null,null,null,null,null,null,null,null,null,null,null,null,null,null,null,null,null,{"$f":"IF((Tabla2[[#This Row],[Disponibilidad]]+Tabla2[[#This Row],[Integridad]]+Tabla2[[#This Row],[Confidencialidad ]]<=4),\"Baja\",IF(AND(Tabla2[[#This Row],[Disponibilidad]]+Tabla2[[#This Row],[Integridad]]+Tabla2[[#This Row],[Confidencialidad ]]>=5,Tabla2[[#This Row],[Disponibilidad]]+Tabla2[[#This Row],[Integridad]]+Tabla2[[#This Row],[Confidencialidad ]]<=7),\"Media\",IF(Tabla2[[#This Row],[Disponibilidad]]+Tabla2[[#This Row],[Integridad]]+Tabla2[[#This Row],[Confidencialidad ]]>=8,\"Alta\",\"error\")))","v":"Baja"}]
["",null,null,null,null,null,null,null,null,null,null,null,null,null,null,null,null,null,null,null,null,null,null,null,null,{"$f":"IF((Tabla2[[#This Row],[Disponibilidad]]+Tabla2[[#This Row],[Integridad]]+Tabla2[[#This Row],[Confidencialidad ]]<=4),\"Baja\",IF(AND(Tabla2[[#This Row],[Disponibilidad]]+Tabla2[[#This Row],[Integridad]]+Tabla2[[#This Row],[Confidencialidad ]]>=5,Tabla2[[#This Row],[Disponibilidad]]+Tabla2[[#This Row],[Integridad]]+Tabla2[[#This Row],[Confidencialidad ]]<=7),\"Media\",IF(Tabla2[[#This Row],[Disponibilidad]]+Tabla2[[#This Row],[Integridad]]+Tabla2[[#This Row],[Confidencialidad ]]>=8,\"Alta\",\"error\")))","v":"Baja"}]
["",null,null,null,null,null,null,null,null,null,null,null,null,null,null,null,null,null,null,null,null,null,null,null,null,{"$f":"IF((Tabla2[[#This Row],[Disponibilidad]]+Tabla2[[#This Row],[Integridad]]+Tabla2[[#This Row],[Confidencialidad ]]<=4),\"Baja\",IF(AND(Tabla2[[#This Row],[Disponibilidad]]+Tabla2[[#This Row],[Integridad]]+Tabla2[[#This Row],[Confidencialidad ]]>=5,Tabla2[[#This Row],[Disponibilidad]]+Tabla2[[#This Row],[Integridad]]+Tabla2[[#This Row],[Confidencialidad ]]<=7),\"Media\",IF(Tabla2[[#This Row],[Disponibilidad]]+Tabla2[[#This Row],[Integridad]]+Tabla2[[#This Row],[Confidencialidad ]]>=8,\"Alta\",\"error\")))","v":"Baja"}]
["",null,null,null,null,null,null,null,null,null,null,null,null,null,null,null,null,null,null,null,null,null,null,null,null,{"$f":"IF((Tabla2[[#This Row],[Disponibilidad]]+Tabla2[[#This Row],[Integridad]]+Tabla2[[#This Row],[Confidencialidad ]]<=4),\"Baja\",IF(AND(Tabla2[[#This Row],[Disponibilidad]]+Tabla2[[#This Row],[Integridad]]+Tabla2[[#This Row],[Confidencialidad ]]>=5,Tabla2[[#This Row],[Disponibilidad]]+Tabla2[[#This Row],[Integridad]]+Tabla2[[#This Row],[Confidencialidad ]]<=7),\"Media\",IF(Tabla2[[#This Row],[Disponibilidad]]+Tabla2[[#This Row],[Integridad]]+Tabla2[[#This Row],[Confidencialidad ]]>=8,\"Alta\",\"error\")))","v":"Baja"}]
["",null,null,null,null,null,null,null,null,null,null,null,null,null,null,null,null,null,null,null,null,null,null,null,null,{"$f":"IF((Tabla2[[#This Row],[Disponibilidad]]+Tabla2[[#This Row],[Integridad]]+Tabla2[[#This Row],[Confidencialidad ]]<=4),\"Baja\",IF(AND(Tabla2[[#This Row],[Disponibilidad]]+Tabla2[[#This Row],[Integridad]]+Tabla2[[#This Row],[Confidencialidad ]]>=5,Tabla2[[#This Row],[Disponibilidad]]+Tabla2[[#This Row],[Integridad]]+Tabla2[[#This Row],[Confidencialidad ]]<=7),\"Media\",IF(Tabla2[[#This Row],[Disponibilidad]]+Tabla2[[#This Row],[Integridad]]+Tabla2[[#This Row],[Confidencialidad ]]>=8,\"Alta\",\"error\")))","v":"Baja"}]
["",null,null,null,null,null,null,null,null,null,null,null,null,null,null,null,null,null,null,null,null,null,null,null,null,{"$f":"IF((Tabla2[[#This Row],[Disponibilidad]]+Tabla2[[#This Row],[Integridad]]+Tabla2[[#This Row],[Confidencialidad ]]<=4),\"Baja\",IF(AND(Tabla2[[#This Row],[Disponibilidad]]+Tabla2[[#This Row],[Integridad]]+Tabla2[[#This Row],[Confidencialidad ]]>=5,Tabla2[[#This Row],[Disponibilidad]]+Tabla2[[#This Row],[Integridad]]+Tabla2[[#This Row],[Confidencialidad ]]<=7),\"Media\",IF(Tabla2[[#This Row],[Disponibilidad]]+Tabla2[[#This Row],[Integridad]]+Tabla2[[#This Row],[Confidencialidad ]]>=8,\"Alta\",\"error\")))","v":"Baja"}]
["",null,null,null,null,null,null,null,null,null,null,null,null,null,null,null,null,null,null,null,null,null,null,null,null,{"$f":"IF((Tabla2[[#This Row],[Disponibilidad]]+Tabla2[[#This Row],[Integridad]]+Tabla2[[#This Row],[Confidencialidad ]]<=4),\"Baja\",IF(AND(Tabla2[[#This Row],[Disponibilidad]]+Tabla2[[#This Row],[Integridad]]+Tabla2[[#This Row],[Confidencialidad ]]>=5,Tabla2[[#This Row],[Disponibilidad]]+Tabla2[[#This Row],[Integridad]]+Tabla2[[#This Row],[Confidencialidad ]]<=7),\"Media\",IF(Tabla2[[#This Row],[Disponibilidad]]+Tabla2[[#This Row],[Integridad]]+Tabla2[[#This Row],[Confidencialidad ]]>=8,\"Alta\",\"error\")))","v":"Baja"}]
["",null,null,null,null,null,null,null,null,null,null,null,null,null,null,null,null,null,null,null,null,null,null,null,null,{"$f":"IF((Tabla2[[#This Row],[Disponibilidad]]+Tabla2[[#This Row],[Integridad]]+Tabla2[[#This Row],[Confidencialidad ]]<=4),\"Baja\",IF(AND(Tabla2[[#This Row],[Disponibilidad]]+Tabla2[[#This Row],[Integridad]]+Tabla2[[#This Row],[Confidencialidad ]]>=5,Tabla2[[#This Row],[Disponibilidad]]+Tabla2[[#This Row],[Integridad]]+Tabla2[[#This Row],[Confidencialidad ]]<=7),\"Media\",IF(Tabla2[[#This Row],[Disponibilidad]]+Tabla2[[#This Row],[Integridad]]+Tabla2[[#This Row],[Confidencialidad ]]>=8,\"Alta\",\"error\")))","v":"Baja"}]
["",null,null,null,null,null,null,null,null,null,null,null,null,null,null,null,null,null,null,null,null,null,null,null,null,{"$f":"IF((Tabla2[[#This Row],[Disponibilidad]]+Tabla2[[#This Row],[Integridad]]+Tabla2[[#This Row],[Confidencialidad ]]<=4),\"Baja\",IF(AND(Tabla2[[#This Row],[Disponibilidad]]+Tabla2[[#This Row],[Integridad]]+Tabla2[[#This Row],[Confidencialidad ]]>=5,Tabla2[[#This Row],[Disponibilidad]]+Tabla2[[#This Row],[Integridad]]+Tabla2[[#This Row],[Confidencialidad ]]<=7),\"Media\",IF(Tabla2[[#This Row],[Disponibilidad]]+Tabla2[[#This Row],[Integridad]]+Tabla2[[#This Row],[Confidencialidad ]]>=8,\"Alta\",\"error\")))","v":"Baja"}]
["",null,null,null,null,null,null,null,null,null,null,null,null,null,null,null,null,null,null,null,null,null,null,null,null,{"$f":"IF((Tabla2[[#This Row],[Disponibilidad]]+Tabla2[[#This Row],[Integridad]]+Tabla2[[#This Row],[Confidencialidad ]]<=4),\"Baja\",IF(AND(Tabla2[[#This Row],[Disponibilidad]]+Tabla2[[#This Row],[Integridad]]+Tabla2[[#This Row],[Confidencialidad ]]>=5,Tabla2[[#This Row],[Disponibilidad]]+Tabla2[[#This Row],[Integridad]]+Tabla2[[#This Row],[Confidencialidad ]]<=7),\"Media\",IF(Tabla2[[#This Row],[Disponibilidad]]+Tabla2[[#This Row],[Integridad]]+Tabla2[[#This Row],[Confidencialidad ]]>=8,\"Alta\",\"error\")))","v":"Baja"}]
["",null,null,null,null,null,null,null,null,null,null,null,null,null,null,null,null,null,null,null,null,null,null,null,null,{"$f":"IF((Tabla2[[#This Row],[Disponibilidad]]+Tabla2[[#This Row],[Integridad]]+Tabla2[[#This Row],[Confidencialidad ]]<=4),\"Baja\",IF(AND(Tabla2[[#This Row],[Disponibilidad]]+Tabla2[[#This Row],[Integridad]]+Tabla2[[#This Row],[Confidencialidad ]]>=5,Tabla2[[#This Row],[Disponibilidad]]+Tabla2[[#This Row],[Integridad]]+Tabla2[[#This Row],[Confidencialidad ]]<=7),\"Media\",IF(Tabla2[[#This Row],[Disponibilidad]]+Tabla2[[#This Row],[Integridad]]+Tabla2[[#This Row],[Confidencialidad ]]>=8,\"Alta\",\"error\")))","v":"Baja"}]
["",null,null,null,null,null,null,null,null,null,null,null,null,null,null,null,null,null,null,null,null,null,null,null,null,{"$f":"IF((Tabla2[[#This Row],[Disponibilidad]]+Tabla2[[#This Row],[Integridad]]+Tabla2[[#This Row],[Confidencialidad ]]<=4),\"Baja\",IF(AND(Tabla2[[#This Row],[Disponibilidad]]+Tabla2[[#This Row],[Integridad]]+Tabla2[[#This Row],[Confidencialidad ]]>=5,Tabla2[[#This Row],[Disponibilidad]]+Tabla2[[#This Row],[Integridad]]+Tabla2[[#This Row],[Confidencialidad ]]<=7),\"Media\",IF(Tabla2[[#This Row],[Disponibilidad]]+Tabla2[[#This Row],[Integridad]]+Tabla2[[#This Row],[Confidencialidad ]]>=8,\"Alta\",\"error\")))","v":"Baja"}]
["",null,null,null,null,null,null,null,null,null,null,null,null,null,null,null,null,null,null,null,null,null,null,null,null,{"$f":"IF((Tabla2[[#This Row],[Disponibilidad]]+Tabla2[[#This Row],[Integridad]]+Tabla2[[#This Row],[Confidencialidad ]]<=4),\"Baja\",IF(AND(Tabla2[[#This Row],[Disponibilidad]]+Tabla2[[#This Row],[Integridad]]+Tabla2[[#This Row],[Confidencialidad ]]>=5,Tabla2[[#This Row],[Disponibilidad]]+Tabla2[[#This Row],[Integridad]]+Tabla2[[#This Row],[Confidencialidad ]]<=7),\"Media\",IF(Tabla2[[#This Row],[Disponibilidad]]+Tabla2[[#This Row],[Integridad]]+Tabla2[[#This Row],[Confidencialidad ]]>=8,\"Alta\",\"error\")))","v":"Baja"}]
["",null,null,null,null,null,null,null,null,null,null,null,null,null,null,null,null,null,null,null,null,null,null,null,null,{"$f":"IF((Tabla2[[#This Row],[Disponibilidad]]+Tabla2[[#This Row],[Integridad]]+Tabla2[[#This Row],[Confidencialidad ]]<=4),\"Baja\",IF(AND(Tabla2[[#This Row],[Disponibilidad]]+Tabla2[[#This Row],[Integridad]]+Tabla2[[#This Row],[Confidencialidad ]]>=5,Tabla2[[#This Row],[Disponibilidad]]+Tabla2[[#This Row],[Integridad]]+Tabla2[[#This Row],[Confidencialidad ]]<=7),\"Media\",IF(Tabla2[[#This Row],[Disponibilidad]]+Tabla2[[#This Row],[Integridad]]+Tabla2[[#This Row],[Confidencialidad ]]>=8,\"Alta\",\"error\")))","v":"Baja"}]
["",null,null,null,null,null,null,null,null,null,null,null,null,null,null,null,null,null,null,null,null,null,null,null,null,{"$f":"IF((Tabla2[[#This Row],[Disponibilidad]]+Tabla2[[#This Row],[Integridad]]+Tabla2[[#This Row],[Confidencialidad ]]<=4),\"Baja\",IF(AND(Tabla2[[#This Row],[Disponibilidad]]+Tabla2[[#This Row],[Integridad]]+Tabla2[[#This Row],[Confidencialidad ]]>=5,Tabla2[[#This Row],[Disponibilidad]]+Tabla2[[#This Row],[Integridad]]+Tabla2[[#This Row],[Confidencialidad ]]<=7),\"Media\",IF(Tabla2[[#This Row],[Disponibilidad]]+Tabla2[[#This Row],[Integridad]]+Tabla2[[#This Row],[Confidencialidad ]]>=8,\"Alta\",\"error\")))","v":"Baja"}]
["",null,null,null,null,null,null,null,null,null,null,null,null,null,null,null,null,null,null,null,null,null,null,null,null,{"$f":"IF((Tabla2[[#This Row],[Disponibilidad]]+Tabla2[[#This Row],[Integridad]]+Tabla2[[#This Row],[Confidencialidad ]]<=4),\"Baja\",IF(AND(Tabla2[[#This Row],[Disponibilidad]]+Tabla2[[#This Row],[Integridad]]+Tabla2[[#This Row],[Confidencialidad ]]>=5,Tabla2[[#This Row],[Disponibilidad]]+Tabla2[[#This Row],[Integridad]]+Tabla2[[#This Row],[Confidencialidad ]]<=7),\"Media\",IF(Tabla2[[#This Row],[Disponibilidad]]+Tabla2[[#This Row],[Integridad]]+Tabla2[[#This Row],[Confidencialidad ]]>=8,\"Alta\",\"error\")))","v":"Baja"}]
["",null,null,null,null,null,null,null,null,null,null,null,null,null,null,null,null,null,null,null,null,null,null,null,null,{"$f":"IF((Tabla2[[#This Row],[Disponibilidad]]+Tabla2[[#This Row],[Integridad]]+Tabla2[[#This Row],[Confidencialidad ]]<=4),\"Baja\",IF(AND(Tabla2[[#This Row],[Disponibilidad]]+Tabla2[[#This Row],[Integridad]]+Tabla2[[#This Row],[Confidencialidad ]]>=5,Tabla2[[#This Row],[Disponibilidad]]+Tabla2[[#This Row],[Integridad]]+Tabla2[[#This Row],[Confidencialidad ]]<=7),\"Media\",IF(Tabla2[[#This Row],[Disponibilidad]]+Tabla2[[#This Row],[Integridad]]+Tabla2[[#This Row],[Confidencialidad ]]>=8,\"Alta\",\"error\")))","v":"Baja"}]
["",null,null,null,null,null,null,null,null,null,null,null,null,null,null,null,null,null,null,null,null,null,null,null,null,{"$f":"IF((Tabla2[[#This Row],[Disponibilidad]]+Tabla2[[#This Row],[Integridad]]+Tabla2[[#This Row],[Confidencialidad ]]<=4),\"Baja\",IF(AND(Tabla2[[#This Row],[Disponibilidad]]+Tabla2[[#This Row],[Integridad]]+Tabla2[[#This Row],[Confidencialidad ]]>=5,Tabla2[[#This Row],[Disponibilidad]]+Tabla2[[#This Row],[Integridad]]+Tabla2[[#This Row],[Confidencialidad ]]<=7),\"Media\",IF(Tabla2[[#This Row],[Disponibilidad]]+Tabla2[[#This Row],[Integridad]]+Tabla2[[#This Row],[Confidencialidad ]]>=8,\"Alta\",\"error\")))","v":"Baja"}]
["",null,null,null,null,null,null,null,null,null,null,null,null,null,null,null,null,null,null,null,null,null,null,null,null,{"$f":"IF((Tabla2[[#This Row],[Disponibilidad]]+Tabla2[[#This Row],[Integridad]]+Tabla2[[#This Row],[Confidencialidad ]]<=4),\"Baja\",IF(AND(Tabla2[[#This Row],[Disponibilidad]]+Tabla2[[#This Row],[Integridad]]+Tabla2[[#This Row],[Confidencialidad ]]>=5,Tabla2[[#This Row],[Disponibilidad]]+Tabla2[[#This Row],[Integridad]]+Tabla2[[#This Row],[Confidencialidad ]]<=7),\"Media\",IF(Tabla2[[#This Row],[Disponibilidad]]+Tabla2[[#This Row],[Integridad]]+Tabla2[[#This Row],[Confidencialidad ]]>=8,\"Alta\",\"error\")))","v":"Baja"}]
["",null,null,null,null,null,null,null,null,null,null,null,null,null,null,null,null,null,null,null,null,null,null,null,null,{"$f":"IF((Tabla2[[#This Row],[Disponibilidad]]+Tabla2[[#This Row],[Integridad]]+Tabla2[[#This Row],[Confidencialidad ]]<=4),\"Baja\",IF(AND(Tabla2[[#This Row],[Disponibilidad]]+Tabla2[[#This Row],[Integridad]]+Tabla2[[#This Row],[Confidencialidad ]]>=5,Tabla2[[#This Row],[Disponibilidad]]+Tabla2[[#This Row],[Integridad]]+Tabla2[[#This Row],[Confidencialidad ]]<=7),\"Media\",IF(Tabla2[[#This Row],[Disponibilidad]]+Tabla2[[#This Row],[Integridad]]+Tabla2[[#This Row],[Confidencialidad ]]>=8,\"Alta\",\"error\")))","v":"Baja"}]
["",null,null,null,null,null,null,null,null,null,null,null,null,null,null,null,null,null,null,null,null,null,null,null,null,{"$f":"IF((Tabla2[[#This Row],[Disponibilidad]]+Tabla2[[#This Row],[Integridad]]+Tabla2[[#This Row],[Confidencialidad ]]<=4),\"Baja\",IF(AND(Tabla2[[#This Row],[Disponibilidad]]+Tabla2[[#This Row],[Integridad]]+Tabla2[[#This Row],[Confidencialidad ]]>=5,Tabla2[[#This Row],[Disponibilidad]]+Tabla2[[#This Row],[Integridad]]+Tabla2[[#This Row],[Confidencialidad ]]<=7),\"Media\",IF(Tabla2[[#This Row],[Disponibilidad]]+Tabla2[[#This Row],[Integridad]]+Tabla2[[#This Row],[Confidencialidad ]]>=8,\"Alta\",\"error\")))","v":"Baja"}]
["",null,null,null,null,null,null,null,null,null,null,null,null,null,null,null,null,null,null,null,null,null,null,null,null,{"$f":"IF((Tabla2[[#This Row],[Disponibilidad]]+Tabla2[[#This Row],[Integridad]]+Tabla2[[#This Row],[Confidencialidad ]]<=4),\"Baja\",IF(AND(Tabla2[[#This Row],[Disponibilidad]]+Tabla2[[#This Row],[Integridad]]+Tabla2[[#This Row],[Confidencialidad ]]>=5,Tabla2[[#This Row],[Disponibilidad]]+Tabla2[[#This Row],[Integridad]]+Tabla2[[#This Row],[Confidencialidad ]]<=7),\"Media\",IF(Tabla2[[#This Row],[Disponibilidad]]+Tabla2[[#This Row],[Integridad]]+Tabla2[[#This Row],[Confidencialidad ]]>=8,\"Alta\",\"error\")))","v":"Baja"}]
["",null,null,null,null,null,null,null,null,null,null,null,null,null,null,null,null,null,null,null,null,null,null,null,null,{"$f":"IF((Tabla2[[#This Row],[Disponibilidad]]+Tabla2[[#This Row],[Integridad]]+Tabla2[[#This Row],[Confidencialidad ]]<=4),\"Baja\",IF(AND(Tabla2[[#This Row],[Disponibilidad]]+Tabla2[[#This Row],[Integridad]]+Tabla2[[#This Row],[Confidencialidad ]]>=5,Tabla2[[#This Row],[Disponibilidad]]+Tabla2[[#This Row],[Integridad]]+Tabla2[[#This Row],[Confidencialidad ]]<=7),\"Media\",IF(Tabla2[[#This Row],[Disponibilidad]]+Tabla2[[#This Row],[Integridad]]+Tabla2[[#This Row],[Confidencialidad ]]>=8,\"Alta\",\"error\")))","v":"Baja"}]
["",null,null,null,null,null,null,null,null,null,null,null,null,null,null,null,null,null,null,null,null,null,null,null,null,{"$f":"IF((Tabla2[[#This Row],[Disponibilidad]]+Tabla2[[#This Row],[Integridad]]+Tabla2[[#This Row],[Confidencialidad ]]<=4),\"Baja\",IF(AND(Tabla2[[#This Row],[Disponibilidad]]+Tabla2[[#This Row],[Integridad]]+Tabla2[[#This Row],[Confidencialidad ]]>=5,Tabla2[[#This Row],[Disponibilidad]]+Tabla2[[#This Row],[Integridad]]+Tabla2[[#This Row],[Confidencialidad ]]<=7),\"Media\",IF(Tabla2[[#This Row],[Disponibilidad]]+Tabla2[[#This Row],[Integridad]]+Tabla2[[#This Row],[Confidencialidad ]]>=8,\"Alta\",\"error\")))","v":"Baja"}]
["",null,null,null,null,null,null,null,null,null,null,null,null,null,null,null,null,null,null,null,null,null,null,null,null,{"$f":"IF((Tabla2[[#This Row],[Disponibilidad]]+Tabla2[[#This Row],[Integridad]]+Tabla2[[#This Row],[Confidencialidad ]]<=4),\"Baja\",IF(AND(Tabla2[[#This Row],[Disponibilidad]]+Tabla2[[#This Row],[Integridad]]+Tabla2[[#This Row],[Confidencialidad ]]>=5,Tabla2[[#This Row],[Disponibilidad]]+Tabla2[[#This Row],[Integridad]]+Tabla2[[#This Row],[Confidencialidad ]]<=7),\"Media\",IF(Tabla2[[#This Row],[Disponibilidad]]+Tabla2[[#This Row],[Integridad]]+Tabla2[[#This Row],[Confidencialidad ]]>=8,\"Alta\",\"error\")))","v":"Baja"}]
["",null,null,null,null,null,null,null,null,null,null,null,null,null,null,null,null,null,null,null,null,null,null,null,null,{"$f":"IF((Tabla2[[#This Row],[Disponibilidad]]+Tabla2[[#This Row],[Integridad]]+Tabla2[[#This Row],[Confidencialidad ]]<=4),\"Baja\",IF(AND(Tabla2[[#This Row],[Disponibilidad]]+Tabla2[[#This Row],[Integridad]]+Tabla2[[#This Row],[Confidencialidad ]]>=5,Tabla2[[#This Row],[Disponibilidad]]+Tabla2[[#This Row],[Integridad]]+Tabla2[[#This Row],[Confidencialidad ]]<=7),\"Media\",IF(Tabla2[[#This Row],[Disponibilidad]]+Tabla2[[#This Row],[Integridad]]+Tabla2[[#This Row],[Confidencialidad ]]>=8,\"Alta\",\"error\")))","v":"Baja"}]
["",null,null,null,null,null,null,null,null,null,null,null,null,null,null,null,null,null,null,null,null,null,null,null,null,{"$f":"IF((Tabla2[[#This Row],[Disponibilidad]]+Tabla2[[#This Row],[Integridad]]+Tabla2[[#This Row],[Confidencialidad ]]<=4),\"Baja\",IF(AND(Tabla2[[#This Row],[Disponibilidad]]+Tabla2[[#This Row],[Integridad]]+Tabla2[[#This Row],[Confidencialidad ]]>=5,Tabla2[[#This Row],[Disponibilidad]]+Tabla2[[#This Row],[Integridad]]+Tabla2[[#This Row],[Confidencialidad ]]<=7),\"Media\",IF(Tabla2[[#This Row],[Disponibilidad]]+Tabla2[[#This Row],[Integridad]]+Tabla2[[#This Row],[Confidencialidad ]]>=8,\"Alta\",\"error\")))","v":"Baja"}]
["",null,null,null,null,null,null,null,null,null,null,null,null,null,null,null,null,null,null,null,null,null,null,null,null,{"$f":"IF((Tabla2[[#This Row],[Disponibilidad]]+Tabla2[[#This Row],[Integridad]]+Tabla2[[#This Row],[Confidencialidad ]]<=4),\"Baja\",IF(AND(Tabla2[[#This Row],[Disponibilidad]]+Tabla2[[#This Row],[Integridad]]+Tabla2[[#This Row],[Confidencialidad ]]>=5,Tabla2[[#This Row],[Disponibilidad]]+Tabla2[[#This Row],[Integridad]]+Tabla2[[#This Row],[Confidencialidad ]]<=7),\"Media\",IF(Tabla2[[#This Row],[Disponibilidad]]+Tabla2[[#This Row],[Integridad]]+Tabla2[[#This Row],[Confidencialidad ]]>=8,\"Alta\",\"error\")))","v":"Baja"}]
["",null,null,null,null,null,null,null,null,null,null,null,null,null,null,null,null,null,null,null,null,null,null,null,null,{"$f":"IF((Tabla2[[#This Row],[Disponibilidad]]+Tabla2[[#This Row],[Integridad]]+Tabla2[[#This Row],[Confidencialidad ]]<=4),\"Baja\",IF(AND(Tabla2[[#This Row],[Disponibilidad]]+Tabla2[[#This Row],[Integridad]]+Tabla2[[#This Row],[Confidencialidad ]]>=5,Tabla2[[#This Row],[Disponibilidad]]+Tabla2[[#This Row],[Integridad]]+Tabla2[[#This Row],[Confidencialidad ]]<=7),\"Media\",IF(Tabla2[[#This Row],[Disponibilidad]]+Tabla2[[#This Row],[Integridad]]+Tabla2[[#This Row],[Confidencialidad ]]>=8,\"Alta\",\"error\")))","v":"Baja"}]
["",null,null,null,null,null,null,null,null,null,null,null,null,null,null,null,null,null,null,null,null,null,null,null,null,{"$f":"IF((Tabla2[[#This Row],[Disponibilidad]]+Tabla2[[#This Row],[Integridad]]+Tabla2[[#This Row],[Confidencialidad ]]<=4),\"Baja\",IF(AND(Tabla2[[#This Row],[Disponibilidad]]+Tabla2[[#This Row],[Integridad]]+Tabla2[[#This Row],[Confidencialidad ]]>=5,Tabla2[[#This Row],[Disponibilidad]]+Tabla2[[#This Row],[Integridad]]+Tabla2[[#This Row],[Confidencialidad ]]<=7),\"Media\",IF(Tabla2[[#This Row],[Disponibilidad]]+Tabla2[[#This Row],[Integridad]]+Tabla2[[#This Row],[Confidencialidad ]]>=8,\"Alta\",\"error\")))","v":"Baja"}]
["",null,null,null,null,null,null,null,null,null,null,null,null,null,null,null,null,null,null,null,null,null,null,null,null,{"$f":"IF((Tabla2[[#This Row],[Disponibilidad]]+Tabla2[[#This Row],[Integridad]]+Tabla2[[#This Row],[Confidencialidad ]]<=4),\"Baja\",IF(AND(Tabla2[[#This Row],[Disponibilidad]]+Tabla2[[#This Row],[Integridad]]+Tabla2[[#This Row],[Confidencialidad ]]>=5,Tabla2[[#This Row],[Disponibilidad]]+Tabla2[[#This Row],[Integridad]]+Tabla2[[#This Row],[Confidencialidad ]]<=7),\"Media\",IF(Tabla2[[#This Row],[Disponibilidad]]+Tabla2[[#This Row],[Integridad]]+Tabla2[[#This Row],[Confidencialidad ]]>=8,\"Alta\",\"error\")))","v":"Baja"}]
["",null,null,null,null,null,null,null,null,null,null,null,null,null,null,null,null,null,null,null,null,null,null,null,null,{"$f":"IF((Tabla2[[#This Row],[Disponibilidad]]+Tabla2[[#This Row],[Integridad]]+Tabla2[[#This Row],[Confidencialidad ]]<=4),\"Baja\",IF(AND(Tabla2[[#This Row],[Disponibilidad]]+Tabla2[[#This Row],[Integridad]]+Tabla2[[#This Row],[Confidencialidad ]]>=5,Tabla2[[#This Row],[Disponibilidad]]+Tabla2[[#This Row],[Integridad]]+Tabla2[[#This Row],[Confidencialidad ]]<=7),\"Media\",IF(Tabla2[[#This Row],[Disponibilidad]]+Tabla2[[#This Row],[Integridad]]+Tabla2[[#This Row],[Confidencialidad ]]>=8,\"Alta\",\"error\")))","v":"Baja"}]
["",null,null,null,null,null,null,null,null,null,null,null,null,null,null,null,null,null,null,null,null,null,null,null,null,{"$f":"IF((Tabla2[[#This Row],[Disponibilidad]]+Tabla2[[#This Row],[Integridad]]+Tabla2[[#This Row],[Confidencialidad ]]<=4),\"Baja\",IF(AND(Tabla2[[#This Row],[Disponibilidad]]+Tabla2[[#This Row],[Integridad]]+Tabla2[[#This Row],[Confidencialidad ]]>=5,Tabla2[[#This Row],[Disponibilidad]]+Tabla2[[#This Row],[Integridad]]+Tabla2[[#This Row],[Confidencialidad ]]<=7),\"Media\",IF(Tabla2[[#This Row],[Disponibilidad]]+Tabla2[[#This Row],[Integridad]]+Tabla2[[#This Row],[Confidencialidad ]]>=8,\"Alta\",\"error\")))","v":"Baja"}]
["",null,null,null,null,null,null,null,null,null,null,null,null,null,null,null,null,null,null,null,null,null,null,null,null,{"$f":"IF((Tabla2[[#This Row],[Disponibilidad]]+Tabla2[[#This Row],[Integridad]]+Tabla2[[#This Row],[Confidencialidad ]]<=4),\"Baja\",IF(AND(Tabla2[[#This Row],[Disponibilidad]]+Tabla2[[#This Row],[Integridad]]+Tabla2[[#This Row],[Confidencialidad ]]>=5,Tabla2[[#This Row],[Disponibilidad]]+Tabla2[[#This Row],[Integridad]]+Tabla2[[#This Row],[Confidencialidad ]]<=7),\"Media\",IF(Tabla2[[#This Row],[Disponibilidad]]+Tabla2[[#This Row],[Integridad]]+Tabla2[[#This Row],[Confidencialidad ]]>=8,\"Alta\",\"error\")))","v":"Baja"}]
["",null,null,null,null,null,null,null,null,null,null,null,null,null,null,null,null,null,null,null,null,null,null,null,null,{"$f":"IF((Tabla2[[#This Row],[Disponibilidad]]+Tabla2[[#This Row],[Integridad]]+Tabla2[[#This Row],[Confidencialidad ]]<=4),\"Baja\",IF(AND(Tabla2[[#This Row],[Disponibilidad]]+Tabla2[[#This Row],[Integridad]]+Tabla2[[#This Row],[Confidencialidad ]]>=5,Tabla2[[#This Row],[Disponibilidad]]+Tabla2[[#This Row],[Integridad]]+Tabla2[[#This Row],[Confidencialidad ]]<=7),\"Media\",IF(Tabla2[[#This Row],[Disponibilidad]]+Tabla2[[#This Row],[Integridad]]+Tabla2[[#This Row],[Confidencialidad ]]>=8,\"Alta\",\"error\")))","v":"Baja"}]
["",null,null,null,null,null,null,null,null,null,null,null,null,null,null,null,null,null,null,null,null,null,null,null,null,{"$f":"IF((Tabla2[[#This Row],[Disponibilidad]]+Tabla2[[#This Row],[Integridad]]+Tabla2[[#This Row],[Confidencialidad ]]<=4),\"Baja\",IF(AND(Tabla2[[#This Row],[Disponibilidad]]+Tabla2[[#This Row],[Integridad]]+Tabla2[[#This Row],[Confidencialidad ]]>=5,Tabla2[[#This Row],[Disponibilidad]]+Tabla2[[#This Row],[Integridad]]+Tabla2[[#This Row],[Confidencialidad ]]<=7),\"Media\",IF(Tabla2[[#This Row],[Disponibilidad]]+Tabla2[[#This Row],[Integridad]]+Tabla2[[#This Row],[Confidencialidad ]]>=8,\"Alta\",\"error\")))","v":"Baja"}]
["",null,null,null,null,null,null,null,null,null,null,null,null,null,null,null,null,null,null,null,null,null,null,null,null,{"$f":"IF((Tabla2[[#This Row],[Disponibilidad]]+Tabla2[[#This Row],[Integridad]]+Tabla2[[#This Row],[Confidencialidad ]]<=4),\"Baja\",IF(AND(Tabla2[[#This Row],[Disponibilidad]]+Tabla2[[#This Row],[Integridad]]+Tabla2[[#This Row],[Confidencialidad ]]>=5,Tabla2[[#This Row],[Disponibilidad]]+Tabla2[[#This Row],[Integridad]]+Tabla2[[#This Row],[Confidencialidad ]]<=7),\"Media\",IF(Tabla2[[#This Row],[Disponibilidad]]+Tabla2[[#This Row],[Integridad]]+Tabla2[[#This Row],[Confidencialidad ]]>=8,\"Alta\",\"error\")))","v":"Baja"}]
["",null,null,null,null,null,null,null,null,null,null,null,null,null,null,null,null,null,null,null,null,null,null,null,null,{"$f":"IF((Tabla2[[#This Row],[Disponibilidad]]+Tabla2[[#This Row],[Integridad]]+Tabla2[[#This Row],[Confidencialidad ]]<=4),\"Baja\",IF(AND(Tabla2[[#This Row],[Disponibilidad]]+Tabla2[[#This Row],[Integridad]]+Tabla2[[#This Row],[Confidencialidad ]]>=5,Tabla2[[#This Row],[Disponibilidad]]+Tabla2[[#This Row],[Integridad]]+Tabla2[[#This Row],[Confidencialidad ]]<=7),\"Media\",IF(Tabla2[[#This Row],[Disponibilidad]]+Tabla2[[#This Row],[Integridad]]+Tabla2[[#This Row],[Confidencialidad ]]>=8,\"Alta\",\"error\")))","v":"Baja"}]
["",null,null,null,null,null,null,null,null,null,null,null,null,null,null,null,null,null,null,null,null,null,null,null,null,{"$f":"IF((Tabla2[[#This Row],[Disponibilidad]]+Tabla2[[#This Row],[Integridad]]+Tabla2[[#This Row],[Confidencialidad ]]<=4),\"Baja\",IF(AND(Tabla2[[#This Row],[Disponibilidad]]+Tabla2[[#This Row],[Integridad]]+Tabla2[[#This Row],[Confidencialidad ]]>=5,Tabla2[[#This Row],[Disponibilidad]]+Tabla2[[#This Row],[Integridad]]+Tabla2[[#This Row],[Confidencialidad ]]<=7),\"Media\",IF(Tabla2[[#This Row],[Disponibilidad]]+Tabla2[[#This Row],[Integridad]]+Tabla2[[#This Row],[Confidencialidad ]]>=8,\"Alta\",\"error\")))","v":"Baja"}]
["",null,null,null,null,null,null,null,null,null,null,null,null,null,null,null,null,null,null,null,null,null,null,null,null,{"$f":"IF((Tabla2[[#This Row],[Disponibilidad]]+Tabla2[[#This Row],[Integridad]]+Tabla2[[#This Row],[Confidencialidad ]]<=4),\"Baja\",IF(AND(Tabla2[[#This Row],[Disponibilidad]]+Tabla2[[#This Row],[Integridad]]+Tabla2[[#This Row],[Confidencialidad ]]>=5,Tabla2[[#This Row],[Disponibilidad]]+Tabla2[[#This Row],[Integridad]]+Tabla2[[#This Row],[Confidencialidad ]]<=7),\"Media\",IF(Tabla2[[#This Row],[Disponibilidad]]+Tabla2[[#This Row],[Integridad]]+Tabla2[[#This Row],[Confidencialidad ]]>=8,\"Alta\",\"error\")))","v":"Baja"}]
["",null,null,null,null,null,null,null,null,null,null,null,null,null,null,null,null,null,null,null,null,null,null,null,null,{"$f":"IF((Tabla2[[#This Row],[Disponibilidad]]+Tabla2[[#This Row],[Integridad]]+Tabla2[[#This Row],[Confidencialidad ]]<=4),\"Baja\",IF(AND(Tabla2[[#This Row],[Disponibilidad]]+Tabla2[[#This Row],[Integridad]]+Tabla2[[#This Row],[Confidencialidad ]]>=5,Tabla2[[#This Row],[Disponibilidad]]+Tabla2[[#This Row],[Integridad]]+Tabla2[[#This Row],[Confidencialidad ]]<=7),\"Media\",IF(Tabla2[[#This Row],[Disponibilidad]]+Tabla2[[#This Row],[Integridad]]+Tabla2[[#This Row],[Confidencialidad ]]>=8,\"Alta\",\"error\")))","v":"Baja"}]
[{"$f":"IF(C456<>\"\",1,\"\")","v":""},null,null,null,null,null,null,null,null,null,null,null,null,null,null,null,null,null,null,null,null,null,null,null,null,{"$f":"IF((Tabla2[[#This Row],[Disponibilidad]]+Tabla2[[#This Row],[Integridad]]+Tabla2[[#This Row],[Confidencialidad ]]<=4),\"Baja\",IF(AND(Tabla2[[#This Row],[Disponibilidad]]+Tabla2[[#This Row],[Integridad]]+Tabla2[[#This Row],[Confidencialidad ]]>=5,Tabla2[[#This Row],[Disponibilidad]]+Tabla2[[#This Row],[Integridad]]+Tabla2[[#This Row],[Confidencialidad ]]<=7),\"Media\",IF(Tabla2[[#This Row],[Disponibilidad]]+Tabla2[[#This Row],[Integridad]]+Tabla2[[#This Row],[Confidencialidad ]]>=8,\"Alta\",\"error\")))","v":"Baja"}]
["",null,null,null,null,null,null,null,null,null,null,null,null,null,null,null,null,null,null,null,null,null,null,null,null,{"$f":"IF((Tabla2[[#This Row],[Disponibilidad]]+Tabla2[[#This Row],[Integridad]]+Tabla2[[#This Row],[Confidencialidad ]]<=4),\"Baja\",IF(AND(Tabla2[[#This Row],[Disponibilidad]]+Tabla2[[#This Row],[Integridad]]+Tabla2[[#This Row],[Confidencialidad ]]>=5,Tabla2[[#This Row],[Disponibilidad]]+Tabla2[[#This Row],[Integridad]]+Tabla2[[#This Row],[Confidencialidad ]]<=7),\"Media\",IF(Tabla2[[#This Row],[Disponibilidad]]+Tabla2[[#This Row],[Integridad]]+Tabla2[[#This Row],[Confidencialidad ]]>=8,\"Alta\",\"error\")))","v":"Baja"}]
["",null,null,null,null,null,null,null,null,null,null,null,null,null,null,null,null,null,null,null,null,null,null,null,null,{"$f":"IF((Tabla2[[#This Row],[Disponibilidad]]+Tabla2[[#This Row],[Integridad]]+Tabla2[[#This Row],[Confidencialidad ]]<=4),\"Baja\",IF(AND(Tabla2[[#This Row],[Disponibilidad]]+Tabla2[[#This Row],[Integridad]]+Tabla2[[#This Row],[Confidencialidad ]]>=5,Tabla2[[#This Row],[Disponibilidad]]+Tabla2[[#This Row],[Integridad]]+Tabla2[[#This Row],[Confidencialidad ]]<=7),\"Media\",IF(Tabla2[[#This Row],[Disponibilidad]]+Tabla2[[#This Row],[Integridad]]+Tabla2[[#This Row],[Confidencialidad ]]>=8,\"Alta\",\"error\")))","v":"Baja"}]
["",null,null,null,null,null,null,null,null,null,null,null,null,null,null,null,null,null,null,null,null,null,null,null,null,{"$f":"IF((Tabla2[[#This Row],[Disponibilidad]]+Tabla2[[#This Row],[Integridad]]+Tabla2[[#This Row],[Confidencialidad ]]<=4),\"Baja\",IF(AND(Tabla2[[#This Row],[Disponibilidad]]+Tabla2[[#This Row],[Integridad]]+Tabla2[[#This Row],[Confidencialidad ]]>=5,Tabla2[[#This Row],[Disponibilidad]]+Tabla2[[#This Row],[Integridad]]+Tabla2[[#This Row],[Confidencialidad ]]<=7),\"Media\",IF(Tabla2[[#This Row],[Disponibilidad]]+Tabla2[[#This Row],[Integridad]]+Tabla2[[#This Row],[Confidencialidad ]]>=8,\"Alta\",\"error\")))","v":"Baja"}]
["",null,null,null,null,null,null,null,null,null,null,null,null,null,null,null,null,null,null,null,null,null,null,null,null,{"$f":"IF((Tabla2[[#This Row],[Disponibilidad]]+Tabla2[[#This Row],[Integridad]]+Tabla2[[#This Row],[Confidencialidad ]]<=4),\"Baja\",IF(AND(Tabla2[[#This Row],[Disponibilidad]]+Tabla2[[#This Row],[Integridad]]+Tabla2[[#This Row],[Confidencialidad ]]>=5,Tabla2[[#This Row],[Disponibilidad]]+Tabla2[[#This Row],[Integridad]]+Tabla2[[#This Row],[Confidencialidad ]]<=7),\"Media\",IF(Tabla2[[#This Row],[Disponibilidad]]+Tabla2[[#This Row],[Integridad]]+Tabla2[[#This Row],[Confidencialidad ]]>=8,\"Alta\",\"error\")))","v":"Baja"}]
["",null,null,null,null,null,null,null,null,null,null,null,null,null,null,null,null,null,null,null,null,null,null,null,null,{"$f":"IF((Tabla2[[#This Row],[Disponibilidad]]+Tabla2[[#This Row],[Integridad]]+Tabla2[[#This Row],[Confidencialidad ]]<=4),\"Baja\",IF(AND(Tabla2[[#This Row],[Disponibilidad]]+Tabla2[[#This Row],[Integridad]]+Tabla2[[#This Row],[Confidencialidad ]]>=5,Tabla2[[#This Row],[Disponibilidad]]+Tabla2[[#This Row],[Integridad]]+Tabla2[[#This Row],[Confidencialidad ]]<=7),\"Media\",IF(Tabla2[[#This Row],[Disponibilidad]]+Tabla2[[#This Row],[Integridad]]+Tabla2[[#This Row],[Confidencialidad ]]>=8,\"Alta\",\"error\")))","v":"Baja"}]
["",null,null,null,null,null,null,null,null,null,null,null,null,null,null,null,null,null,null,null,null,null,null,null,null,{"$f":"IF((Tabla2[[#This Row],[Disponibilidad]]+Tabla2[[#This Row],[Integridad]]+Tabla2[[#This Row],[Confidencialidad ]]<=4),\"Baja\",IF(AND(Tabla2[[#This Row],[Disponibilidad]]+Tabla2[[#This Row],[Integridad]]+Tabla2[[#This Row],[Confidencialidad ]]>=5,Tabla2[[#This Row],[Disponibilidad]]+Tabla2[[#This Row],[Integridad]]+Tabla2[[#This Row],[Confidencialidad ]]<=7),\"Media\",IF(Tabla2[[#This Row],[Disponibilidad]]+Tabla2[[#This Row],[Integridad]]+Tabla2[[#This Row],[Confidencialidad ]]>=8,\"Alta\",\"error\")))","v":"Baja"}]
["",null,null,null,null,null,null,null,null,null,null,null,null,null,null,null,null,null,null,null,null,null,null,null,null,{"$f":"IF((Tabla2[[#This Row],[Disponibilidad]]+Tabla2[[#This Row],[Integridad]]+Tabla2[[#This Row],[Confidencialidad ]]<=4),\"Baja\",IF(AND(Tabla2[[#This Row],[Disponibilidad]]+Tabla2[[#This Row],[Integridad]]+Tabla2[[#This Row],[Confidencialidad ]]>=5,Tabla2[[#This Row],[Disponibilidad]]+Tabla2[[#This Row],[Integridad]]+Tabla2[[#This Row],[Confidencialidad ]]<=7),\"Media\",IF(Tabla2[[#This Row],[Disponibilidad]]+Tabla2[[#This Row],[Integridad]]+Tabla2[[#This Row],[Confidencialidad ]]>=8,\"Alta\",\"error\")))","v":"Baja"}]
["",null,null,null,null,null,null,null,null,null,null,null,null,null,null,null,null,null,null,null,null,null,null,null,null,{"$f":"IF((Tabla2[[#This Row],[Disponibilidad]]+Tabla2[[#This Row],[Integridad]]+Tabla2[[#This Row],[Confidencialidad ]]<=4),\"Baja\",IF(AND(Tabla2[[#This Row],[Disponibilidad]]+Tabla2[[#This Row],[Integridad]]+Tabla2[[#This Row],[Confidencialidad ]]>=5,Tabla2[[#This Row],[Disponibilidad]]+Tabla2[[#This Row],[Integridad]]+Tabla2[[#This Row],[Confidencialidad ]]<=7),\"Media\",IF(Tabla2[[#This Row],[Disponibilidad]]+Tabla2[[#This Row],[Integridad]]+Tabla2[[#This Row],[Confidencialidad ]]>=8,\"Alta\",\"error\")))","v":"Baja"}]
["",null,null,null,null,null,null,null,null,null,null,null,null,null,null,null,null,null,null,null,null,null,null,null,null,{"$f":"IF((Tabla2[[#This Row],[Disponibilidad]]+Tabla2[[#This Row],[Integridad]]+Tabla2[[#This Row],[Confidencialidad ]]<=4),\"Baja\",IF(AND(Tabla2[[#This Row],[Disponibilidad]]+Tabla2[[#This Row],[Integridad]]+Tabla2[[#This Row],[Confidencialidad ]]>=5,Tabla2[[#This Row],[Disponibilidad]]+Tabla2[[#This Row],[Integridad]]+Tabla2[[#This Row],[Confidencialidad ]]<=7),\"Media\",IF(Tabla2[[#This Row],[Disponibilidad]]+Tabla2[[#This Row],[Integridad]]+Tabla2[[#This Row],[Confidencialidad ]]>=8,\"Alta\",\"error\")))","v":"Baja"}]
["",null,null,null,null,null,null,null,null,null,null,null,null,null,null,null,null,null,null,null,null,null,null,null,null,{"$f":"IF((Tabla2[[#This Row],[Disponibilidad]]+Tabla2[[#This Row],[Integridad]]+Tabla2[[#This Row],[Confidencialidad ]]<=4),\"Baja\",IF(AND(Tabla2[[#This Row],[Disponibilidad]]+Tabla2[[#This Row],[Integridad]]+Tabla2[[#This Row],[Confidencialidad ]]>=5,Tabla2[[#This Row],[Disponibilidad]]+Tabla2[[#This Row],[Integridad]]+Tabla2[[#This Row],[Confidencialidad ]]<=7),\"Media\",IF(Tabla2[[#This Row],[Disponibilidad]]+Tabla2[[#This Row],[Integridad]]+Tabla2[[#This Row],[Confidencialidad ]]>=8,\"Alta\",\"error\")))","v":"Baja"}]
["",null,null,null,null,null,null,null,null,null,null,null,null,null,null,null,null,null,null,null,null,null,null,null,null,{"$f":"IF((Tabla2[[#This Row],[Disponibilidad]]+Tabla2[[#This Row],[Integridad]]+Tabla2[[#This Row],[Confidencialidad ]]<=4),\"Baja\",IF(AND(Tabla2[[#This Row],[Disponibilidad]]+Tabla2[[#This Row],[Integridad]]+Tabla2[[#This Row],[Confidencialidad ]]>=5,Tabla2[[#This Row],[Disponibilidad]]+Tabla2[[#This Row],[Integridad]]+Tabla2[[#This Row],[Confidencialidad ]]<=7),\"Media\",IF(Tabla2[[#This Row],[Disponibilidad]]+Tabla2[[#This Row],[Integridad]]+Tabla2[[#This Row],[Confidencialidad ]]>=8,\"Alta\",\"error\")))","v":"Baja"}]
["",null,null,null,null,null,null,null,null,null,null,null,null,null,null,null,null,null,null,null,null,null,null,null,null,{"$f":"IF((Tabla2[[#This Row],[Disponibilidad]]+Tabla2[[#This Row],[Integridad]]+Tabla2[[#This Row],[Confidencialidad ]]<=4),\"Baja\",IF(AND(Tabla2[[#This Row],[Disponibilidad]]+Tabla2[[#This Row],[Integridad]]+Tabla2[[#This Row],[Confidencialidad ]]>=5,Tabla2[[#This Row],[Disponibilidad]]+Tabla2[[#This Row],[Integridad]]+Tabla2[[#This Row],[Confidencialidad ]]<=7),\"Media\",IF(Tabla2[[#This Row],[Disponibilidad]]+Tabla2[[#This Row],[Integridad]]+Tabla2[[#This Row],[Confidencialidad ]]>=8,\"Alta\",\"error\")))","v":"Baja"}]
["",null,null,null,null,null,null,null,null,null,null,null,null,null,null,null,null,null,null,null,null,null,null,null,null,{"$f":"IF((Tabla2[[#This Row],[Disponibilidad]]+Tabla2[[#This Row],[Integridad]]+Tabla2[[#This Row],[Confidencialidad ]]<=4),\"Baja\",IF(AND(Tabla2[[#This Row],[Disponibilidad]]+Tabla2[[#This Row],[Integridad]]+Tabla2[[#This Row],[Confidencialidad ]]>=5,Tabla2[[#This Row],[Disponibilidad]]+Tabla2[[#This Row],[Integridad]]+Tabla2[[#This Row],[Confidencialidad ]]<=7),\"Media\",IF(Tabla2[[#This Row],[Disponibilidad]]+Tabla2[[#This Row],[Integridad]]+Tabla2[[#This Row],[Confidencialidad ]]>=8,\"Alta\",\"error\")))","v":"Baja"}]
["",null,null,null,null,null,null,null,null,null,null,null,null,null,null,null,null,null,null,null,null,null,null,null,null,{"$f":"IF((Tabla2[[#This Row],[Disponibilidad]]+Tabla2[[#This Row],[Integridad]]+Tabla2[[#This Row],[Confidencialidad ]]<=4),\"Baja\",IF(AND(Tabla2[[#This Row],[Disponibilidad]]+Tabla2[[#This Row],[Integridad]]+Tabla2[[#This Row],[Confidencialidad ]]>=5,Tabla2[[#This Row],[Disponibilidad]]+Tabla2[[#This Row],[Integridad]]+Tabla2[[#This Row],[Confidencialidad ]]<=7),\"Media\",IF(Tabla2[[#This Row],[Disponibilidad]]+Tabla2[[#This Row],[Integridad]]+Tabla2[[#This Row],[Confidencialidad ]]>=8,\"Alta\",\"error\")))","v":"Baja"}]
["",null,null,null,null,null,null,null,null,null,null,null,null,null,null,null,null,null,null,null,null,null,null,null,null,{"$f":"IF((Tabla2[[#This Row],[Disponibilidad]]+Tabla2[[#This Row],[Integridad]]+Tabla2[[#This Row],[Confidencialidad ]]<=4),\"Baja\",IF(AND(Tabla2[[#This Row],[Disponibilidad]]+Tabla2[[#This Row],[Integridad]]+Tabla2[[#This Row],[Confidencialidad ]]>=5,Tabla2[[#This Row],[Disponibilidad]]+Tabla2[[#This Row],[Integridad]]+Tabla2[[#This Row],[Confidencialidad ]]<=7),\"Media\",IF(Tabla2[[#This Row],[Disponibilidad]]+Tabla2[[#This Row],[Integridad]]+Tabla2[[#This Row],[Confidencialidad ]]>=8,\"Alta\",\"error\")))","v":"Baja"}]
["",null,null,null,null,null,null,null,null,null,null,null,null,null,null,null,null,null,null,null,null,null,null,null,null,{"$f":"IF((Tabla2[[#This Row],[Disponibilidad]]+Tabla2[[#This Row],[Integridad]]+Tabla2[[#This Row],[Confidencialidad ]]<=4),\"Baja\",IF(AND(Tabla2[[#This Row],[Disponibilidad]]+Tabla2[[#This Row],[Integridad]]+Tabla2[[#This Row],[Confidencialidad ]]>=5,Tabla2[[#This Row],[Disponibilidad]]+Tabla2[[#This Row],[Integridad]]+Tabla2[[#This Row],[Confidencialidad ]]<=7),\"Media\",IF(Tabla2[[#This Row],[Disponibilidad]]+Tabla2[[#This Row],[Integridad]]+Tabla2[[#This Row],[Confidencialidad ]]>=8,\"Alta\",\"error\")))","v":"Baja"}]
["",null,null,null,null,null,null,null,null,null,null,null,null,null,null,null,null,null,null,null,null,null,null,null,null,{"$f":"IF((Tabla2[[#This Row],[Disponibilidad]]+Tabla2[[#This Row],[Integridad]]+Tabla2[[#This Row],[Confidencialidad ]]<=4),\"Baja\",IF(AND(Tabla2[[#This Row],[Disponibilidad]]+Tabla2[[#This Row],[Integridad]]+Tabla2[[#This Row],[Confidencialidad ]]>=5,Tabla2[[#This Row],[Disponibilidad]]+Tabla2[[#This Row],[Integridad]]+Tabla2[[#This Row],[Confidencialidad ]]<=7),\"Media\",IF(Tabla2[[#This Row],[Disponibilidad]]+Tabla2[[#This Row],[Integridad]]+Tabla2[[#This Row],[Confidencialidad ]]>=8,\"Alta\",\"error\")))","v":"Baja"}]
["",null,null,null,null,null,null,null,null,null,null,null,null,null,null,null,null,null,null,null,null,null,null,null,null,{"$f":"IF((Tabla2[[#This Row],[Disponibilidad]]+Tabla2[[#This Row],[Integridad]]+Tabla2[[#This Row],[Confidencialidad ]]<=4),\"Baja\",IF(AND(Tabla2[[#This Row],[Disponibilidad]]+Tabla2[[#This Row],[Integridad]]+Tabla2[[#This Row],[Confidencialidad ]]>=5,Tabla2[[#This Row],[Disponibilidad]]+Tabla2[[#This Row],[Integridad]]+Tabla2[[#This Row],[Confidencialidad ]]<=7),\"Media\",IF(Tabla2[[#This Row],[Disponibilidad]]+Tabla2[[#This Row],[Integridad]]+Tabla2[[#This Row],[Confidencialidad ]]>=8,\"Alta\",\"error\")))","v":"Baja"}]
["",null,null,null,null,null,null,null,null,null,null,null,null,null,null,null,null,null,null,null,null,null,null,null,null,{"$f":"IF((Tabla2[[#This Row],[Disponibilidad]]+Tabla2[[#This Row],[Integridad]]+Tabla2[[#This Row],[Confidencialidad ]]<=4),\"Baja\",IF(AND(Tabla2[[#This Row],[Disponibilidad]]+Tabla2[[#This Row],[Integridad]]+Tabla2[[#This Row],[Confidencialidad ]]>=5,Tabla2[[#This Row],[Disponibilidad]]+Tabla2[[#This Row],[Integridad]]+Tabla2[[#This Row],[Confidencialidad ]]<=7),\"Media\",IF(Tabla2[[#This Row],[Disponibilidad]]+Tabla2[[#This Row],[Integridad]]+Tabla2[[#This Row],[Confidencialidad ]]>=8,\"Alta\",\"error\")))","v":"Baja"}]
["",null,null,null,null,null,null,null,null,null,null,null,null,null,null,null,null,null,null,null,null,null,null,null,null,{"$f":"IF((Tabla2[[#This Row],[Disponibilidad]]+Tabla2[[#This Row],[Integridad]]+Tabla2[[#This Row],[Confidencialidad ]]<=4),\"Baja\",IF(AND(Tabla2[[#This Row],[Disponibilidad]]+Tabla2[[#This Row],[Integridad]]+Tabla2[[#This Row],[Confidencialidad ]]>=5,Tabla2[[#This Row],[Disponibilidad]]+Tabla2[[#This Row],[Integridad]]+Tabla2[[#This Row],[Confidencialidad ]]<=7),\"Media\",IF(Tabla2[[#This Row],[Disponibilidad]]+Tabla2[[#This Row],[Integridad]]+Tabla2[[#This Row],[Confidencialidad ]]>=8,\"Alta\",\"error\")))","v":"Baja"}]
["",null,null,null,null,null,null,null,null,null,null,null,null,null,null,null,null,null,null,null,null,null,null,null,null,{"$f":"IF((Tabla2[[#This Row],[Disponibilidad]]+Tabla2[[#This Row],[Integridad]]+Tabla2[[#This Row],[Confidencialidad ]]<=4),\"Baja\",IF(AND(Tabla2[[#This Row],[Disponibilidad]]+Tabla2[[#This Row],[Integridad]]+Tabla2[[#This Row],[Confidencialidad ]]>=5,Tabla2[[#This Row],[Disponibilidad]]+Tabla2[[#This Row],[Integridad]]+Tabla2[[#This Row],[Confidencialidad ]]<=7),\"Media\",IF(Tabla2[[#This Row],[Disponibilidad]]+Tabla2[[#This Row],[Integridad]]+Tabla2[[#This Row],[Confidencialidad ]]>=8,\"Alta\",\"error\")))","v":"Baja"}]
["",null,null,null,null,null,null,null,null,null,null,null,null,null,null,null,null,null,null,null,null,null,null,null,null,{"$f":"IF((Tabla2[[#This Row],[Disponibilidad]]+Tabla2[[#This Row],[Integridad]]+Tabla2[[#This Row],[Confidencialidad ]]<=4),\"Baja\",IF(AND(Tabla2[[#This Row],[Disponibilidad]]+Tabla2[[#This Row],[Integridad]]+Tabla2[[#This Row],[Confidencialidad ]]>=5,Tabla2[[#This Row],[Disponibilidad]]+Tabla2[[#This Row],[Integridad]]+Tabla2[[#This Row],[Confidencialidad ]]<=7),\"Media\",IF(Tabla2[[#This Row],[Disponibilidad]]+Tabla2[[#This Row],[Integridad]]+Tabla2[[#This Row],[Confidencialidad ]]>=8,\"Alta\",\"error\")))","v":"Baja"}]
["",null,null,null,null,null,null,null,null,null,null,null,null,null,null,null,null,null,null,null,null,null,null,null,null,{"$f":"IF((Tabla2[[#This Row],[Disponibilidad]]+Tabla2[[#This Row],[Integridad]]+Tabla2[[#This Row],[Confidencialidad ]]<=4),\"Baja\",IF(AND(Tabla2[[#This Row],[Disponibilidad]]+Tabla2[[#This Row],[Integridad]]+Tabla2[[#This Row],[Confidencialidad ]]>=5,Tabla2[[#This Row],[Disponibilidad]]+Tabla2[[#This Row],[Integridad]]+Tabla2[[#This Row],[Confidencialidad ]]<=7),\"Media\",IF(Tabla2[[#This Row],[Disponibilidad]]+Tabla2[[#This Row],[Integridad]]+Tabla2[[#This Row],[Confidencialidad ]]>=8,\"Alta\",\"error\")))","v":"Baja"}]
["",null,null,null,null,null,null,null,null,null,null,null,null,null,null,null,null,null,null,null,null,null,null,null,null,{"$f":"IF((Tabla2[[#This Row],[Disponibilidad]]+Tabla2[[#This Row],[Integridad]]+Tabla2[[#This Row],[Confidencialidad ]]<=4),\"Baja\",IF(AND(Tabla2[[#This Row],[Disponibilidad]]+Tabla2[[#This Row],[Integridad]]+Tabla2[[#This Row],[Confidencialidad ]]>=5,Tabla2[[#This Row],[Disponibilidad]]+Tabla2[[#This Row],[Integridad]]+Tabla2[[#This Row],[Confidencialidad ]]<=7),\"Media\",IF(Tabla2[[#This Row],[Disponibilidad]]+Tabla2[[#This Row],[Integridad]]+Tabla2[[#This Row],[Confidencialidad ]]>=8,\"Alta\",\"error\")))","v":"Baja"}]
["",null,null,null,null,null,null,null,null,null,null,null,null,null,null,null,null,null,null,null,null,null,null,null,null,{"$f":"IF((Tabla2[[#This Row],[Disponibilidad]]+Tabla2[[#This Row],[Integridad]]+Tabla2[[#This Row],[Confidencialidad ]]<=4),\"Baja\",IF(AND(Tabla2[[#This Row],[Disponibilidad]]+Tabla2[[#This Row],[Integridad]]+Tabla2[[#This Row],[Confidencialidad ]]>=5,Tabla2[[#This Row],[Disponibilidad]]+Tabla2[[#This Row],[Integridad]]+Tabla2[[#This Row],[Confidencialidad ]]<=7),\"Media\",IF(Tabla2[[#This Row],[Disponibilidad]]+Tabla2[[#This Row],[Integridad]]+Tabla2[[#This Row],[Confidencialidad ]]>=8,\"Alta\",\"error\")))","v":"Baja"}]
["",null,null,null,null,null,null,null,null,null,null,null,null,null,null,null,null,null,null,null,null,null,null,null,null,{"$f":"IF((Tabla2[[#This Row],[Disponibilidad]]+Tabla2[[#This Row],[Integridad]]+Tabla2[[#This Row],[Confidencialidad ]]<=4),\"Baja\",IF(AND(Tabla2[[#This Row],[Disponibilidad]]+Tabla2[[#This Row],[Integridad]]+Tabla2[[#This Row],[Confidencialidad ]]>=5,Tabla2[[#This Row],[Disponibilidad]]+Tabla2[[#This Row],[Integridad]]+Tabla2[[#This Row],[Confidencialidad ]]<=7),\"Media\",IF(Tabla2[[#This Row],[Disponibilidad]]+Tabla2[[#This Row],[Integridad]]+Tabla2[[#This Row],[Confidencialidad ]]>=8,\"Alta\",\"error\")))","v":"Baja"}]
["",null,null,null,null,null,null,null,null,null,null,null,null,null,null,null,null,null,null,null,null,null,null,null,null,{"$f":"IF((Tabla2[[#This Row],[Disponibilidad]]+Tabla2[[#This Row],[Integridad]]+Tabla2[[#This Row],[Confidencialidad ]]<=4),\"Baja\",IF(AND(Tabla2[[#This Row],[Disponibilidad]]+Tabla2[[#This Row],[Integridad]]+Tabla2[[#This Row],[Confidencialidad ]]>=5,Tabla2[[#This Row],[Disponibilidad]]+Tabla2[[#This Row],[Integridad]]+Tabla2[[#This Row],[Confidencialidad ]]<=7),\"Media\",IF(Tabla2[[#This Row],[Disponibilidad]]+Tabla2[[#This Row],[Integridad]]+Tabla2[[#This Row],[Confidencialidad ]]>=8,\"Alta\",\"error\")))","v":"Baja"}]
["",null,null,null,null,null,null,null,null,null,null,null,null,null,null,null,null,null,null,null,null,null,null,null,null,{"$f":"IF((Tabla2[[#This Row],[Disponibilidad]]+Tabla2[[#This Row],[Integridad]]+Tabla2[[#This Row],[Confidencialidad ]]<=4),\"Baja\",IF(AND(Tabla2[[#This Row],[Disponibilidad]]+Tabla2[[#This Row],[Integridad]]+Tabla2[[#This Row],[Confidencialidad ]]>=5,Tabla2[[#This Row],[Disponibilidad]]+Tabla2[[#This Row],[Integridad]]+Tabla2[[#This Row],[Confidencialidad ]]<=7),\"Media\",IF(Tabla2[[#This Row],[Disponibilidad]]+Tabla2[[#This Row],[Integridad]]+Tabla2[[#This Row],[Confidencialidad ]]>=8,\"Alta\",\"error\")))","v":"Baja"}]
["",null,null,null,null,null,null,null,null,null,null,null,null,null,null,null,null,null,null,null,null,null,null,null,null,{"$f":"IF((Tabla2[[#This Row],[Disponibilidad]]+Tabla2[[#This Row],[Integridad]]+Tabla2[[#This Row],[Confidencialidad ]]<=4),\"Baja\",IF(AND(Tabla2[[#This Row],[Disponibilidad]]+Tabla2[[#This Row],[Integridad]]+Tabla2[[#This Row],[Confidencialidad ]]>=5,Tabla2[[#This Row],[Disponibilidad]]+Tabla2[[#This Row],[Integridad]]+Tabla2[[#This Row],[Confidencialidad ]]<=7),\"Media\",IF(Tabla2[[#This Row],[Disponibilidad]]+Tabla2[[#This Row],[Integridad]]+Tabla2[[#This Row],[Confidencialidad ]]>=8,\"Alta\",\"error\")))","v":"Baja"}]
["",null,null,null,null,null,null,null,null,null,null,null,null,null,null,null,null,null,null,null,null,null,null,null,null,{"$f":"IF((Tabla2[[#This Row],[Disponibilidad]]+Tabla2[[#This Row],[Integridad]]+Tabla2[[#This Row],[Confidencialidad ]]<=4),\"Baja\",IF(AND(Tabla2[[#This Row],[Disponibilidad]]+Tabla2[[#This Row],[Integridad]]+Tabla2[[#This Row],[Confidencialidad ]]>=5,Tabla2[[#This Row],[Disponibilidad]]+Tabla2[[#This Row],[Integridad]]+Tabla2[[#This Row],[Confidencialidad ]]<=7),\"Media\",IF(Tabla2[[#This Row],[Disponibilidad]]+Tabla2[[#This Row],[Integridad]]+Tabla2[[#This Row],[Confidencialidad ]]>=8,\"Alta\",\"error\")))","v":"Baja"}]
["",null,null,null,null,null,null,null,null,null,null,null,null,null,null,null,null,null,null,null,null,null,null,null,null,{"$f":"IF((Tabla2[[#This Row],[Disponibilidad]]+Tabla2[[#This Row],[Integridad]]+Tabla2[[#This Row],[Confidencialidad ]]<=4),\"Baja\",IF(AND(Tabla2[[#This Row],[Disponibilidad]]+Tabla2[[#This Row],[Integridad]]+Tabla2[[#This Row],[Confidencialidad ]]>=5,Tabla2[[#This Row],[Disponibilidad]]+Tabla2[[#This Row],[Integridad]]+Tabla2[[#This Row],[Confidencialidad ]]<=7),\"Media\",IF(Tabla2[[#This Row],[Disponibilidad]]+Tabla2[[#This Row],[Integridad]]+Tabla2[[#This Row],[Confidencialidad ]]>=8,\"Alta\",\"error\")))","v":"Baja"}]
["",null,null,null,null,null,null,null,null,null,null,null,null,null,null,null,null,null,null,null,null,null,null,null,null,{"$f":"IF((Tabla2[[#This Row],[Disponibilidad]]+Tabla2[[#This Row],[Integridad]]+Tabla2[[#This Row],[Confidencialidad ]]<=4),\"Baja\",IF(AND(Tabla2[[#This Row],[Disponibilidad]]+Tabla2[[#This Row],[Integridad]]+Tabla2[[#This Row],[Confidencialidad ]]>=5,Tabla2[[#This Row],[Disponibilidad]]+Tabla2[[#This Row],[Integridad]]+Tabla2[[#This Row],[Confidencialidad ]]<=7),\"Media\",IF(Tabla2[[#This Row],[Disponibilidad]]+Tabla2[[#This Row],[Integridad]]+Tabla2[[#This Row],[Confidencialidad ]]>=8,\"Alta\",\"error\")))","v":"Baja"}]
["",null,null,null,null,null,null,null,null,null,null,null,null,null,null,null,null,null,null,null,null,null,null,null,null,{"$f":"IF((Tabla2[[#This Row],[Disponibilidad]]+Tabla2[[#This Row],[Integridad]]+Tabla2[[#This Row],[Confidencialidad ]]<=4),\"Baja\",IF(AND(Tabla2[[#This Row],[Disponibilidad]]+Tabla2[[#This Row],[Integridad]]+Tabla2[[#This Row],[Confidencialidad ]]>=5,Tabla2[[#This Row],[Disponibilidad]]+Tabla2[[#This Row],[Integridad]]+Tabla2[[#This Row],[Confidencialidad ]]<=7),\"Media\",IF(Tabla2[[#This Row],[Disponibilidad]]+Tabla2[[#This Row],[Integridad]]+Tabla2[[#This Row],[Confidencialidad ]]>=8,\"Alta\",\"error\")))","v":"Baja"}]
["",null,null,null,null,null,null,null,null,null,null,null,null,null,null,null,null,null,null,null,null,null,null,null,null,{"$f":"IF((Tabla2[[#This Row],[Disponibilidad]]+Tabla2[[#This Row],[Integridad]]+Tabla2[[#This Row],[Confidencialidad ]]<=4),\"Baja\",IF(AND(Tabla2[[#This Row],[Disponibilidad]]+Tabla2[[#This Row],[Integridad]]+Tabla2[[#This Row],[Confidencialidad ]]>=5,Tabla2[[#This Row],[Disponibilidad]]+Tabla2[[#This Row],[Integridad]]+Tabla2[[#This Row],[Confidencialidad ]]<=7),\"Media\",IF(Tabla2[[#This Row],[Disponibilidad]]+Tabla2[[#This Row],[Integridad]]+Tabla2[[#This Row],[Confidencialidad ]]>=8,\"Alta\",\"error\")))","v":"Baja"}]
["",null,null,null,null,null,null,null,null,null,null,null,null,null,null,null,null,null,null,null,null,null,null,null,null,{"$f":"IF((Tabla2[[#This Row],[Disponibilidad]]+Tabla2[[#This Row],[Integridad]]+Tabla2[[#This Row],[Confidencialidad ]]<=4),\"Baja\",IF(AND(Tabla2[[#This Row],[Disponibilidad]]+Tabla2[[#This Row],[Integridad]]+Tabla2[[#This Row],[Confidencialidad ]]>=5,Tabla2[[#This Row],[Disponibilidad]]+Tabla2[[#This Row],[Integridad]]+Tabla2[[#This Row],[Confidencialidad ]]<=7),\"Media\",IF(Tabla2[[#This Row],[Disponibilidad]]+Tabla2[[#This Row],[Integridad]]+Tabla2[[#This Row],[Confidencialidad ]]>=8,\"Alta\",\"error\")))","v":"Baja"}]
["",null,null,null,null,null,null,null,null,null,null,null,null,null,null,null,null,null,null,null,null,null,null,null,null,{"$f":"IF((Tabla2[[#This Row],[Disponibilidad]]+Tabla2[[#This Row],[Integridad]]+Tabla2[[#This Row],[Confidencialidad ]]<=4),\"Baja\",IF(AND(Tabla2[[#This Row],[Disponibilidad]]+Tabla2[[#This Row],[Integridad]]+Tabla2[[#This Row],[Confidencialidad ]]>=5,Tabla2[[#This Row],[Disponibilidad]]+Tabla2[[#This Row],[Integridad]]+Tabla2[[#This Row],[Confidencialidad ]]<=7),\"Media\",IF(Tabla2[[#This Row],[Disponibilidad]]+Tabla2[[#This Row],[Integridad]]+Tabla2[[#This Row],[Confidencialidad ]]>=8,\"Alta\",\"error\")))","v":"Baja"}]
["",null,null,null,null,null,null,null,null,null,null,null,null,null,null,null,null,null,null,null,null,null,null,null,null,{"$f":"IF((Tabla2[[#This Row],[Disponibilidad]]+Tabla2[[#This Row],[Integridad]]+Tabla2[[#This Row],[Confidencialidad ]]<=4),\"Baja\",IF(AND(Tabla2[[#This Row],[Disponibilidad]]+Tabla2[[#This Row],[Integridad]]+Tabla2[[#This Row],[Confidencialidad ]]>=5,Tabla2[[#This Row],[Disponibilidad]]+Tabla2[[#This Row],[Integridad]]+Tabla2[[#This Row],[Confidencialidad ]]<=7),\"Media\",IF(Tabla2[[#This Row],[Disponibilidad]]+Tabla2[[#This Row],[Integridad]]+Tabla2[[#This Row],[Confidencialidad ]]>=8,\"Alta\",\"error\")))","v":"Baja"}]
["",null,null,null,null,null,null,null,null,null,null,null,null,null,null,null,null,null,null,null,null,null,null,null,null,{"$f":"IF((Tabla2[[#This Row],[Disponibilidad]]+Tabla2[[#This Row],[Integridad]]+Tabla2[[#This Row],[Confidencialidad ]]<=4),\"Baja\",IF(AND(Tabla2[[#This Row],[Disponibilidad]]+Tabla2[[#This Row],[Integridad]]+Tabla2[[#This Row],[Confidencialidad ]]>=5,Tabla2[[#This Row],[Disponibilidad]]+Tabla2[[#This Row],[Integridad]]+Tabla2[[#This Row],[Confidencialidad ]]<=7),\"Media\",IF(Tabla2[[#This Row],[Disponibilidad]]+Tabla2[[#This Row],[Integridad]]+Tabla2[[#This Row],[Confidencialidad ]]>=8,\"Alta\",\"error\")))","v":"Baja"}]
["",null,null,null,null,null,null,null,null,null,null,null,null,null,null,null,null,null,null,null,null,null,null,null,null,{"$f":"IF((Tabla2[[#This Row],[Disponibilidad]]+Tabla2[[#This Row],[Integridad]]+Tabla2[[#This Row],[Confidencialidad ]]<=4),\"Baja\",IF(AND(Tabla2[[#This Row],[Disponibilidad]]+Tabla2[[#This Row],[Integridad]]+Tabla2[[#This Row],[Confidencialidad ]]>=5,Tabla2[[#This Row],[Disponibilidad]]+Tabla2[[#This Row],[Integridad]]+Tabla2[[#This Row],[Confidencialidad ]]<=7),\"Media\",IF(Tabla2[[#This Row],[Disponibilidad]]+Tabla2[[#This Row],[Integridad]]+Tabla2[[#This Row],[Confidencialidad ]]>=8,\"Alta\",\"error\")))","v":"Baja"}]
["",null,null,null,null,null,null,null,null,null,null,null,null,null,null,null,null,null,null,null,null,null,null,null,null,{"$f":"IF((Tabla2[[#This Row],[Disponibilidad]]+Tabla2[[#This Row],[Integridad]]+Tabla2[[#This Row],[Confidencialidad ]]<=4),\"Baja\",IF(AND(Tabla2[[#This Row],[Disponibilidad]]+Tabla2[[#This Row],[Integridad]]+Tabla2[[#This Row],[Confidencialidad ]]>=5,Tabla2[[#This Row],[Disponibilidad]]+Tabla2[[#This Row],[Integridad]]+Tabla2[[#This Row],[Confidencialidad ]]<=7),\"Media\",IF(Tabla2[[#This Row],[Disponibilidad]]+Tabla2[[#This Row],[Integridad]]+Tabla2[[#This Row],[Confidencialidad ]]>=8,\"Alta\",\"error\")))","v":"Baja"}]
[{"$f":"IF(C497<>\"\",1,\"\")","v":""},null,null,null,null,null,null,null,null,null,null,null,null,null,null,null,null,null,null,null,null,null,null,null,null,{"$f":"IF((Tabla2[[#This Row],[Disponibilidad]]+Tabla2[[#This Row],[Integridad]]+Tabla2[[#This Row],[Confidencialidad ]]<=4),\"Baja\",IF(AND(Tabla2[[#This Row],[Disponibilidad]]+Tabla2[[#This Row],[Integridad]]+Tabla2[[#This Row],[Confidencialidad ]]>=5,Tabla2[[#This Row],[Disponibilidad]]+Tabla2[[#This Row],[Integridad]]+Tabla2[[#This Row],[Confidencialidad ]]<=7),\"Media\",IF(Tabla2[[#This Row],[Disponibilidad]]+Tabla2[[#This Row],[Integridad]]+Tabla2[[#This Row],[Confidencialidad ]]>=8,\"Alta\",\"error\")))","v":"Baja"}]
["",null,null,null,null,null,null,null,null,null,null,null,null,null,null,null,null,null,null,null,null,null,null,null,null,{"$f":"IF((Tabla2[[#This Row],[Disponibilidad]]+Tabla2[[#This Row],[Integridad]]+Tabla2[[#This Row],[Confidencialidad ]]<=4),\"Baja\",IF(AND(Tabla2[[#This Row],[Disponibilidad]]+Tabla2[[#This Row],[Integridad]]+Tabla2[[#This Row],[Confidencialidad ]]>=5,Tabla2[[#This Row],[Disponibilidad]]+Tabla2[[#This Row],[Integridad]]+Tabla2[[#This Row],[Confidencialidad ]]<=7),\"Media\",IF(Tabla2[[#This Row],[Disponibilidad]]+Tabla2[[#This Row],[Integridad]]+Tabla2[[#This Row],[Confidencialidad ]]>=8,\"Alta\",\"error\")))","v":"Baja"}]
["",null,null,null,null,null,null,null,null,null,null,null,null,null,null,null,null,null,null,null,null,null,null,null,null,{"$f":"IF((Tabla2[[#This Row],[Disponibilidad]]+Tabla2[[#This Row],[Integridad]]+Tabla2[[#This Row],[Confidencialidad ]]<=4),\"Baja\",IF(AND(Tabla2[[#This Row],[Disponibilidad]]+Tabla2[[#This Row],[Integridad]]+Tabla2[[#This Row],[Confidencialidad ]]>=5,Tabla2[[#This Row],[Disponibilidad]]+Tabla2[[#This Row],[Integridad]]+Tabla2[[#This Row],[Confidencialidad ]]<=7),\"Media\",IF(Tabla2[[#This Row],[Disponibilidad]]+Tabla2[[#This Row],[Integridad]]+Tabla2[[#This Row],[Confidencialidad ]]>=8,\"Alta\",\"error\")))","v":"Baja"}]
["",null,null,null,null,null,null,null,null,null,null,null,null,null,null,null,null,null,null,null,null,null,null,null,null,{"$f":"IF((Tabla2[[#This Row],[Disponibilidad]]+Tabla2[[#This Row],[Integridad]]+Tabla2[[#This Row],[Confidencialidad ]]<=4),\"Baja\",IF(AND(Tabla2[[#This Row],[Disponibilidad]]+Tabla2[[#This Row],[Integridad]]+Tabla2[[#This Row],[Confidencialidad ]]>=5,Tabla2[[#This Row],[Disponibilidad]]+Tabla2[[#This Row],[Integridad]]+Tabla2[[#This Row],[Confidencialidad ]]<=7),\"Media\",IF(Tabla2[[#This Row],[Disponibilidad]]+Tabla2[[#This Row],[Integridad]]+Tabla2[[#This Row],[Confidencialidad ]]>=8,\"Alta\",\"error\")))","v":"Baja"}]
["",null,null,null,null,null,null,null,null,null,null,null,null,null,null,null,null,null,null,null,null,null,null,null,null,{"$f":"IF((Tabla2[[#This Row],[Disponibilidad]]+Tabla2[[#This Row],[Integridad]]+Tabla2[[#This Row],[Confidencialidad ]]<=4),\"Baja\",IF(AND(Tabla2[[#This Row],[Disponibilidad]]+Tabla2[[#This Row],[Integridad]]+Tabla2[[#This Row],[Confidencialidad ]]>=5,Tabla2[[#This Row],[Disponibilidad]]+Tabla2[[#This Row],[Integridad]]+Tabla2[[#This Row],[Confidencialidad ]]<=7),\"Media\",IF(Tabla2[[#This Row],[Disponibilidad]]+Tabla2[[#This Row],[Integridad]]+Tabla2[[#This Row],[Confidencialidad ]]>=8,\"Alta\",\"error\")))","v":"Baja"}]
["",null,null,null,null,null,null,null,null,null,null,null,null,null,null,null,null,null,null,null,null,null,null,null,null,{"$f":"IF((Tabla2[[#This Row],[Disponibilidad]]+Tabla2[[#This Row],[Integridad]]+Tabla2[[#This Row],[Confidencialidad ]]<=4),\"Baja\",IF(AND(Tabla2[[#This Row],[Disponibilidad]]+Tabla2[[#This Row],[Integridad]]+Tabla2[[#This Row],[Confidencialidad ]]>=5,Tabla2[[#This Row],[Disponibilidad]]+Tabla2[[#This Row],[Integridad]]+Tabla2[[#This Row],[Confidencialidad ]]<=7),\"Media\",IF(Tabla2[[#This Row],[Disponibilidad]]+Tabla2[[#This Row],[Integridad]]+Tabla2[[#This Row],[Confidencialidad ]]>=8,\"Alta\",\"error\")))","v":"Baja"}]
["",null,null,null,null,null,null,null,null,null,null,null,null,null,null,null,null,null,null,null,null,null,null,null,null,{"$f":"IF((Tabla2[[#This Row],[Disponibilidad]]+Tabla2[[#This Row],[Integridad]]+Tabla2[[#This Row],[Confidencialidad ]]<=4),\"Baja\",IF(AND(Tabla2[[#This Row],[Disponibilidad]]+Tabla2[[#This Row],[Integridad]]+Tabla2[[#This Row],[Confidencialidad ]]>=5,Tabla2[[#This Row],[Disponibilidad]]+Tabla2[[#This Row],[Integridad]]+Tabla2[[#This Row],[Confidencialidad ]]<=7),\"Media\",IF(Tabla2[[#This Row],[Disponibilidad]]+Tabla2[[#This Row],[Integridad]]+Tabla2[[#This Row],[Confidencialidad ]]>=8,\"Alta\",\"error\")))","v":"Baja"}]
["",null,null,null,null,null,null,null,null,null,null,null,null,null,null,null,null,null,null,null,null,null,null,null,null,{"$f":"IF((Tabla2[[#This Row],[Disponibilidad]]+Tabla2[[#This Row],[Integridad]]+Tabla2[[#This Row],[Confidencialidad ]]<=4),\"Baja\",IF(AND(Tabla2[[#This Row],[Disponibilidad]]+Tabla2[[#This Row],[Integridad]]+Tabla2[[#This Row],[Confidencialidad ]]>=5,Tabla2[[#This Row],[Disponibilidad]]+Tabla2[[#This Row],[Integridad]]+Tabla2[[#This Row],[Confidencialidad ]]<=7),\"Media\",IF(Tabla2[[#This Row],[Disponibilidad]]+Tabla2[[#This Row],[Integridad]]+Tabla2[[#This Row],[Confidencialidad ]]>=8,\"Alta\",\"error\")))","v":"Baja"}]
["",null,null,null,null,null,null,null,null,null,null,null,null,null,null,null,null,null,null,null,null,null,null,null,null,{"$f":"IF((Tabla2[[#This Row],[Disponibilidad]]+Tabla2[[#This Row],[Integridad]]+Tabla2[[#This Row],[Confidencialidad ]]<=4),\"Baja\",IF(AND(Tabla2[[#This Row],[Disponibilidad]]+Tabla2[[#This Row],[Integridad]]+Tabla2[[#This Row],[Confidencialidad ]]>=5,Tabla2[[#This Row],[Disponibilidad]]+Tabla2[[#This Row],[Integridad]]+Tabla2[[#This Row],[Confidencialidad ]]<=7),\"Media\",IF(Tabla2[[#This Row],[Disponibilidad]]+Tabla2[[#This Row],[Integridad]]+Tabla2[[#This Row],[Confidencialidad ]]>=8,\"Alta\",\"error\")))","v":"Baja"}]
["",null,null,null,null,null,null,null,null,null,null,null,null,null,null,null,null,null,null,null,null,null,null,null,null,{"$f":"IF((Tabla2[[#This Row],[Disponibilidad]]+Tabla2[[#This Row],[Integridad]]+Tabla2[[#This Row],[Confidencialidad ]]<=4),\"Baja\",IF(AND(Tabla2[[#This Row],[Disponibilidad]]+Tabla2[[#This Row],[Integridad]]+Tabla2[[#This Row],[Confidencialidad ]]>=5,Tabla2[[#This Row],[Disponibilidad]]+Tabla2[[#This Row],[Integridad]]+Tabla2[[#This Row],[Confidencialidad ]]<=7),\"Media\",IF(Tabla2[[#This Row],[Disponibilidad]]+Tabla2[[#This Row],[Integridad]]+Tabla2[[#This Row],[Confidencialidad ]]>=8,\"Alta\",\"error\")))","v":"Baja"}]
["",null,null,null,null,null,null,null,null,null,null,null,null,null,null,null,null,null,null,null,null,null,null,null,null,{"$f":"IF((Tabla2[[#This Row],[Disponibilidad]]+Tabla2[[#This Row],[Integridad]]+Tabla2[[#This Row],[Confidencialidad ]]<=4),\"Baja\",IF(AND(Tabla2[[#This Row],[Disponibilidad]]+Tabla2[[#This Row],[Integridad]]+Tabla2[[#This Row],[Confidencialidad ]]>=5,Tabla2[[#This Row],[Disponibilidad]]+Tabla2[[#This Row],[Integridad]]+Tabla2[[#This Row],[Confidencialidad ]]<=7),\"Media\",IF(Tabla2[[#This Row],[Disponibilidad]]+Tabla2[[#This Row],[Integridad]]+Tabla2[[#This Row],[Confidencialidad ]]>=8,\"Alta\",\"error\")))","v":"Baja"}]
["",null,null,null,null,null,null,null,null,null,null,null,null,null,null,null,null,null,null,null,null,null,null,null,null,{"$f":"IF((Tabla2[[#This Row],[Disponibilidad]]+Tabla2[[#This Row],[Integridad]]+Tabla2[[#This Row],[Confidencialidad ]]<=4),\"Baja\",IF(AND(Tabla2[[#This Row],[Disponibilidad]]+Tabla2[[#This Row],[Integridad]]+Tabla2[[#This Row],[Confidencialidad ]]>=5,Tabla2[[#This Row],[Disponibilidad]]+Tabla2[[#This Row],[Integridad]]+Tabla2[[#This Row],[Confidencialidad ]]<=7),\"Media\",IF(Tabla2[[#This Row],[Disponibilidad]]+Tabla2[[#This Row],[Integridad]]+Tabla2[[#This Row],[Confidencialidad ]]>=8,\"Alta\",\"error\")))","v":"Baja"}]
["",null,null,null,null,null,null,null,null,null,null,null,null,null,null,null,null,null,null,null,null,null,null,null,null,{"$f":"IF((Tabla2[[#This Row],[Disponibilidad]]+Tabla2[[#This Row],[Integridad]]+Tabla2[[#This Row],[Confidencialidad ]]<=4),\"Baja\",IF(AND(Tabla2[[#This Row],[Disponibilidad]]+Tabla2[[#This Row],[Integridad]]+Tabla2[[#This Row],[Confidencialidad ]]>=5,Tabla2[[#This Row],[Disponibilidad]]+Tabla2[[#This Row],[Integridad]]+Tabla2[[#This Row],[Confidencialidad ]]<=7),\"Media\",IF(Tabla2[[#This Row],[Disponibilidad]]+Tabla2[[#This Row],[Integridad]]+Tabla2[[#This Row],[Confidencialidad ]]>=8,\"Alta\",\"error\")))","v":"Baja"}]
["",null,null,null,null,null,null,null,null,null,null,null,null,null,null,null,null,null,null,null,null,null,null,null,null,{"$f":"IF((Tabla2[[#This Row],[Disponibilidad]]+Tabla2[[#This Row],[Integridad]]+Tabla2[[#This Row],[Confidencialidad ]]<=4),\"Baja\",IF(AND(Tabla2[[#This Row],[Disponibilidad]]+Tabla2[[#This Row],[Integridad]]+Tabla2[[#This Row],[Confidencialidad ]]>=5,Tabla2[[#This Row],[Disponibilidad]]+Tabla2[[#This Row],[Integridad]]+Tabla2[[#This Row],[Confidencialidad ]]<=7),\"Media\",IF(Tabla2[[#This Row],[Disponibilidad]]+Tabla2[[#This Row],[Integridad]]+Tabla2[[#This Row],[Confidencialidad ]]>=8,\"Alta\",\"error\")))","v":"Baja"}]
["",null,null,null,null,null,null,null,null,null,null,null,null,null,null,null,null,null,null,null,null,null,null,null,null,{"$f":"IF((Tabla2[[#This Row],[Disponibilidad]]+Tabla2[[#This Row],[Integridad]]+Tabla2[[#This Row],[Confidencialidad ]]<=4),\"Baja\",IF(AND(Tabla2[[#This Row],[Disponibilidad]]+Tabla2[[#This Row],[Integridad]]+Tabla2[[#This Row],[Confidencialidad ]]>=5,Tabla2[[#This Row],[Disponibilidad]]+Tabla2[[#This Row],[Integridad]]+Tabla2[[#This Row],[Confidencialidad ]]<=7),\"Media\",IF(Tabla2[[#This Row],[Disponibilidad]]+Tabla2[[#This Row],[Integridad]]+Tabla2[[#This Row],[Confidencialidad ]]>=8,\"Alta\",\"error\")))","v":"Baja"}]
["",null,null,null,null,null,null,null,null,null,null,null,null,null,null,null,null,null,null,null,null,null,null,null,null,{"$f":"IF((Tabla2[[#This Row],[Disponibilidad]]+Tabla2[[#This Row],[Integridad]]+Tabla2[[#This Row],[Confidencialidad ]]<=4),\"Baja\",IF(AND(Tabla2[[#This Row],[Disponibilidad]]+Tabla2[[#This Row],[Integridad]]+Tabla2[[#This Row],[Confidencialidad ]]>=5,Tabla2[[#This Row],[Disponibilidad]]+Tabla2[[#This Row],[Integridad]]+Tabla2[[#This Row],[Confidencialidad ]]<=7),\"Media\",IF(Tabla2[[#This Row],[Disponibilidad]]+Tabla2[[#This Row],[Integridad]]+Tabla2[[#This Row],[Confidencialidad ]]>=8,\"Alta\",\"error\")))","v":"Baja"}]
["",null,null,null,null,null,null,null,null,null,null,null,null,null,null,null,null,null,null,null,null,null,null,null,null,{"$f":"IF((Tabla2[[#This Row],[Disponibilidad]]+Tabla2[[#This Row],[Integridad]]+Tabla2[[#This Row],[Confidencialidad ]]<=4),\"Baja\",IF(AND(Tabla2[[#This Row],[Disponibilidad]]+Tabla2[[#This Row],[Integridad]]+Tabla2[[#This Row],[Confidencialidad ]]>=5,Tabla2[[#This Row],[Disponibilidad]]+Tabla2[[#This Row],[Integridad]]+Tabla2[[#This Row],[Confidencialidad ]]<=7),\"Media\",IF(Tabla2[[#This Row],[Disponibilidad]]+Tabla2[[#This Row],[Integridad]]+Tabla2[[#This Row],[Confidencialidad ]]>=8,\"Alta\",\"error\")))","v":"Baja"}]
["",null,null,null,null,null,null,null,null,null,null,null,null,null,null,null,null,null,null,null,null,null,null,null,null,{"$f":"IF((Tabla2[[#This Row],[Disponibilidad]]+Tabla2[[#This Row],[Integridad]]+Tabla2[[#This Row],[Confidencialidad ]]<=4),\"Baja\",IF(AND(Tabla2[[#This Row],[Disponibilidad]]+Tabla2[[#This Row],[Integridad]]+Tabla2[[#This Row],[Confidencialidad ]]>=5,Tabla2[[#This Row],[Disponibilidad]]+Tabla2[[#This Row],[Integridad]]+Tabla2[[#This Row],[Confidencialidad ]]<=7),\"Media\",IF(Tabla2[[#This Row],[Disponibilidad]]+Tabla2[[#This Row],[Integridad]]+Tabla2[[#This Row],[Confidencialidad ]]>=8,\"Alta\",\"error\")))","v":"Baja"}]
["",null,null,null,null,null,null,null,null,null,null,null,null,null,null,null,null,null,null,null,null,null,null,null,null,{"$f":"IF((Tabla2[[#This Row],[Disponibilidad]]+Tabla2[[#This Row],[Integridad]]+Tabla2[[#This Row],[Confidencialidad ]]<=4),\"Baja\",IF(AND(Tabla2[[#This Row],[Disponibilidad]]+Tabla2[[#This Row],[Integridad]]+Tabla2[[#This Row],[Confidencialidad ]]>=5,Tabla2[[#This Row],[Disponibilidad]]+Tabla2[[#This Row],[Integridad]]+Tabla2[[#This Row],[Confidencialidad ]]<=7),\"Media\",IF(Tabla2[[#This Row],[Disponibilidad]]+Tabla2[[#This Row],[Integridad]]+Tabla2[[#This Row],[Confidencialidad ]]>=8,\"Alta\",\"error\")))","v":"Baja"}]
["",null,null,null,null,null,null,null,null,null,null,null,null,null,null,null,null,null,null,null,null,null,null,null,null,{"$f":"IF((Tabla2[[#This Row],[Disponibilidad]]+Tabla2[[#This Row],[Integridad]]+Tabla2[[#This Row],[Confidencialidad ]]<=4),\"Baja\",IF(AND(Tabla2[[#This Row],[Disponibilidad]]+Tabla2[[#This Row],[Integridad]]+Tabla2[[#This Row],[Confidencialidad ]]>=5,Tabla2[[#This Row],[Disponibilidad]]+Tabla2[[#This Row],[Integridad]]+Tabla2[[#This Row],[Confidencialidad ]]<=7),\"Media\",IF(Tabla2[[#This Row],[Disponibilidad]]+Tabla2[[#This Row],[Integridad]]+Tabla2[[#This Row],[Confidencialidad ]]>=8,\"Alta\",\"error\")))","v":"Baja"}]
["",null,null,null,null,null,null,null,null,null,null,null,null,null,null,null,null,null,null,null,null,null,null,null,null,{"$f":"IF((Tabla2[[#This Row],[Disponibilidad]]+Tabla2[[#This Row],[Integridad]]+Tabla2[[#This Row],[Confidencialidad ]]<=4),\"Baja\",IF(AND(Tabla2[[#This Row],[Disponibilidad]]+Tabla2[[#This Row],[Integridad]]+Tabla2[[#This Row],[Confidencialidad ]]>=5,Tabla2[[#This Row],[Disponibilidad]]+Tabla2[[#This Row],[Integridad]]+Tabla2[[#This Row],[Confidencialidad ]]<=7),\"Media\",IF(Tabla2[[#This Row],[Disponibilidad]]+Tabla2[[#This Row],[Integridad]]+Tabla2[[#This Row],[Confidencialidad ]]>=8,\"Alta\",\"error\")))","v":"Baja"}]
["",null,null,null,null,null,null,null,null,null,null,null,null,null,null,null,null,null,null,null,null,null,null,null,null,{"$f":"IF((Tabla2[[#This Row],[Disponibilidad]]+Tabla2[[#This Row],[Integridad]]+Tabla2[[#This Row],[Confidencialidad ]]<=4),\"Baja\",IF(AND(Tabla2[[#This Row],[Disponibilidad]]+Tabla2[[#This Row],[Integridad]]+Tabla2[[#This Row],[Confidencialidad ]]>=5,Tabla2[[#This Row],[Disponibilidad]]+Tabla2[[#This Row],[Integridad]]+Tabla2[[#This Row],[Confidencialidad ]]<=7),\"Media\",IF(Tabla2[[#This Row],[Disponibilidad]]+Tabla2[[#This Row],[Integridad]]+Tabla2[[#This Row],[Confidencialidad ]]>=8,\"Alta\",\"error\")))","v":"Baja"}]
["",null,null,null,null,null,null,null,null,null,null,null,null,null,null,null,null,null,null,null,null,null,null,null,null,{"$f":"IF((Tabla2[[#This Row],[Disponibilidad]]+Tabla2[[#This Row],[Integridad]]+Tabla2[[#This Row],[Confidencialidad ]]<=4),\"Baja\",IF(AND(Tabla2[[#This Row],[Disponibilidad]]+Tabla2[[#This Row],[Integridad]]+Tabla2[[#This Row],[Confidencialidad ]]>=5,Tabla2[[#This Row],[Disponibilidad]]+Tabla2[[#This Row],[Integridad]]+Tabla2[[#This Row],[Confidencialidad ]]<=7),\"Media\",IF(Tabla2[[#This Row],[Disponibilidad]]+Tabla2[[#This Row],[Integridad]]+Tabla2[[#This Row],[Confidencialidad ]]>=8,\"Alta\",\"error\")))","v":"Baja"}]
["",null,null,null,null,null,null,null,null,null,null,null,null,null,null,null,null,null,null,null,null,null,null,null,null,{"$f":"IF((Tabla2[[#This Row],[Disponibilidad]]+Tabla2[[#This Row],[Integridad]]+Tabla2[[#This Row],[Confidencialidad ]]<=4),\"Baja\",IF(AND(Tabla2[[#This Row],[Disponibilidad]]+Tabla2[[#This Row],[Integridad]]+Tabla2[[#This Row],[Confidencialidad ]]>=5,Tabla2[[#This Row],[Disponibilidad]]+Tabla2[[#This Row],[Integridad]]+Tabla2[[#This Row],[Confidencialidad ]]<=7),\"Media\",IF(Tabla2[[#This Row],[Disponibilidad]]+Tabla2[[#This Row],[Integridad]]+Tabla2[[#This Row],[Confidencialidad ]]>=8,\"Alta\",\"error\")))","v":"Baja"}]
["",null,null,null,null,null,null,null,null,null,null,null,null,null,null,null,null,null,null,null,null,null,null,null,null,{"$f":"IF((Tabla2[[#This Row],[Disponibilidad]]+Tabla2[[#This Row],[Integridad]]+Tabla2[[#This Row],[Confidencialidad ]]<=4),\"Baja\",IF(AND(Tabla2[[#This Row],[Disponibilidad]]+Tabla2[[#This Row],[Integridad]]+Tabla2[[#This Row],[Confidencialidad ]]>=5,Tabla2[[#This Row],[Disponibilidad]]+Tabla2[[#This Row],[Integridad]]+Tabla2[[#This Row],[Confidencialidad ]]<=7),\"Media\",IF(Tabla2[[#This Row],[Disponibilidad]]+Tabla2[[#This Row],[Integridad]]+Tabla2[[#This Row],[Confidencialidad ]]>=8,\"Alta\",\"error\")))","v":"Baja"}]
["",null,null,null,null,null,null,null,null,null,null,null,null,null,null,null,null,null,null,null,null,null,null,null,null,{"$f":"IF((Tabla2[[#This Row],[Disponibilidad]]+Tabla2[[#This Row],[Integridad]]+Tabla2[[#This Row],[Confidencialidad ]]<=4),\"Baja\",IF(AND(Tabla2[[#This Row],[Disponibilidad]]+Tabla2[[#This Row],[Integridad]]+Tabla2[[#This Row],[Confidencialidad ]]>=5,Tabla2[[#This Row],[Disponibilidad]]+Tabla2[[#This Row],[Integridad]]+Tabla2[[#This Row],[Confidencialidad ]]<=7),\"Media\",IF(Tabla2[[#This Row],[Disponibilidad]]+Tabla2[[#This Row],[Integridad]]+Tabla2[[#This Row],[Confidencialidad ]]>=8,\"Alta\",\"error\")))","v":"Baja"}]
["",null,null,null,null,null,null,null,null,null,null,null,null,null,null,null,null,null,null,null,null,null,null,null,null,{"$f":"IF((Tabla2[[#This Row],[Disponibilidad]]+Tabla2[[#This Row],[Integridad]]+Tabla2[[#This Row],[Confidencialidad ]]<=4),\"Baja\",IF(AND(Tabla2[[#This Row],[Disponibilidad]]+Tabla2[[#This Row],[Integridad]]+Tabla2[[#This Row],[Confidencialidad ]]>=5,Tabla2[[#This Row],[Disponibilidad]]+Tabla2[[#This Row],[Integridad]]+Tabla2[[#This Row],[Confidencialidad ]]<=7),\"Media\",IF(Tabla2[[#This Row],[Disponibilidad]]+Tabla2[[#This Row],[Integridad]]+Tabla2[[#This Row],[Confidencialidad ]]>=8,\"Alta\",\"error\")))","v":"Baja"}]
["",null,null,null,null,null,null,null,null,null,null,null,null,null,null,null,null,null,null,null,null,null,null,null,null,{"$f":"IF((Tabla2[[#This Row],[Disponibilidad]]+Tabla2[[#This Row],[Integridad]]+Tabla2[[#This Row],[Confidencialidad ]]<=4),\"Baja\",IF(AND(Tabla2[[#This Row],[Disponibilidad]]+Tabla2[[#This Row],[Integridad]]+Tabla2[[#This Row],[Confidencialidad ]]>=5,Tabla2[[#This Row],[Disponibilidad]]+Tabla2[[#This Row],[Integridad]]+Tabla2[[#This Row],[Confidencialidad ]]<=7),\"Media\",IF(Tabla2[[#This Row],[Disponibilidad]]+Tabla2[[#This Row],[Integridad]]+Tabla2[[#This Row],[Confidencialidad ]]>=8,\"Alta\",\"error\")))","v":"Baja"}]
["",null,null,null,null,null,null,null,null,null,null,null,null,null,null,null,null,null,null,null,null,null,null,null,null,{"$f":"IF((Tabla2[[#This Row],[Disponibilidad]]+Tabla2[[#This Row],[Integridad]]+Tabla2[[#This Row],[Confidencialidad ]]<=4),\"Baja\",IF(AND(Tabla2[[#This Row],[Disponibilidad]]+Tabla2[[#This Row],[Integridad]]+Tabla2[[#This Row],[Confidencialidad ]]>=5,Tabla2[[#This Row],[Disponibilidad]]+Tabla2[[#This Row],[Integridad]]+Tabla2[[#This Row],[Confidencialidad ]]<=7),\"Media\",IF(Tabla2[[#This Row],[Disponibilidad]]+Tabla2[[#This Row],[Integridad]]+Tabla2[[#This Row],[Confidencialidad ]]>=8,\"Alta\",\"error\")))","v":"Baja"}]
["",null,null,null,null,null,null,null,null,null,null,null,null,null,null,null,null,null,null,null,null,null,null,null,null,{"$f":"IF((Tabla2[[#This Row],[Disponibilidad]]+Tabla2[[#This Row],[Integridad]]+Tabla2[[#This Row],[Confidencialidad ]]<=4),\"Baja\",IF(AND(Tabla2[[#This Row],[Disponibilidad]]+Tabla2[[#This Row],[Integridad]]+Tabla2[[#This Row],[Confidencialidad ]]>=5,Tabla2[[#This Row],[Disponibilidad]]+Tabla2[[#This Row],[Integridad]]+Tabla2[[#This Row],[Confidencialidad ]]<=7),\"Media\",IF(Tabla2[[#This Row],[Disponibilidad]]+Tabla2[[#This Row],[Integridad]]+Tabla2[[#This Row],[Confidencialidad ]]>=8,\"Alta\",\"error\")))","v":"Baja"}]
["",null,null,null,null,null,null,null,null,null,null,null,null,null,null,null,null,null,null,null,null,null,null,null,null,{"$f":"IF((Tabla2[[#This Row],[Disponibilidad]]+Tabla2[[#This Row],[Integridad]]+Tabla2[[#This Row],[Confidencialidad ]]<=4),\"Baja\",IF(AND(Tabla2[[#This Row],[Disponibilidad]]+Tabla2[[#This Row],[Integridad]]+Tabla2[[#This Row],[Confidencialidad ]]>=5,Tabla2[[#This Row],[Disponibilidad]]+Tabla2[[#This Row],[Integridad]]+Tabla2[[#This Row],[Confidencialidad ]]<=7),\"Media\",IF(Tabla2[[#This Row],[Disponibilidad]]+Tabla2[[#This Row],[Integridad]]+Tabla2[[#This Row],[Confidencialidad ]]>=8,\"Alta\",\"error\")))","v":"Baja"}]
["",null,null,null,null,null,null,null,null,null,null,null,null,null,null,null,null,null,null,null,null,null,null,null,null,{"$f":"IF((Tabla2[[#This Row],[Disponibilidad]]+Tabla2[[#This Row],[Integridad]]+Tabla2[[#This Row],[Confidencialidad ]]<=4),\"Baja\",IF(AND(Tabla2[[#This Row],[Disponibilidad]]+Tabla2[[#This Row],[Integridad]]+Tabla2[[#This Row],[Confidencialidad ]]>=5,Tabla2[[#This Row],[Disponibilidad]]+Tabla2[[#This Row],[Integridad]]+Tabla2[[#This Row],[Confidencialidad ]]<=7),\"Media\",IF(Tabla2[[#This Row],[Disponibilidad]]+Tabla2[[#This Row],[Integridad]]+Tabla2[[#This Row],[Confidencialidad ]]>=8,\"Alta\",\"error\")))","v":"Baja"}]
[{"$f":"IF(C529<>\"\",1,\"\")","v":""},null,null,null,null,null,null,null,null,null,null,null,null,null,null,null,null,null,null,null,null,null,null,null,null,{"$f":"IF((Tabla2[[#This Row],[Disponibilidad]]+Tabla2[[#This Row],[Integridad]]+Tabla2[[#This Row],[Confidencialidad ]]<=4),\"Baja\",IF(AND(Tabla2[[#This Row],[Disponibilidad]]+Tabla2[[#This Row],[Integridad]]+Tabla2[[#This Row],[Confidencialidad ]]>=5,Tabla2[[#This Row],[Disponibilidad]]+Tabla2[[#This Row],[Integridad]]+Tabla2[[#This Row],[Confidencialidad ]]<=7),\"Media\",IF(Tabla2[[#This Row],[Disponibilidad]]+Tabla2[[#This Row],[Integridad]]+Tabla2[[#This Row],[Confidencialidad ]]>=8,\"Alta\",\"error\")))","v":"Baja"}]
["",null,null,null,null,null,null,null,null,null,null,null,null,null,null,null,null,null,null,null,null,null,null,null,null,{"$f":"IF((Tabla2[[#This Row],[Disponibilidad]]+Tabla2[[#This Row],[Integridad]]+Tabla2[[#This Row],[Confidencialidad ]]<=4),\"Baja\",IF(AND(Tabla2[[#This Row],[Disponibilidad]]+Tabla2[[#This Row],[Integridad]]+Tabla2[[#This Row],[Confidencialidad ]]>=5,Tabla2[[#This Row],[Disponibilidad]]+Tabla2[[#This Row],[Integridad]]+Tabla2[[#This Row],[Confidencialidad ]]<=7),\"Media\",IF(Tabla2[[#This Row],[Disponibilidad]]+Tabla2[[#This Row],[Integridad]]+Tabla2[[#This Row],[Confidencialidad ]]>=8,\"Alta\",\"error\")))","v":"Baja"}]
["",null,null,null,null,null,null,null,null,null,null,null,null,null,null,null,null,null,null,null,null,null,null,null,null,{"$f":"IF((Tabla2[[#This Row],[Disponibilidad]]+Tabla2[[#This Row],[Integridad]]+Tabla2[[#This Row],[Confidencialidad ]]<=4),\"Baja\",IF(AND(Tabla2[[#This Row],[Disponibilidad]]+Tabla2[[#This Row],[Integridad]]+Tabla2[[#This Row],[Confidencialidad ]]>=5,Tabla2[[#This Row],[Disponibilidad]]+Tabla2[[#This Row],[Integridad]]+Tabla2[[#This Row],[Confidencialidad ]]<=7),\"Media\",IF(Tabla2[[#This Row],[Disponibilidad]]+Tabla2[[#This Row],[Integridad]]+Tabla2[[#This Row],[Confidencialidad ]]>=8,\"Alta\",\"error\")))","v":"Baja"}]
["",null,null,null,null,null,null,null,null,null,null,null,null,null,null,null,null,null,null,null,null,null,null,null,null,{"$f":"IF((Tabla2[[#This Row],[Disponibilidad]]+Tabla2[[#This Row],[Integridad]]+Tabla2[[#This Row],[Confidencialidad ]]<=4),\"Baja\",IF(AND(Tabla2[[#This Row],[Disponibilidad]]+Tabla2[[#This Row],[Integridad]]+Tabla2[[#This Row],[Confidencialidad ]]>=5,Tabla2[[#This Row],[Disponibilidad]]+Tabla2[[#This Row],[Integridad]]+Tabla2[[#This Row],[Confidencialidad ]]<=7),\"Media\",IF(Tabla2[[#This Row],[Disponibilidad]]+Tabla2[[#This Row],[Integridad]]+Tabla2[[#This Row],[Confidencialidad ]]>=8,\"Alta\",\"error\")))","v":"Baja"}]
["",null,null,null,null,null,null,null,null,null,null,null,null,null,null,null,null,null,null,null,null,null,null,null,null,{"$f":"IF((Tabla2[[#This Row],[Disponibilidad]]+Tabla2[[#This Row],[Integridad]]+Tabla2[[#This Row],[Confidencialidad ]]<=4),\"Baja\",IF(AND(Tabla2[[#This Row],[Disponibilidad]]+Tabla2[[#This Row],[Integridad]]+Tabla2[[#This Row],[Confidencialidad ]]>=5,Tabla2[[#This Row],[Disponibilidad]]+Tabla2[[#This Row],[Integridad]]+Tabla2[[#This Row],[Confidencialidad ]]<=7),\"Media\",IF(Tabla2[[#This Row],[Disponibilidad]]+Tabla2[[#This Row],[Integridad]]+Tabla2[[#This Row],[Confidencialidad ]]>=8,\"Alta\",\"error\")))","v":"Baja"}]
["",null,null,null,null,null,null,null,null,null,null,null,null,null,null,null,null,null,null,null,null,null,null,null,null,{"$f":"IF((Tabla2[[#This Row],[Disponibilidad]]+Tabla2[[#This Row],[Integridad]]+Tabla2[[#This Row],[Confidencialidad ]]<=4),\"Baja\",IF(AND(Tabla2[[#This Row],[Disponibilidad]]+Tabla2[[#This Row],[Integridad]]+Tabla2[[#This Row],[Confidencialidad ]]>=5,Tabla2[[#This Row],[Disponibilidad]]+Tabla2[[#This Row],[Integridad]]+Tabla2[[#This Row],[Confidencialidad ]]<=7),\"Media\",IF(Tabla2[[#This Row],[Disponibilidad]]+Tabla2[[#This Row],[Integridad]]+Tabla2[[#This Row],[Confidencialidad ]]>=8,\"Alta\",\"error\")))","v":"Baja"}]
["",null,null,null,null,null,null,null,null,null,null,null,null,null,null,null,null,null,null,null,null,null,null,null,null,{"$f":"IF((Tabla2[[#This Row],[Disponibilidad]]+Tabla2[[#This Row],[Integridad]]+Tabla2[[#This Row],[Confidencialidad ]]<=4),\"Baja\",IF(AND(Tabla2[[#This Row],[Disponibilidad]]+Tabla2[[#This Row],[Integridad]]+Tabla2[[#This Row],[Confidencialidad ]]>=5,Tabla2[[#This Row],[Disponibilidad]]+Tabla2[[#This Row],[Integridad]]+Tabla2[[#This Row],[Confidencialidad ]]<=7),\"Media\",IF(Tabla2[[#This Row],[Disponibilidad]]+Tabla2[[#This Row],[Integridad]]+Tabla2[[#This Row],[Confidencialidad ]]>=8,\"Alta\",\"error\")))","v":"Baja"}]
["",null,null,null,null,null,null,null,null,null,null,null,null,null,null,null,null,null,null,null,null,null,null,null,null,{"$f":"IF((Tabla2[[#This Row],[Disponibilidad]]+Tabla2[[#This Row],[Integridad]]+Tabla2[[#This Row],[Confidencialidad ]]<=4),\"Baja\",IF(AND(Tabla2[[#This Row],[Disponibilidad]]+Tabla2[[#This Row],[Integridad]]+Tabla2[[#This Row],[Confidencialidad ]]>=5,Tabla2[[#This Row],[Disponibilidad]]+Tabla2[[#This Row],[Integridad]]+Tabla2[[#This Row],[Confidencialidad ]]<=7),\"Media\",IF(Tabla2[[#This Row],[Disponibilidad]]+Tabla2[[#This Row],[Integridad]]+Tabla2[[#This Row],[Confidencialidad ]]>=8,\"Alta\",\"error\")))","v":"Baja"}]
["",null,null,null,null,null,null,null,null,null,null,null,null,null,null,null,null,null,null,null,null,null,null,null,null,{"$f":"IF((Tabla2[[#This Row],[Disponibilidad]]+Tabla2[[#This Row],[Integridad]]+Tabla2[[#This Row],[Confidencialidad ]]<=4),\"Baja\",IF(AND(Tabla2[[#This Row],[Disponibilidad]]+Tabla2[[#This Row],[Integridad]]+Tabla2[[#This Row],[Confidencialidad ]]>=5,Tabla2[[#This Row],[Disponibilidad]]+Tabla2[[#This Row],[Integridad]]+Tabla2[[#This Row],[Confidencialidad ]]<=7),\"Media\",IF(Tabla2[[#This Row],[Disponibilidad]]+Tabla2[[#This Row],[Integridad]]+Tabla2[[#This Row],[Confidencialidad ]]>=8,\"Alta\",\"error\")))","v":"Baja"}]
["",null,null,null,null,null,null,null,null,null,null,null,null,null,null,null,null,null,null,null,null,null,null,null,null,{"$f":"IF((Tabla2[[#This Row],[Disponibilidad]]+Tabla2[[#This Row],[Integridad]]+Tabla2[[#This Row],[Confidencialidad ]]<=4),\"Baja\",IF(AND(Tabla2[[#This Row],[Disponibilidad]]+Tabla2[[#This Row],[Integridad]]+Tabla2[[#This Row],[Confidencialidad ]]>=5,Tabla2[[#This Row],[Disponibilidad]]+Tabla2[[#This Row],[Integridad]]+Tabla2[[#This Row],[Confidencialidad ]]<=7),\"Media\",IF(Tabla2[[#This Row],[Disponibilidad]]+Tabla2[[#This Row],[Integridad]]+Tabla2[[#This Row],[Confidencialidad ]]>=8,\"Alta\",\"error\")))","v":"Baja"}]
["",null,null,null,null,null,null,null,null,null,null,null,null,null,null,null,null,null,null,null,null,null,null,null,null,{"$f":"IF((Tabla2[[#This Row],[Disponibilidad]]+Tabla2[[#This Row],[Integridad]]+Tabla2[[#This Row],[Confidencialidad ]]<=4),\"Baja\",IF(AND(Tabla2[[#This Row],[Disponibilidad]]+Tabla2[[#This Row],[Integridad]]+Tabla2[[#This Row],[Confidencialidad ]]>=5,Tabla2[[#This Row],[Disponibilidad]]+Tabla2[[#This Row],[Integridad]]+Tabla2[[#This Row],[Confidencialidad ]]<=7),\"Media\",IF(Tabla2[[#This Row],[Disponibilidad]]+Tabla2[[#This Row],[Integridad]]+Tabla2[[#This Row],[Confidencialidad ]]>=8,\"Alta\",\"error\")))","v":"Baja"}]
["",null,null,null,null,null,null,null,null,null,null,null,null,null,null,null,null,null,null,null,null,null,null,null,null,{"$f":"IF((Tabla2[[#This Row],[Disponibilidad]]+Tabla2[[#This Row],[Integridad]]+Tabla2[[#This Row],[Confidencialidad ]]<=4),\"Baja\",IF(AND(Tabla2[[#This Row],[Disponibilidad]]+Tabla2[[#This Row],[Integridad]]+Tabla2[[#This Row],[Confidencialidad ]]>=5,Tabla2[[#This Row],[Disponibilidad]]+Tabla2[[#This Row],[Integridad]]+Tabla2[[#This Row],[Confidencialidad ]]<=7),\"Media\",IF(Tabla2[[#This Row],[Disponibilidad]]+Tabla2[[#This Row],[Integridad]]+Tabla2[[#This Row],[Confidencialidad ]]>=8,\"Alta\",\"error\")))","v":"Baja"}]
["",null,null,null,null,null,null,null,null,null,null,null,null,null,null,null,null,null,null,null,null,null,null,null,null,{"$f":"IF((Tabla2[[#This Row],[Disponibilidad]]+Tabla2[[#This Row],[Integridad]]+Tabla2[[#This Row],[Confidencialidad ]]<=4),\"Baja\",IF(AND(Tabla2[[#This Row],[Disponibilidad]]+Tabla2[[#This Row],[Integridad]]+Tabla2[[#This Row],[Confidencialidad ]]>=5,Tabla2[[#This Row],[Disponibilidad]]+Tabla2[[#This Row],[Integridad]]+Tabla2[[#This Row],[Confidencialidad ]]<=7),\"Media\",IF(Tabla2[[#This Row],[Disponibilidad]]+Tabla2[[#This Row],[Integridad]]+Tabla2[[#This Row],[Confidencialidad ]]>=8,\"Alta\",\"error\")))","v":"Baja"}]
["",null,null,null,null,null,null,null,null,null,null,null,null,null,null,null,null,null,null,null,null,null,null,null,null,{"$f":"IF((Tabla2[[#This Row],[Disponibilidad]]+Tabla2[[#This Row],[Integridad]]+Tabla2[[#This Row],[Confidencialidad ]]<=4),\"Baja\",IF(AND(Tabla2[[#This Row],[Disponibilidad]]+Tabla2[[#This Row],[Integridad]]+Tabla2[[#This Row],[Confidencialidad ]]>=5,Tabla2[[#This Row],[Disponibilidad]]+Tabla2[[#This Row],[Integridad]]+Tabla2[[#This Row],[Confidencialidad ]]<=7),\"Media\",IF(Tabla2[[#This Row],[Disponibilidad]]+Tabla2[[#This Row],[Integridad]]+Tabla2[[#This Row],[Confidencialidad ]]>=8,\"Alta\",\"error\")))","v":"Baja"}]
["",null,null,null,null,null,null,null,null,null,null,null,null,null,null,null,null,null,null,null,null,null,null,null,null,{"$f":"IF((Tabla2[[#This Row],[Disponibilidad]]+Tabla2[[#This Row],[Integridad]]+Tabla2[[#This Row],[Confidencialidad ]]<=4),\"Baja\",IF(AND(Tabla2[[#This Row],[Disponibilidad]]+Tabla2[[#This Row],[Integridad]]+Tabla2[[#This Row],[Confidencialidad ]]>=5,Tabla2[[#This Row],[Disponibilidad]]+Tabla2[[#This Row],[Integridad]]+Tabla2[[#This Row],[Confidencialidad ]]<=7),\"Media\",IF(Tabla2[[#This Row],[Disponibilidad]]+Tabla2[[#This Row],[Integridad]]+Tabla2[[#This Row],[Confidencialidad ]]>=8,\"Alta\",\"error\")))","v":"Baja"}]
["",null,null,null,null,null,null,null,null,null,null,null,null,null,null,null,null,null,null,null,null,null,null,null,null,{"$f":"IF((Tabla2[[#This Row],[Disponibilidad]]+Tabla2[[#This Row],[Integridad]]+Tabla2[[#This Row],[Confidencialidad ]]<=4),\"Baja\",IF(AND(Tabla2[[#This Row],[Disponibilidad]]+Tabla2[[#This Row],[Integridad]]+Tabla2[[#This Row],[Confidencialidad ]]>=5,Tabla2[[#This Row],[Disponibilidad]]+Tabla2[[#This Row],[Integridad]]+Tabla2[[#This Row],[Confidencialidad ]]<=7),\"Media\",IF(Tabla2[[#This Row],[Disponibilidad]]+Tabla2[[#This Row],[Integridad]]+Tabla2[[#This Row],[Confidencialidad ]]>=8,\"Alta\",\"error\")))","v":"Baja"}]
["",null,null,null,null,null,null,null,null,null,null,null,null,null,null,null,null,null,null,null,null,null,null,null,null,{"$f":"IF((Tabla2[[#This Row],[Disponibilidad]]+Tabla2[[#This Row],[Integridad]]+Tabla2[[#This Row],[Confidencialidad ]]<=4),\"Baja\",IF(AND(Tabla2[[#This Row],[Disponibilidad]]+Tabla2[[#This Row],[Integridad]]+Tabla2[[#This Row],[Confidencialidad ]]>=5,Tabla2[[#This Row],[Disponibilidad]]+Tabla2[[#This Row],[Integridad]]+Tabla2[[#This Row],[Confidencialidad ]]<=7),\"Media\",IF(Tabla2[[#This Row],[Disponibilidad]]+Tabla2[[#This Row],[Integridad]]+Tabla2[[#This Row],[Confidencialidad ]]>=8,\"Alta\",\"error\")))","v":"Baja"}]
["",null,null,null,null,null,null,null,null,null,null,null,null,null,null,null,null,null,null,null,null,null,null,null,null,{"$f":"IF((Tabla2[[#This Row],[Disponibilidad]]+Tabla2[[#This Row],[Integridad]]+Tabla2[[#This Row],[Confidencialidad ]]<=4),\"Baja\",IF(AND(Tabla2[[#This Row],[Disponibilidad]]+Tabla2[[#This Row],[Integridad]]+Tabla2[[#This Row],[Confidencialidad ]]>=5,Tabla2[[#This Row],[Disponibilidad]]+Tabla2[[#This Row],[Integridad]]+Tabla2[[#This Row],[Confidencialidad ]]<=7),\"Media\",IF(Tabla2[[#This Row],[Disponibilidad]]+Tabla2[[#This Row],[Integridad]]+Tabla2[[#This Row],[Confidencialidad ]]>=8,\"Alta\",\"error\")))","v":"Baja"}]
["",null,null,null,null,null,null,null,null,null,null,null,null,null,null,null,null,null,null,null,null,null,null,null,null,{"$f":"IF((Tabla2[[#This Row],[Disponibilidad]]+Tabla2[[#This Row],[Integridad]]+Tabla2[[#This Row],[Confidencialidad ]]<=4),\"Baja\",IF(AND(Tabla2[[#This Row],[Disponibilidad]]+Tabla2[[#This Row],[Integridad]]+Tabla2[[#This Row],[Confidencialidad ]]>=5,Tabla2[[#This Row],[Disponibilidad]]+Tabla2[[#This Row],[Integridad]]+Tabla2[[#This Row],[Confidencialidad ]]<=7),\"Media\",IF(Tabla2[[#This Row],[Disponibilidad]]+Tabla2[[#This Row],[Integridad]]+Tabla2[[#This Row],[Confidencialidad ]]>=8,\"Alta\",\"error\")))","v":"Baja"}]
["",null,null,null,null,null,null,null,null,null,null,null,null,null,null,null,null,null,null,null,null,null,null,null,null,{"$f":"IF((Tabla2[[#This Row],[Disponibilidad]]+Tabla2[[#This Row],[Integridad]]+Tabla2[[#This Row],[Confidencialidad ]]<=4),\"Baja\",IF(AND(Tabla2[[#This Row],[Disponibilidad]]+Tabla2[[#This Row],[Integridad]]+Tabla2[[#This Row],[Confidencialidad ]]>=5,Tabla2[[#This Row],[Disponibilidad]]+Tabla2[[#This Row],[Integridad]]+Tabla2[[#This Row],[Confidencialidad ]]<=7),\"Media\",IF(Tabla2[[#This Row],[Disponibilidad]]+Tabla2[[#This Row],[Integridad]]+Tabla2[[#This Row],[Confidencialidad ]]>=8,\"Alta\",\"error\")))","v":"Baja"}]
["",null,null,null,null,null,null,null,null,null,null,null,null,null,null,null,null,null,null,null,null,null,null,null,null,{"$f":"IF((Tabla2[[#This Row],[Disponibilidad]]+Tabla2[[#This Row],[Integridad]]+Tabla2[[#This Row],[Confidencialidad ]]<=4),\"Baja\",IF(AND(Tabla2[[#This Row],[Disponibilidad]]+Tabla2[[#This Row],[Integridad]]+Tabla2[[#This Row],[Confidencialidad ]]>=5,Tabla2[[#This Row],[Disponibilidad]]+Tabla2[[#This Row],[Integridad]]+Tabla2[[#This Row],[Confidencialidad ]]<=7),\"Media\",IF(Tabla2[[#This Row],[Disponibilidad]]+Tabla2[[#This Row],[Integridad]]+Tabla2[[#This Row],[Confidencialidad ]]>=8,\"Alta\",\"error\")))","v":"Baja"}]
["",null,null,null,null,null,null,null,null,null,null,null,null,null,null,null,null,null,null,null,null,null,null,null,null,{"$f":"IF((Tabla2[[#This Row],[Disponibilidad]]+Tabla2[[#This Row],[Integridad]]+Tabla2[[#This Row],[Confidencialidad ]]<=4),\"Baja\",IF(AND(Tabla2[[#This Row],[Disponibilidad]]+Tabla2[[#This Row],[Integridad]]+Tabla2[[#This Row],[Confidencialidad ]]>=5,Tabla2[[#This Row],[Disponibilidad]]+Tabla2[[#This Row],[Integridad]]+Tabla2[[#This Row],[Confidencialidad ]]<=7),\"Media\",IF(Tabla2[[#This Row],[Disponibilidad]]+Tabla2[[#This Row],[Integridad]]+Tabla2[[#This Row],[Confidencialidad ]]>=8,\"Alta\",\"error\")))","v":"Baja"}]
["",null,null,null,null,null,null,null,null,null,null,null,null,null,null,null,null,null,null,null,null,null,null,null,null,{"$f":"IF((Tabla2[[#This Row],[Disponibilidad]]+Tabla2[[#This Row],[Integridad]]+Tabla2[[#This Row],[Confidencialidad ]]<=4),\"Baja\",IF(AND(Tabla2[[#This Row],[Disponibilidad]]+Tabla2[[#This Row],[Integridad]]+Tabla2[[#This Row],[Confidencialidad ]]>=5,Tabla2[[#This Row],[Disponibilidad]]+Tabla2[[#This Row],[Integridad]]+Tabla2[[#This Row],[Confidencialidad ]]<=7),\"Media\",IF(Tabla2[[#This Row],[Disponibilidad]]+Tabla2[[#This Row],[Integridad]]+Tabla2[[#This Row],[Confidencialidad ]]>=8,\"Alta\",\"error\")))","v":"Baja"}]
["",null,null,null,null,null,null,null,null,null,null,null,null,null,null,null,null,null,null,null,null,null,null,null,null,{"$f":"IF((Tabla2[[#This Row],[Disponibilidad]]+Tabla2[[#This Row],[Integridad]]+Tabla2[[#This Row],[Confidencialidad ]]<=4),\"Baja\",IF(AND(Tabla2[[#This Row],[Disponibilidad]]+Tabla2[[#This Row],[Integridad]]+Tabla2[[#This Row],[Confidencialidad ]]>=5,Tabla2[[#This Row],[Disponibilidad]]+Tabla2[[#This Row],[Integridad]]+Tabla2[[#This Row],[Confidencialidad ]]<=7),\"Media\",IF(Tabla2[[#This Row],[Disponibilidad]]+Tabla2[[#This Row],[Integridad]]+Tabla2[[#This Row],[Confidencialidad ]]>=8,\"Alta\",\"error\")))","v":"Baja"}]
["",null,null,null,null,null,null,null,null,null,null,null,null,null,null,null,null,null,null,null,null,null,null,null,null,{"$f":"IF((Tabla2[[#This Row],[Disponibilidad]]+Tabla2[[#This Row],[Integridad]]+Tabla2[[#This Row],[Confidencialidad ]]<=4),\"Baja\",IF(AND(Tabla2[[#This Row],[Disponibilidad]]+Tabla2[[#This Row],[Integridad]]+Tabla2[[#This Row],[Confidencialidad ]]>=5,Tabla2[[#This Row],[Disponibilidad]]+Tabla2[[#This Row],[Integridad]]+Tabla2[[#This Row],[Confidencialidad ]]<=7),\"Media\",IF(Tabla2[[#This Row],[Disponibilidad]]+Tabla2[[#This Row],[Integridad]]+Tabla2[[#This Row],[Confidencialidad ]]>=8,\"Alta\",\"error\")))","v":"Baja"}]
["",null,null,null,null,null,null,null,null,null,null,null,null,null,null,null,null,null,null,null,null,null,null,null,null,{"$f":"IF((Tabla2[[#This Row],[Disponibilidad]]+Tabla2[[#This Row],[Integridad]]+Tabla2[[#This Row],[Confidencialidad ]]<=4),\"Baja\",IF(AND(Tabla2[[#This Row],[Disponibilidad]]+Tabla2[[#This Row],[Integridad]]+Tabla2[[#This Row],[Confidencialidad ]]>=5,Tabla2[[#This Row],[Disponibilidad]]+Tabla2[[#This Row],[Integridad]]+Tabla2[[#This Row],[Confidencialidad ]]<=7),\"Media\",IF(Tabla2[[#This Row],[Disponibilidad]]+Tabla2[[#This Row],[Integridad]]+Tabla2[[#This Row],[Confidencialidad ]]>=8,\"Alta\",\"error\")))","v":"Baja"}]
["",null,null,null,null,null,null,null,null,null,null,null,null,null,null,null,null,null,null,null,null,null,null,null,null,{"$f":"IF((Tabla2[[#This Row],[Disponibilidad]]+Tabla2[[#This Row],[Integridad]]+Tabla2[[#This Row],[Confidencialidad ]]<=4),\"Baja\",IF(AND(Tabla2[[#This Row],[Disponibilidad]]+Tabla2[[#This Row],[Integridad]]+Tabla2[[#This Row],[Confidencialidad ]]>=5,Tabla2[[#This Row],[Disponibilidad]]+Tabla2[[#This Row],[Integridad]]+Tabla2[[#This Row],[Confidencialidad ]]<=7),\"Media\",IF(Tabla2[[#This Row],[Disponibilidad]]+Tabla2[[#This Row],[Integridad]]+Tabla2[[#This Row],[Confidencialidad ]]>=8,\"Alta\",\"error\")))","v":"Baja"}]
["",null,null,null,null,null,null,null,null,null,null,null,null,null,null,null,null,null,null,null,null,null,null,null,null,{"$f":"IF((Tabla2[[#This Row],[Disponibilidad]]+Tabla2[[#This Row],[Integridad]]+Tabla2[[#This Row],[Confidencialidad ]]<=4),\"Baja\",IF(AND(Tabla2[[#This Row],[Disponibilidad]]+Tabla2[[#This Row],[Integridad]]+Tabla2[[#This Row],[Confidencialidad ]]>=5,Tabla2[[#This Row],[Disponibilidad]]+Tabla2[[#This Row],[Integridad]]+Tabla2[[#This Row],[Confidencialidad ]]<=7),\"Media\",IF(Tabla2[[#This Row],[Disponibilidad]]+Tabla2[[#This Row],[Integridad]]+Tabla2[[#This Row],[Confidencialidad ]]>=8,\"Alta\",\"error\")))","v":"Baja"}]
["",null,null,null,null,null,null,null,null,null,null,null,null,null,null,null,null,null,null,null,null,null,null,null,null,{"$f":"IF((Tabla2[[#This Row],[Disponibilidad]]+Tabla2[[#This Row],[Integridad]]+Tabla2[[#This Row],[Confidencialidad ]]<=4),\"Baja\",IF(AND(Tabla2[[#This Row],[Disponibilidad]]+Tabla2[[#This Row],[Integridad]]+Tabla2[[#This Row],[Confidencialidad ]]>=5,Tabla2[[#This Row],[Disponibilidad]]+Tabla2[[#This Row],[Integridad]]+Tabla2[[#This Row],[Confidencialidad ]]<=7),\"Media\",IF(Tabla2[[#This Row],[Disponibilidad]]+Tabla2[[#This Row],[Integridad]]+Tabla2[[#This Row],[Confidencialidad ]]>=8,\"Alta\",\"error\")))","v":"Baja"}]
["",null,null,null,null,null,null,null,null,null,null,null,null,null,null,null,null,null,null,null,null,null,null,null,null,{"$f":"IF((Tabla2[[#This Row],[Disponibilidad]]+Tabla2[[#This Row],[Integridad]]+Tabla2[[#This Row],[Confidencialidad ]]<=4),\"Baja\",IF(AND(Tabla2[[#This Row],[Disponibilidad]]+Tabla2[[#This Row],[Integridad]]+Tabla2[[#This Row],[Confidencialidad ]]>=5,Tabla2[[#This Row],[Disponibilidad]]+Tabla2[[#This Row],[Integridad]]+Tabla2[[#This Row],[Confidencialidad ]]<=7),\"Media\",IF(Tabla2[[#This Row],[Disponibilidad]]+Tabla2[[#This Row],[Integridad]]+Tabla2[[#This Row],[Confidencialidad ]]>=8,\"Alta\",\"error\")))","v":"Baja"}]
["",null,null,null,null,null,null,null,null,null,null,null,null,null,null,null,null,null,null,null,null,null,null,null,null,{"$f":"IF((Tabla2[[#This Row],[Disponibilidad]]+Tabla2[[#This Row],[Integridad]]+Tabla2[[#This Row],[Confidencialidad ]]<=4),\"Baja\",IF(AND(Tabla2[[#This Row],[Disponibilidad]]+Tabla2[[#This Row],[Integridad]]+Tabla2[[#This Row],[Confidencialidad ]]>=5,Tabla2[[#This Row],[Disponibilidad]]+Tabla2[[#This Row],[Integridad]]+Tabla2[[#This Row],[Confidencialidad ]]<=7),\"Media\",IF(Tabla2[[#This Row],[Disponibilidad]]+Tabla2[[#This Row],[Integridad]]+Tabla2[[#This Row],[Confidencialidad ]]>=8,\"Alta\",\"error\")))","v":"Baja"}]
["",null,null,null,null,null,null,null,null,null,null,null,null,null,null,null,null,null,null,null,null,null,null,null,null,{"$f":"IF((Tabla2[[#This Row],[Disponibilidad]]+Tabla2[[#This Row],[Integridad]]+Tabla2[[#This Row],[Confidencialidad ]]<=4),\"Baja\",IF(AND(Tabla2[[#This Row],[Disponibilidad]]+Tabla2[[#This Row],[Integridad]]+Tabla2[[#This Row],[Confidencialidad ]]>=5,Tabla2[[#This Row],[Disponibilidad]]+Tabla2[[#This Row],[Integridad]]+Tabla2[[#This Row],[Confidencialidad ]]<=7),\"Media\",IF(Tabla2[[#This Row],[Disponibilidad]]+Tabla2[[#This Row],[Integridad]]+Tabla2[[#This Row],[Confidencialidad ]]>=8,\"Alta\",\"error\")))","v":"Baja"}]
[{"$f":"IF(C561<>\"\",1,\"\")","v":""},null,null,null,null,null,null,null,null,null,null,null,null,null,null,null,null,null,null,null,null,null,null,null,null,{"$f":"IF((Tabla2[[#This Row],[Disponibilidad]]+Tabla2[[#This Row],[Integridad]]+Tabla2[[#This Row],[Confidencialidad ]]<=4),\"Baja\",IF(AND(Tabla2[[#This Row],[Disponibilidad]]+Tabla2[[#This Row],[Integridad]]+Tabla2[[#This Row],[Confidencialidad ]]>=5,Tabla2[[#This Row],[Disponibilidad]]+Tabla2[[#This Row],[Integridad]]+Tabla2[[#This Row],[Confidencialidad ]]<=7),\"Media\",IF(Tabla2[[#This Row],[Disponibilidad]]+Tabla2[[#This Row],[Integridad]]+Tabla2[[#This Row],[Confidencialidad ]]>=8,\"Alta\",\"error\")))","v":"Baja"}]
["",null,null,null,null,null,null,null,null,null,null,null,null,null,null,null,null,null,null,null,null,null,null,null,null,{"$f":"IF((Tabla2[[#This Row],[Disponibilidad]]+Tabla2[[#This Row],[Integridad]]+Tabla2[[#This Row],[Confidencialidad ]]<=4),\"Baja\",IF(AND(Tabla2[[#This Row],[Disponibilidad]]+Tabla2[[#This Row],[Integridad]]+Tabla2[[#This Row],[Confidencialidad ]]>=5,Tabla2[[#This Row],[Disponibilidad]]+Tabla2[[#This Row],[Integridad]]+Tabla2[[#This Row],[Confidencialidad ]]<=7),\"Media\",IF(Tabla2[[#This Row],[Disponibilidad]]+Tabla2[[#This Row],[Integridad]]+Tabla2[[#This Row],[Confidencialidad ]]>=8,\"Alta\",\"error\")))","v":"Baja"}]
["",null,null,null,null,null,null,null,null,null,null,null,null,null,null,null,null,null,null,null,null,null,null,null,null,{"$f":"IF((Tabla2[[#This Row],[Disponibilidad]]+Tabla2[[#This Row],[Integridad]]+Tabla2[[#This Row],[Confidencialidad ]]<=4),\"Baja\",IF(AND(Tabla2[[#This Row],[Disponibilidad]]+Tabla2[[#This Row],[Integridad]]+Tabla2[[#This Row],[Confidencialidad ]]>=5,Tabla2[[#This Row],[Disponibilidad]]+Tabla2[[#This Row],[Integridad]]+Tabla2[[#This Row],[Confidencialidad ]]<=7),\"Media\",IF(Tabla2[[#This Row],[Disponibilidad]]+Tabla2[[#This Row],[Integridad]]+Tabla2[[#This Row],[Confidencialidad ]]>=8,\"Alta\",\"error\")))","v":"Baja"}]
["",null,null,null,null,null,null,null,null,null,null,null,null,null,null,null,null,null,null,null,null,null,null,null,null,{"$f":"IF((Tabla2[[#This Row],[Disponibilidad]]+Tabla2[[#This Row],[Integridad]]+Tabla2[[#This Row],[Confidencialidad ]]<=4),\"Baja\",IF(AND(Tabla2[[#This Row],[Disponibilidad]]+Tabla2[[#This Row],[Integridad]]+Tabla2[[#This Row],[Confidencialidad ]]>=5,Tabla2[[#This Row],[Disponibilidad]]+Tabla2[[#This Row],[Integridad]]+Tabla2[[#This Row],[Confidencialidad ]]<=7),\"Media\",IF(Tabla2[[#This Row],[Disponibilidad]]+Tabla2[[#This Row],[Integridad]]+Tabla2[[#This Row],[Confidencialidad ]]>=8,\"Alta\",\"error\")))","v":"Baja"}]
["",null,null,null,null,null,null,null,null,null,null,null,null,null,null,null,null,null,null,null,null,null,null,null,null,{"$f":"IF((Tabla2[[#This Row],[Disponibilidad]]+Tabla2[[#This Row],[Integridad]]+Tabla2[[#This Row],[Confidencialidad ]]<=4),\"Baja\",IF(AND(Tabla2[[#This Row],[Disponibilidad]]+Tabla2[[#This Row],[Integridad]]+Tabla2[[#This Row],[Confidencialidad ]]>=5,Tabla2[[#This Row],[Disponibilidad]]+Tabla2[[#This Row],[Integridad]]+Tabla2[[#This Row],[Confidencialidad ]]<=7),\"Media\",IF(Tabla2[[#This Row],[Disponibilidad]]+Tabla2[[#This Row],[Integridad]]+Tabla2[[#This Row],[Confidencialidad ]]>=8,\"Alta\",\"error\")))","v":"Baja"}]
["",null,null,null,null,null,null,null,null,null,null,null,null,null,null,null,null,null,null,null,null,null,null,null,null,{"$f":"IF((Tabla2[[#This Row],[Disponibilidad]]+Tabla2[[#This Row],[Integridad]]+Tabla2[[#This Row],[Confidencialidad ]]<=4),\"Baja\",IF(AND(Tabla2[[#This Row],[Disponibilidad]]+Tabla2[[#This Row],[Integridad]]+Tabla2[[#This Row],[Confidencialidad ]]>=5,Tabla2[[#This Row],[Disponibilidad]]+Tabla2[[#This Row],[Integridad]]+Tabla2[[#This Row],[Confidencialidad ]]<=7),\"Media\",IF(Tabla2[[#This Row],[Disponibilidad]]+Tabla2[[#This Row],[Integridad]]+Tabla2[[#This Row],[Confidencialidad ]]>=8,\"Alta\",\"error\")))","v":"Baja"}]
["",null,null,null,null,null,null,null,null,null,null,null,null,null,null,null,null,null,null,null,null,null,null,null,null,{"$f":"IF((Tabla2[[#This Row],[Disponibilidad]]+Tabla2[[#This Row],[Integridad]]+Tabla2[[#This Row],[Confidencialidad ]]<=4),\"Baja\",IF(AND(Tabla2[[#This Row],[Disponibilidad]]+Tabla2[[#This Row],[Integridad]]+Tabla2[[#This Row],[Confidencialidad ]]>=5,Tabla2[[#This Row],[Disponibilidad]]+Tabla2[[#This Row],[Integridad]]+Tabla2[[#This Row],[Confidencialidad ]]<=7),\"Media\",IF(Tabla2[[#This Row],[Disponibilidad]]+Tabla2[[#This Row],[Integridad]]+Tabla2[[#This Row],[Confidencialidad ]]>=8,\"Alta\",\"error\")))","v":"Baja"}]
["",null,null,null,null,null,null,null,null,null,null,null,null,null,null,null,null,null,null,null,null,null,null,null,null,{"$f":"IF((Tabla2[[#This Row],[Disponibilidad]]+Tabla2[[#This Row],[Integridad]]+Tabla2[[#This Row],[Confidencialidad ]]<=4),\"Baja\",IF(AND(Tabla2[[#This Row],[Disponibilidad]]+Tabla2[[#This Row],[Integridad]]+Tabla2[[#This Row],[Confidencialidad ]]>=5,Tabla2[[#This Row],[Disponibilidad]]+Tabla2[[#This Row],[Integridad]]+Tabla2[[#This Row],[Confidencialidad ]]<=7),\"Media\",IF(Tabla2[[#This Row],[Disponibilidad]]+Tabla2[[#This Row],[Integridad]]+Tabla2[[#This Row],[Confidencialidad ]]>=8,\"Alta\",\"error\")))","v":"Baja"}]
["",null,null,null,null,null,null,null,null,null,null,null,null,null,null,null,null,null,null,null,null,null,null,null,null,{"$f":"IF((Tabla2[[#This Row],[Disponibilidad]]+Tabla2[[#This Row],[Integridad]]+Tabla2[[#This Row],[Confidencialidad ]]<=4),\"Baja\",IF(AND(Tabla2[[#This Row],[Disponibilidad]]+Tabla2[[#This Row],[Integridad]]+Tabla2[[#This Row],[Confidencialidad ]]>=5,Tabla2[[#This Row],[Disponibilidad]]+Tabla2[[#This Row],[Integridad]]+Tabla2[[#This Row],[Confidencialidad ]]<=7),\"Media\",IF(Tabla2[[#This Row],[Disponibilidad]]+Tabla2[[#This Row],[Integridad]]+Tabla2[[#This Row],[Confidencialidad ]]>=8,\"Alta\",\"error\")))","v":"Baja"}]
["",null,null,null,null,null,null,null,null,null,null,null,null,null,null,null,null,null,null,null,null,null,null,null,null,{"$f":"IF((Tabla2[[#This Row],[Disponibilidad]]+Tabla2[[#This Row],[Integridad]]+Tabla2[[#This Row],[Confidencialidad ]]<=4),\"Baja\",IF(AND(Tabla2[[#This Row],[Disponibilidad]]+Tabla2[[#This Row],[Integridad]]+Tabla2[[#This Row],[Confidencialidad ]]>=5,Tabla2[[#This Row],[Disponibilidad]]+Tabla2[[#This Row],[Integridad]]+Tabla2[[#This Row],[Confidencialidad ]]<=7),\"Media\",IF(Tabla2[[#This Row],[Disponibilidad]]+Tabla2[[#This Row],[Integridad]]+Tabla2[[#This Row],[Confidencialidad ]]>=8,\"Alta\",\"error\")))","v":"Baja"}]
["",null,null,null,null,null,null,null,null,null,null,null,null,null,null,null,null,null,null,null,null,null,null,null,null,{"$f":"IF((Tabla2[[#This Row],[Disponibilidad]]+Tabla2[[#This Row],[Integridad]]+Tabla2[[#This Row],[Confidencialidad ]]<=4),\"Baja\",IF(AND(Tabla2[[#This Row],[Disponibilidad]]+Tabla2[[#This Row],[Integridad]]+Tabla2[[#This Row],[Confidencialidad ]]>=5,Tabla2[[#This Row],[Disponibilidad]]+Tabla2[[#This Row],[Integridad]]+Tabla2[[#This Row],[Confidencialidad ]]<=7),\"Media\",IF(Tabla2[[#This Row],[Disponibilidad]]+Tabla2[[#This Row],[Integridad]]+Tabla2[[#This Row],[Confidencialidad ]]>=8,\"Alta\",\"error\")))","v":"Baja"}]
["",null,null,null,null,null,null,null,null,null,null,null,null,null,null,null,null,null,null,null,null,null,null,null,null,{"$f":"IF((Tabla2[[#This Row],[Disponibilidad]]+Tabla2[[#This Row],[Integridad]]+Tabla2[[#This Row],[Confidencialidad ]]<=4),\"Baja\",IF(AND(Tabla2[[#This Row],[Disponibilidad]]+Tabla2[[#This Row],[Integridad]]+Tabla2[[#This Row],[Confidencialidad ]]>=5,Tabla2[[#This Row],[Disponibilidad]]+Tabla2[[#This Row],[Integridad]]+Tabla2[[#This Row],[Confidencialidad ]]<=7),\"Media\",IF(Tabla2[[#This Row],[Disponibilidad]]+Tabla2[[#This Row],[Integridad]]+Tabla2[[#This Row],[Confidencialidad ]]>=8,\"Alta\",\"error\")))","v":"Baja"}]
["",null,null,null,null,null,null,null,null,null,null,null,null,null,null,null,null,null,null,null,null,null,null,null,null,{"$f":"IF((Tabla2[[#This Row],[Disponibilidad]]+Tabla2[[#This Row],[Integridad]]+Tabla2[[#This Row],[Confidencialidad ]]<=4),\"Baja\",IF(AND(Tabla2[[#This Row],[Disponibilidad]]+Tabla2[[#This Row],[Integridad]]+Tabla2[[#This Row],[Confidencialidad ]]>=5,Tabla2[[#This Row],[Disponibilidad]]+Tabla2[[#This Row],[Integridad]]+Tabla2[[#This Row],[Confidencialidad ]]<=7),\"Media\",IF(Tabla2[[#This Row],[Disponibilidad]]+Tabla2[[#This Row],[Integridad]]+Tabla2[[#This Row],[Confidencialidad ]]>=8,\"Alta\",\"error\")))","v":"Baja"}]
["",null,null,null,null,null,null,null,null,null,null,null,null,null,null,null,null,null,null,null,null,null,null,null,null,{"$f":"IF((Tabla2[[#This Row],[Disponibilidad]]+Tabla2[[#This Row],[Integridad]]+Tabla2[[#This Row],[Confidencialidad ]]<=4),\"Baja\",IF(AND(Tabla2[[#This Row],[Disponibilidad]]+Tabla2[[#This Row],[Integridad]]+Tabla2[[#This Row],[Confidencialidad ]]>=5,Tabla2[[#This Row],[Disponibilidad]]+Tabla2[[#This Row],[Integridad]]+Tabla2[[#This Row],[Confidencialidad ]]<=7),\"Media\",IF(Tabla2[[#This Row],[Disponibilidad]]+Tabla2[[#This Row],[Integridad]]+Tabla2[[#This Row],[Confidencialidad ]]>=8,\"Alta\",\"error\")))","v":"Baja"}]
["",null,null,null,null,null,null,null,null,null,null,null,null,null,null,null,null,null,null,null,null,null,null,null,null,{"$f":"IF((Tabla2[[#This Row],[Disponibilidad]]+Tabla2[[#This Row],[Integridad]]+Tabla2[[#This Row],[Confidencialidad ]]<=4),\"Baja\",IF(AND(Tabla2[[#This Row],[Disponibilidad]]+Tabla2[[#This Row],[Integridad]]+Tabla2[[#This Row],[Confidencialidad ]]>=5,Tabla2[[#This Row],[Disponibilidad]]+Tabla2[[#This Row],[Integridad]]+Tabla2[[#This Row],[Confidencialidad ]]<=7),\"Media\",IF(Tabla2[[#This Row],[Disponibilidad]]+Tabla2[[#This Row],[Integridad]]+Tabla2[[#This Row],[Confidencialidad ]]>=8,\"Alta\",\"error\")))","v":"Baja"}]
["",null,null,null,null,null,null,null,null,null,null,null,null,null,null,null,null,null,null,null,null,null,null,null,null,{"$f":"IF((Tabla2[[#This Row],[Disponibilidad]]+Tabla2[[#This Row],[Integridad]]+Tabla2[[#This Row],[Confidencialidad ]]<=4),\"Baja\",IF(AND(Tabla2[[#This Row],[Disponibilidad]]+Tabla2[[#This Row],[Integridad]]+Tabla2[[#This Row],[Confidencialidad ]]>=5,Tabla2[[#This Row],[Disponibilidad]]+Tabla2[[#This Row],[Integridad]]+Tabla2[[#This Row],[Confidencialidad ]]<=7),\"Media\",IF(Tabla2[[#This Row],[Disponibilidad]]+Tabla2[[#This Row],[Integridad]]+Tabla2[[#This Row],[Confidencialidad ]]>=8,\"Alta\",\"error\")))","v":"Baja"}]
["",null,null,null,null,null,null,null,null,null,null,null,null,null,null,null,null,null,null,null,null,null,null,null,null,{"$f":"IF((Tabla2[[#This Row],[Disponibilidad]]+Tabla2[[#This Row],[Integridad]]+Tabla2[[#This Row],[Confidencialidad ]]<=4),\"Baja\",IF(AND(Tabla2[[#This Row],[Disponibilidad]]+Tabla2[[#This Row],[Integridad]]+Tabla2[[#This Row],[Confidencialidad ]]>=5,Tabla2[[#This Row],[Disponibilidad]]+Tabla2[[#This Row],[Integridad]]+Tabla2[[#This Row],[Confidencialidad ]]<=7),\"Media\",IF(Tabla2[[#This Row],[Disponibilidad]]+Tabla2[[#This Row],[Integridad]]+Tabla2[[#This Row],[Confidencialidad ]]>=8,\"Alta\",\"error\")))","v":"Baja"}]
["",null,null,null,null,null,null,null,null,null,null,null,null,null,null,null,null,null,null,null,null,null,null,null,null,{"$f":"IF((Tabla2[[#This Row],[Disponibilidad]]+Tabla2[[#This Row],[Integridad]]+Tabla2[[#This Row],[Confidencialidad ]]<=4),\"Baja\",IF(AND(Tabla2[[#This Row],[Disponibilidad]]+Tabla2[[#This Row],[Integridad]]+Tabla2[[#This Row],[Confidencialidad ]]>=5,Tabla2[[#This Row],[Disponibilidad]]+Tabla2[[#This Row],[Integridad]]+Tabla2[[#This Row],[Confidencialidad ]]<=7),\"Media\",IF(Tabla2[[#This Row],[Disponibilidad]]+Tabla2[[#This Row],[Integridad]]+Tabla2[[#This Row],[Confidencialidad ]]>=8,\"Alta\",\"error\")))","v":"Baja"}]
["",null,null,null,null,null,null,null,null,null,null,null,null,null,null,null,null,null,null,null,null,null,null,null,null,{"$f":"IF((Tabla2[[#This Row],[Disponibilidad]]+Tabla2[[#This Row],[Integridad]]+Tabla2[[#This Row],[Confidencialidad ]]<=4),\"Baja\",IF(AND(Tabla2[[#This Row],[Disponibilidad]]+Tabla2[[#This Row],[Integridad]]+Tabla2[[#This Row],[Confidencialidad ]]>=5,Tabla2[[#This Row],[Disponibilidad]]+Tabla2[[#This Row],[Integridad]]+Tabla2[[#This Row],[Confidencialidad ]]<=7),\"Media\",IF(Tabla2[[#This Row],[Disponibilidad]]+Tabla2[[#This Row],[Integridad]]+Tabla2[[#This Row],[Confidencialidad ]]>=8,\"Alta\",\"error\")))","v":"Baja"}]
["",null,null,null,null,null,null,null,null,null,null,null,null,null,null,null,null,null,null,null,null,null,null,null,null,{"$f":"IF((Tabla2[[#This Row],[Disponibilidad]]+Tabla2[[#This Row],[Integridad]]+Tabla2[[#This Row],[Confidencialidad ]]<=4),\"Baja\",IF(AND(Tabla2[[#This Row],[Disponibilidad]]+Tabla2[[#This Row],[Integridad]]+Tabla2[[#This Row],[Confidencialidad ]]>=5,Tabla2[[#This Row],[Disponibilidad]]+Tabla2[[#This Row],[Integridad]]+Tabla2[[#This Row],[Confidencialidad ]]<=7),\"Media\",IF(Tabla2[[#This Row],[Disponibilidad]]+Tabla2[[#This Row],[Integridad]]+Tabla2[[#This Row],[Confidencialidad ]]>=8,\"Alta\",\"error\")))","v":"Baja"}]
["",null,null,null,null,null,null,null,null,null,null,null,null,null,null,null,null,null,null,null,null,null,null,null,null,{"$f":"IF((Tabla2[[#This Row],[Disponibilidad]]+Tabla2[[#This Row],[Integridad]]+Tabla2[[#This Row],[Confidencialidad ]]<=4),\"Baja\",IF(AND(Tabla2[[#This Row],[Disponibilidad]]+Tabla2[[#This Row],[Integridad]]+Tabla2[[#This Row],[Confidencialidad ]]>=5,Tabla2[[#This Row],[Disponibilidad]]+Tabla2[[#This Row],[Integridad]]+Tabla2[[#This Row],[Confidencialidad ]]<=7),\"Media\",IF(Tabla2[[#This Row],[Disponibilidad]]+Tabla2[[#This Row],[Integridad]]+Tabla2[[#This Row],[Confidencialidad ]]>=8,\"Alta\",\"error\")))","v":"Baja"}]
["",null,null,null,null,null,null,null,null,null,null,null,null,null,null,null,null,null,null,null,null,null,null,null,null,{"$f":"IF((Tabla2[[#This Row],[Disponibilidad]]+Tabla2[[#This Row],[Integridad]]+Tabla2[[#This Row],[Confidencialidad ]]<=4),\"Baja\",IF(AND(Tabla2[[#This Row],[Disponibilidad]]+Tabla2[[#This Row],[Integridad]]+Tabla2[[#This Row],[Confidencialidad ]]>=5,Tabla2[[#This Row],[Disponibilidad]]+Tabla2[[#This Row],[Integridad]]+Tabla2[[#This Row],[Confidencialidad ]]<=7),\"Media\",IF(Tabla2[[#This Row],[Disponibilidad]]+Tabla2[[#This Row],[Integridad]]+Tabla2[[#This Row],[Confidencialidad ]]>=8,\"Alta\",\"error\")))","v":"Baja"}]
["",null,null,null,null,null,null,null,null,null,null,null,null,null,null,null,null,null,null,null,null,null,null,null,null,{"$f":"IF((Tabla2[[#This Row],[Disponibilidad]]+Tabla2[[#This Row],[Integridad]]+Tabla2[[#This Row],[Confidencialidad ]]<=4),\"Baja\",IF(AND(Tabla2[[#This Row],[Disponibilidad]]+Tabla2[[#This Row],[Integridad]]+Tabla2[[#This Row],[Confidencialidad ]]>=5,Tabla2[[#This Row],[Disponibilidad]]+Tabla2[[#This Row],[Integridad]]+Tabla2[[#This Row],[Confidencialidad ]]<=7),\"Media\",IF(Tabla2[[#This Row],[Disponibilidad]]+Tabla2[[#This Row],[Integridad]]+Tabla2[[#This Row],[Confidencialidad ]]>=8,\"Alta\",\"error\")))","v":"Baja"}]
["",null,null,null,null,null,null,null,null,null,null,null,null,null,null,null,null,null,null,null,null,null,null,null,null,{"$f":"IF((Tabla2[[#This Row],[Disponibilidad]]+Tabla2[[#This Row],[Integridad]]+Tabla2[[#This Row],[Confidencialidad ]]<=4),\"Baja\",IF(AND(Tabla2[[#This Row],[Disponibilidad]]+Tabla2[[#This Row],[Integridad]]+Tabla2[[#This Row],[Confidencialidad ]]>=5,Tabla2[[#This Row],[Disponibilidad]]+Tabla2[[#This Row],[Integridad]]+Tabla2[[#This Row],[Confidencialidad ]]<=7),\"Media\",IF(Tabla2[[#This Row],[Disponibilidad]]+Tabla2[[#This Row],[Integridad]]+Tabla2[[#This Row],[Confidencialidad ]]>=8,\"Alta\",\"error\")))","v":"Baja"}]
["",null,null,null,null,null,null,null,null,null,null,null,null,null,null,null,null,null,null,null,null,null,null,null,null,{"$f":"IF((Tabla2[[#This Row],[Disponibilidad]]+Tabla2[[#This Row],[Integridad]]+Tabla2[[#This Row],[Confidencialidad ]]<=4),\"Baja\",IF(AND(Tabla2[[#This Row],[Disponibilidad]]+Tabla2[[#This Row],[Integridad]]+Tabla2[[#This Row],[Confidencialidad ]]>=5,Tabla2[[#This Row],[Disponibilidad]]+Tabla2[[#This Row],[Integridad]]+Tabla2[[#This Row],[Confidencialidad ]]<=7),\"Media\",IF(Tabla2[[#This Row],[Disponibilidad]]+Tabla2[[#This Row],[Integridad]]+Tabla2[[#This Row],[Confidencialidad ]]>=8,\"Alta\",\"error\")))","v":"Baja"}]
["",null,null,null,null,null,null,null,null,null,null,null,null,null,null,null,null,null,null,null,null,null,null,null,null,{"$f":"IF((Tabla2[[#This Row],[Disponibilidad]]+Tabla2[[#This Row],[Integridad]]+Tabla2[[#This Row],[Confidencialidad ]]<=4),\"Baja\",IF(AND(Tabla2[[#This Row],[Disponibilidad]]+Tabla2[[#This Row],[Integridad]]+Tabla2[[#This Row],[Confidencialidad ]]>=5,Tabla2[[#This Row],[Disponibilidad]]+Tabla2[[#This Row],[Integridad]]+Tabla2[[#This Row],[Confidencialidad ]]<=7),\"Media\",IF(Tabla2[[#This Row],[Disponibilidad]]+Tabla2[[#This Row],[Integridad]]+Tabla2[[#This Row],[Confidencialidad ]]>=8,\"Alta\",\"error\")))","v":"Baja"}]
["",null,null,null,null,null,null,null,null,null,null,null,null,null,null,null,null,null,null,null,null,null,null,null,null,{"$f":"IF((Tabla2[[#This Row],[Disponibilidad]]+Tabla2[[#This Row],[Integridad]]+Tabla2[[#This Row],[Confidencialidad ]]<=4),\"Baja\",IF(AND(Tabla2[[#This Row],[Disponibilidad]]+Tabla2[[#This Row],[Integridad]]+Tabla2[[#This Row],[Confidencialidad ]]>=5,Tabla2[[#This Row],[Disponibilidad]]+Tabla2[[#This Row],[Integridad]]+Tabla2[[#This Row],[Confidencialidad ]]<=7),\"Media\",IF(Tabla2[[#This Row],[Disponibilidad]]+Tabla2[[#This Row],[Integridad]]+Tabla2[[#This Row],[Confidencialidad ]]>=8,\"Alta\",\"error\")))","v":"Baja"}]
["",null,null,null,null,null,null,null,null,null,null,null,null,null,null,null,null,null,null,null,null,null,null,null,null,{"$f":"IF((Tabla2[[#This Row],[Disponibilidad]]+Tabla2[[#This Row],[Integridad]]+Tabla2[[#This Row],[Confidencialidad ]]<=4),\"Baja\",IF(AND(Tabla2[[#This Row],[Disponibilidad]]+Tabla2[[#This Row],[Integridad]]+Tabla2[[#This Row],[Confidencialidad ]]>=5,Tabla2[[#This Row],[Disponibilidad]]+Tabla2[[#This Row],[Integridad]]+Tabla2[[#This Row],[Confidencialidad ]]<=7),\"Media\",IF(Tabla2[[#This Row],[Disponibilidad]]+Tabla2[[#This Row],[Integridad]]+Tabla2[[#This Row],[Confidencialidad ]]>=8,\"Alta\",\"error\")))","v":"Baja"}]
["",null,null,null,null,null,null,null,null,null,null,null,null,null,null,null,null,null,null,null,null,null,null,null,null,{"$f":"IF((Tabla2[[#This Row],[Disponibilidad]]+Tabla2[[#This Row],[Integridad]]+Tabla2[[#This Row],[Confidencialidad ]]<=4),\"Baja\",IF(AND(Tabla2[[#This Row],[Disponibilidad]]+Tabla2[[#This Row],[Integridad]]+Tabla2[[#This Row],[Confidencialidad ]]>=5,Tabla2[[#This Row],[Disponibilidad]]+Tabla2[[#This Row],[Integridad]]+Tabla2[[#This Row],[Confidencialidad ]]<=7),\"Media\",IF(Tabla2[[#This Row],[Disponibilidad]]+Tabla2[[#This Row],[Integridad]]+Tabla2[[#This Row],[Confidencialidad ]]>=8,\"Alta\",\"error\")))","v":"Baja"}]
["",null,null,null,null,null,null,null,null,null,null,null,null,null,null,null,null,null,null,null,null,null,null,null,null,{"$f":"IF((Tabla2[[#This Row],[Disponibilidad]]+Tabla2[[#This Row],[Integridad]]+Tabla2[[#This Row],[Confidencialidad ]]<=4),\"Baja\",IF(AND(Tabla2[[#This Row],[Disponibilidad]]+Tabla2[[#This Row],[Integridad]]+Tabla2[[#This Row],[Confidencialidad ]]>=5,Tabla2[[#This Row],[Disponibilidad]]+Tabla2[[#This Row],[Integridad]]+Tabla2[[#This Row],[Confidencialidad ]]<=7),\"Media\",IF(Tabla2[[#This Row],[Disponibilidad]]+Tabla2[[#This Row],[Integridad]]+Tabla2[[#This Row],[Confidencialidad ]]>=8,\"Alta\",\"error\")))","v":"Baja"}]
["",null,null,null,null,null,null,null,null,null,null,null,null,null,null,null,null,null,null,null,null,null,null,null,null,{"$f":"IF((Tabla2[[#This Row],[Disponibilidad]]+Tabla2[[#This Row],[Integridad]]+Tabla2[[#This Row],[Confidencialidad ]]<=4),\"Baja\",IF(AND(Tabla2[[#This Row],[Disponibilidad]]+Tabla2[[#This Row],[Integridad]]+Tabla2[[#This Row],[Confidencialidad ]]>=5,Tabla2[[#This Row],[Disponibilidad]]+Tabla2[[#This Row],[Integridad]]+Tabla2[[#This Row],[Confidencialidad ]]<=7),\"Media\",IF(Tabla2[[#This Row],[Disponibilidad]]+Tabla2[[#This Row],[Integridad]]+Tabla2[[#This Row],[Confidencialidad ]]>=8,\"Alta\",\"error\")))","v":"Baja"}]
["",null,null,null,null,null,null,null,null,null,null,null,null,null,null,null,null,null,null,null,null,null,null,null,null,{"$f":"IF((Tabla2[[#This Row],[Disponibilidad]]+Tabla2[[#This Row],[Integridad]]+Tabla2[[#This Row],[Confidencialidad ]]<=4),\"Baja\",IF(AND(Tabla2[[#This Row],[Disponibilidad]]+Tabla2[[#This Row],[Integridad]]+Tabla2[[#This Row],[Confidencialidad ]]>=5,Tabla2[[#This Row],[Disponibilidad]]+Tabla2[[#This Row],[Integridad]]+Tabla2[[#This Row],[Confidencialidad ]]<=7),\"Media\",IF(Tabla2[[#This Row],[Disponibilidad]]+Tabla2[[#This Row],[Integridad]]+Tabla2[[#This Row],[Confidencialidad ]]>=8,\"Alta\",\"error\")))","v":"Baja"}]
[{"$f":"IF(C593<>\"\",1,\"\")","v":""},null,null,null,null,null,null,null,null,null,null,null,null,null,null,null,null,null,null,null,null,null,null,null,null,{"$f":"IF((Tabla2[[#This Row],[Disponibilidad]]+Tabla2[[#This Row],[Integridad]]+Tabla2[[#This Row],[Confidencialidad ]]<=4),\"Baja\",IF(AND(Tabla2[[#This Row],[Disponibilidad]]+Tabla2[[#This Row],[Integridad]]+Tabla2[[#This Row],[Confidencialidad ]]>=5,Tabla2[[#This Row],[Disponibilidad]]+Tabla2[[#This Row],[Integridad]]+Tabla2[[#This Row],[Confidencialidad ]]<=7),\"Media\",IF(Tabla2[[#This Row],[Disponibilidad]]+Tabla2[[#This Row],[Integridad]]+Tabla2[[#This Row],[Confidencialidad ]]>=8,\"Alta\",\"error\")))","v":"Baja"}]
["",null,null,null,null,null,null,null,null,null,null,null,null,null,null,null,null,null,null,null,null,null,null,null,null,{"$f":"IF((Tabla2[[#This Row],[Disponibilidad]]+Tabla2[[#This Row],[Integridad]]+Tabla2[[#This Row],[Confidencialidad ]]<=4),\"Baja\",IF(AND(Tabla2[[#This Row],[Disponibilidad]]+Tabla2[[#This Row],[Integridad]]+Tabla2[[#This Row],[Confidencialidad ]]>=5,Tabla2[[#This Row],[Disponibilidad]]+Tabla2[[#This Row],[Integridad]]+Tabla2[[#This Row],[Confidencialidad ]]<=7),\"Media\",IF(Tabla2[[#This Row],[Disponibilidad]]+Tabla2[[#This Row],[Integridad]]+Tabla2[[#This Row],[Confidencialidad ]]>=8,\"Alta\",\"error\")))","v":"Baja"}]
["",null,null,null,null,null,null,null,null,null,null,null,null,null,null,null,null,null,null,null,null,null,null,null,null,{"$f":"IF((Tabla2[[#This Row],[Disponibilidad]]+Tabla2[[#This Row],[Integridad]]+Tabla2[[#This Row],[Confidencialidad ]]<=4),\"Baja\",IF(AND(Tabla2[[#This Row],[Disponibilidad]]+Tabla2[[#This Row],[Integridad]]+Tabla2[[#This Row],[Confidencialidad ]]>=5,Tabla2[[#This Row],[Disponibilidad]]+Tabla2[[#This Row],[Integridad]]+Tabla2[[#This Row],[Confidencialidad ]]<=7),\"Media\",IF(Tabla2[[#This Row],[Disponibilidad]]+Tabla2[[#This Row],[Integridad]]+Tabla2[[#This Row],[Confidencialidad ]]>=8,\"Alta\",\"error\")))","v":"Baja"}]
["",null,null,null,null,null,null,null,null,null,null,null,null,null,null,null,null,null,null,null,null,null,null,null,null,{"$f":"IF((Tabla2[[#This Row],[Disponibilidad]]+Tabla2[[#This Row],[Integridad]]+Tabla2[[#This Row],[Confidencialidad ]]<=4),\"Baja\",IF(AND(Tabla2[[#This Row],[Disponibilidad]]+Tabla2[[#This Row],[Integridad]]+Tabla2[[#This Row],[Confidencialidad ]]>=5,Tabla2[[#This Row],[Disponibilidad]]+Tabla2[[#This Row],[Integridad]]+Tabla2[[#This Row],[Confidencialidad ]]<=7),\"Media\",IF(Tabla2[[#This Row],[Disponibilidad]]+Tabla2[[#This Row],[Integridad]]+Tabla2[[#This Row],[Confidencialidad ]]>=8,\"Alta\",\"error\")))","v":"Baja"}]
["",null,null,null,null,null,null,null,null,null,null,null,null,null,null,null,null,null,null,null,null,null,null,null,null,{"$f":"IF((Tabla2[[#This Row],[Disponibilidad]]+Tabla2[[#This Row],[Integridad]]+Tabla2[[#This Row],[Confidencialidad ]]<=4),\"Baja\",IF(AND(Tabla2[[#This Row],[Disponibilidad]]+Tabla2[[#This Row],[Integridad]]+Tabla2[[#This Row],[Confidencialidad ]]>=5,Tabla2[[#This Row],[Disponibilidad]]+Tabla2[[#This Row],[Integridad]]+Tabla2[[#This Row],[Confidencialidad ]]<=7),\"Media\",IF(Tabla2[[#This Row],[Disponibilidad]]+Tabla2[[#This Row],[Integridad]]+Tabla2[[#This Row],[Confidencialidad ]]>=8,\"Alta\",\"error\")))","v":"Baja"}]
["",null,null,null,null,null,null,null,null,null,null,null,null,null,null,null,null,null,null,null,null,null,null,null,null,{"$f":"IF((Tabla2[[#This Row],[Disponibilidad]]+Tabla2[[#This Row],[Integridad]]+Tabla2[[#This Row],[Confidencialidad ]]<=4),\"Baja\",IF(AND(Tabla2[[#This Row],[Disponibilidad]]+Tabla2[[#This Row],[Integridad]]+Tabla2[[#This Row],[Confidencialidad ]]>=5,Tabla2[[#This Row],[Disponibilidad]]+Tabla2[[#This Row],[Integridad]]+Tabla2[[#This Row],[Confidencialidad ]]<=7),\"Media\",IF(Tabla2[[#This Row],[Disponibilidad]]+Tabla2[[#This Row],[Integridad]]+Tabla2[[#This Row],[Confidencialidad ]]>=8,\"Alta\",\"error\")))","v":"Baja"}]
["",null,null,null,null,null,null,null,null,null,null,null,null,null,null,null,null,null,null,null,null,null,null,null,null,{"$f":"IF((Tabla2[[#This Row],[Disponibilidad]]+Tabla2[[#This Row],[Integridad]]+Tabla2[[#This Row],[Confidencialidad ]]<=4),\"Baja\",IF(AND(Tabla2[[#This Row],[Disponibilidad]]+Tabla2[[#This Row],[Integridad]]+Tabla2[[#This Row],[Confidencialidad ]]>=5,Tabla2[[#This Row],[Disponibilidad]]+Tabla2[[#This Row],[Integridad]]+Tabla2[[#This Row],[Confidencialidad ]]<=7),\"Media\",IF(Tabla2[[#This Row],[Disponibilidad]]+Tabla2[[#This Row],[Integridad]]+Tabla2[[#This Row],[Confidencialidad ]]>=8,\"Alta\",\"error\")))","v":"Baja"}]
["",null,null,null,null,null,null,null,null,null,null,null,null,null,null,null,null,null,null,null,null,null,null,null,null,{"$f":"IF((Tabla2[[#This Row],[Disponibilidad]]+Tabla2[[#This Row],[Integridad]]+Tabla2[[#This Row],[Confidencialidad ]]<=4),\"Baja\",IF(AND(Tabla2[[#This Row],[Disponibilidad]]+Tabla2[[#This Row],[Integridad]]+Tabla2[[#This Row],[Confidencialidad ]]>=5,Tabla2[[#This Row],[Disponibilidad]]+Tabla2[[#This Row],[Integridad]]+Tabla2[[#This Row],[Confidencialidad ]]<=7),\"Media\",IF(Tabla2[[#This Row],[Disponibilidad]]+Tabla2[[#This Row],[Integridad]]+Tabla2[[#This Row],[Confidencialidad ]]>=8,\"Alta\",\"error\")))","v":"Baja"}]
["",null,null,null,null,null,null,null,null,null,null,null,null,null,null,null,null,null,null,null,null,null,null,null,null,{"$f":"IF((Tabla2[[#This Row],[Disponibilidad]]+Tabla2[[#This Row],[Integridad]]+Tabla2[[#This Row],[Confidencialidad ]]<=4),\"Baja\",IF(AND(Tabla2[[#This Row],[Disponibilidad]]+Tabla2[[#This Row],[Integridad]]+Tabla2[[#This Row],[Confidencialidad ]]>=5,Tabla2[[#This Row],[Disponibilidad]]+Tabla2[[#This Row],[Integridad]]+Tabla2[[#This Row],[Confidencialidad ]]<=7),\"Media\",IF(Tabla2[[#This Row],[Disponibilidad]]+Tabla2[[#This Row],[Integridad]]+Tabla2[[#This Row],[Confidencialidad ]]>=8,\"Alta\",\"error\")))","v":"Baja"}]
["",null,null,null,null,null,null,null,null,null,null,null,null,null,null,null,null,null,null,null,null,null,null,null,null,{"$f":"IF((Tabla2[[#This Row],[Disponibilidad]]+Tabla2[[#This Row],[Integridad]]+Tabla2[[#This Row],[Confidencialidad ]]<=4),\"Baja\",IF(AND(Tabla2[[#This Row],[Disponibilidad]]+Tabla2[[#This Row],[Integridad]]+Tabla2[[#This Row],[Confidencialidad ]]>=5,Tabla2[[#This Row],[Disponibilidad]]+Tabla2[[#This Row],[Integridad]]+Tabla2[[#This Row],[Confidencialidad ]]<=7),\"Media\",IF(Tabla2[[#This Row],[Disponibilidad]]+Tabla2[[#This Row],[Integridad]]+Tabla2[[#This Row],[Confidencialidad ]]>=8,\"Alta\",\"error\")))","v":"Baja"}]
["",null,null,null,null,null,null,null,null,null,null,null,null,null,null,null,null,null,null,null,null,null,null,null,null,{"$f":"IF((Tabla2[[#This Row],[Disponibilidad]]+Tabla2[[#This Row],[Integridad]]+Tabla2[[#This Row],[Confidencialidad ]]<=4),\"Baja\",IF(AND(Tabla2[[#This Row],[Disponibilidad]]+Tabla2[[#This Row],[Integridad]]+Tabla2[[#This Row],[Confidencialidad ]]>=5,Tabla2[[#This Row],[Disponibilidad]]+Tabla2[[#This Row],[Integridad]]+Tabla2[[#This Row],[Confidencialidad ]]<=7),\"Media\",IF(Tabla2[[#This Row],[Disponibilidad]]+Tabla2[[#This Row],[Integridad]]+Tabla2[[#This Row],[Confidencialidad ]]>=8,\"Alta\",\"error\")))","v":"Baja"}]
["",null,null,null,null,null,null,null,null,null,null,null,null,null,null,null,null,null,null,null,null,null,null,null,null,{"$f":"IF((Tabla2[[#This Row],[Disponibilidad]]+Tabla2[[#This Row],[Integridad]]+Tabla2[[#This Row],[Confidencialidad ]]<=4),\"Baja\",IF(AND(Tabla2[[#This Row],[Disponibilidad]]+Tabla2[[#This Row],[Integridad]]+Tabla2[[#This Row],[Confidencialidad ]]>=5,Tabla2[[#This Row],[Disponibilidad]]+Tabla2[[#This Row],[Integridad]]+Tabla2[[#This Row],[Confidencialidad ]]<=7),\"Media\",IF(Tabla2[[#This Row],[Disponibilidad]]+Tabla2[[#This Row],[Integridad]]+Tabla2[[#This Row],[Confidencialidad ]]>=8,\"Alta\",\"error\")))","v":"Baja"}]
["",null,null,null,null,null,null,null,null,null,null,null,null,null,null,null,null,null,null,null,null,null,null,null,null,{"$f":"IF((Tabla2[[#This Row],[Disponibilidad]]+Tabla2[[#This Row],[Integridad]]+Tabla2[[#This Row],[Confidencialidad ]]<=4),\"Baja\",IF(AND(Tabla2[[#This Row],[Disponibilidad]]+Tabla2[[#This Row],[Integridad]]+Tabla2[[#This Row],[Confidencialidad ]]>=5,Tabla2[[#This Row],[Disponibilidad]]+Tabla2[[#This Row],[Integridad]]+Tabla2[[#This Row],[Confidencialidad ]]<=7),\"Media\",IF(Tabla2[[#This Row],[Disponibilidad]]+Tabla2[[#This Row],[Integridad]]+Tabla2[[#This Row],[Confidencialidad ]]>=8,\"Alta\",\"error\")))","v":"Baja"}]
["",null,null,null,null,null,null,null,null,null,null,null,null,null,null,null,null,null,null,null,null,null,null,null,null,{"$f":"IF((Tabla2[[#This Row],[Disponibilidad]]+Tabla2[[#This Row],[Integridad]]+Tabla2[[#This Row],[Confidencialidad ]]<=4),\"Baja\",IF(AND(Tabla2[[#This Row],[Disponibilidad]]+Tabla2[[#This Row],[Integridad]]+Tabla2[[#This Row],[Confidencialidad ]]>=5,Tabla2[[#This Row],[Disponibilidad]]+Tabla2[[#This Row],[Integridad]]+Tabla2[[#This Row],[Confidencialidad ]]<=7),\"Media\",IF(Tabla2[[#This Row],[Disponibilidad]]+Tabla2[[#This Row],[Integridad]]+Tabla2[[#This Row],[Confidencialidad ]]>=8,\"Alta\",\"error\")))","v":"Baja"}]
["",null,null,null,null,null,null,null,null,null,null,null,null,null,null,null,null,null,null,null,null,null,null,null,null,{"$f":"IF((Tabla2[[#This Row],[Disponibilidad]]+Tabla2[[#This Row],[Integridad]]+Tabla2[[#This Row],[Confidencialidad ]]<=4),\"Baja\",IF(AND(Tabla2[[#This Row],[Disponibilidad]]+Tabla2[[#This Row],[Integridad]]+Tabla2[[#This Row],[Confidencialidad ]]>=5,Tabla2[[#This Row],[Disponibilidad]]+Tabla2[[#This Row],[Integridad]]+Tabla2[[#This Row],[Confidencialidad ]]<=7),\"Media\",IF(Tabla2[[#This Row],[Disponibilidad]]+Tabla2[[#This Row],[Integridad]]+Tabla2[[#This Row],[Confidencialidad ]]>=8,\"Alta\",\"error\")))","v":"Baja"}]
["",null,null,null,null,null,null,null,null,null,null,null,null,null,null,null,null,null,null,null,null,null,null,null,null,{"$f":"IF((Tabla2[[#This Row],[Disponibilidad]]+Tabla2[[#This Row],[Integridad]]+Tabla2[[#This Row],[Confidencialidad ]]<=4),\"Baja\",IF(AND(Tabla2[[#This Row],[Disponibilidad]]+Tabla2[[#This Row],[Integridad]]+Tabla2[[#This Row],[Confidencialidad ]]>=5,Tabla2[[#This Row],[Disponibilidad]]+Tabla2[[#This Row],[Integridad]]+Tabla2[[#This Row],[Confidencialidad ]]<=7),\"Media\",IF(Tabla2[[#This Row],[Disponibilidad]]+Tabla2[[#This Row],[Integridad]]+Tabla2[[#This Row],[Confidencialidad ]]>=8,\"Alta\",\"error\")))","v":"Baja"}]
["",null,null,null,null,null,null,null,null,null,null,null,null,null,null,null,null,null,null,null,null,null,null,null,null,{"$f":"IF((Tabla2[[#This Row],[Disponibilidad]]+Tabla2[[#This Row],[Integridad]]+Tabla2[[#This Row],[Confidencialidad ]]<=4),\"Baja\",IF(AND(Tabla2[[#This Row],[Disponibilidad]]+Tabla2[[#This Row],[Integridad]]+Tabla2[[#This Row],[Confidencialidad ]]>=5,Tabla2[[#This Row],[Disponibilidad]]+Tabla2[[#This Row],[Integridad]]+Tabla2[[#This Row],[Confidencialidad ]]<=7),\"Media\",IF(Tabla2[[#This Row],[Disponibilidad]]+Tabla2[[#This Row],[Integridad]]+Tabla2[[#This Row],[Confidencialidad ]]>=8,\"Alta\",\"error\")))","v":"Baja"}]
["",null,null,null,null,null,null,null,null,null,null,null,null,null,null,null,null,null,null,null,null,null,null,null,null,{"$f":"IF((Tabla2[[#This Row],[Disponibilidad]]+Tabla2[[#This Row],[Integridad]]+Tabla2[[#This Row],[Confidencialidad ]]<=4),\"Baja\",IF(AND(Tabla2[[#This Row],[Disponibilidad]]+Tabla2[[#This Row],[Integridad]]+Tabla2[[#This Row],[Confidencialidad ]]>=5,Tabla2[[#This Row],[Disponibilidad]]+Tabla2[[#This Row],[Integridad]]+Tabla2[[#This Row],[Confidencialidad ]]<=7),\"Media\",IF(Tabla2[[#This Row],[Disponibilidad]]+Tabla2[[#This Row],[Integridad]]+Tabla2[[#This Row],[Confidencialidad ]]>=8,\"Alta\",\"error\")))","v":"Baja"}]
["",null,null,null,null,null,null,null,null,null,null,null,null,null,null,null,null,null,null,null,null,null,null,null,null,{"$f":"IF((Tabla2[[#This Row],[Disponibilidad]]+Tabla2[[#This Row],[Integridad]]+Tabla2[[#This Row],[Confidencialidad ]]<=4),\"Baja\",IF(AND(Tabla2[[#This Row],[Disponibilidad]]+Tabla2[[#This Row],[Integridad]]+Tabla2[[#This Row],[Confidencialidad ]]>=5,Tabla2[[#This Row],[Disponibilidad]]+Tabla2[[#This Row],[Integridad]]+Tabla2[[#This Row],[Confidencialidad ]]<=7),\"Media\",IF(Tabla2[[#This Row],[Disponibilidad]]+Tabla2[[#This Row],[Integridad]]+Tabla2[[#This Row],[Confidencialidad ]]>=8,\"Alta\",\"error\")))","v":"Baja"}]
["",null,null,null,null,null,null,null,null,null,null,null,null,null,null,null,null,null,null,null,null,null,null,null,null,{"$f":"IF((Tabla2[[#This Row],[Disponibilidad]]+Tabla2[[#This Row],[Integridad]]+Tabla2[[#This Row],[Confidencialidad ]]<=4),\"Baja\",IF(AND(Tabla2[[#This Row],[Disponibilidad]]+Tabla2[[#This Row],[Integridad]]+Tabla2[[#This Row],[Confidencialidad ]]>=5,Tabla2[[#This Row],[Disponibilidad]]+Tabla2[[#This Row],[Integridad]]+Tabla2[[#This Row],[Confidencialidad ]]<=7),\"Media\",IF(Tabla2[[#This Row],[Disponibilidad]]+Tabla2[[#This Row],[Integridad]]+Tabla2[[#This Row],[Confidencialidad ]]>=8,\"Alta\",\"error\")))","v":"Baja"}]
["",null,null,null,null,null,null,null,null,null,null,null,null,null,null,null,null,null,null,null,null,null,null,null,null,{"$f":"IF((Tabla2[[#This Row],[Disponibilidad]]+Tabla2[[#This Row],[Integridad]]+Tabla2[[#This Row],[Confidencialidad ]]<=4),\"Baja\",IF(AND(Tabla2[[#This Row],[Disponibilidad]]+Tabla2[[#This Row],[Integridad]]+Tabla2[[#This Row],[Confidencialidad ]]>=5,Tabla2[[#This Row],[Disponibilidad]]+Tabla2[[#This Row],[Integridad]]+Tabla2[[#This Row],[Confidencialidad ]]<=7),\"Media\",IF(Tabla2[[#This Row],[Disponibilidad]]+Tabla2[[#This Row],[Integridad]]+Tabla2[[#This Row],[Confidencialidad ]]>=8,\"Alta\",\"error\")))","v":"Baja"}]
["",null,null,null,null,null,null,null,null,null,null,null,null,null,null,null,null,null,null,null,null,null,null,null,null,{"$f":"IF((Tabla2[[#This Row],[Disponibilidad]]+Tabla2[[#This Row],[Integridad]]+Tabla2[[#This Row],[Confidencialidad ]]<=4),\"Baja\",IF(AND(Tabla2[[#This Row],[Disponibilidad]]+Tabla2[[#This Row],[Integridad]]+Tabla2[[#This Row],[Confidencialidad ]]>=5,Tabla2[[#This Row],[Disponibilidad]]+Tabla2[[#This Row],[Integridad]]+Tabla2[[#This Row],[Confidencialidad ]]<=7),\"Media\",IF(Tabla2[[#This Row],[Disponibilidad]]+Tabla2[[#This Row],[Integridad]]+Tabla2[[#This Row],[Confidencialidad ]]>=8,\"Alta\",\"error\")))","v":"Baja"}]
["",null,null,null,null,null,null,null,null,null,null,null,null,null,null,null,null,null,null,null,null,null,null,null,null,{"$f":"IF((Tabla2[[#This Row],[Disponibilidad]]+Tabla2[[#This Row],[Integridad]]+Tabla2[[#This Row],[Confidencialidad ]]<=4),\"Baja\",IF(AND(Tabla2[[#This Row],[Disponibilidad]]+Tabla2[[#This Row],[Integridad]]+Tabla2[[#This Row],[Confidencialidad ]]>=5,Tabla2[[#This Row],[Disponibilidad]]+Tabla2[[#This Row],[Integridad]]+Tabla2[[#This Row],[Confidencialidad ]]<=7),\"Media\",IF(Tabla2[[#This Row],[Disponibilidad]]+Tabla2[[#This Row],[Integridad]]+Tabla2[[#This Row],[Confidencialidad ]]>=8,\"Alta\",\"error\")))","v":"Baja"}]
["",null,null,null,null,null,null,null,null,null,null,null,null,null,null,null,null,null,null,null,null,null,null,null,null,{"$f":"IF((Tabla2[[#This Row],[Disponibilidad]]+Tabla2[[#This Row],[Integridad]]+Tabla2[[#This Row],[Confidencialidad ]]<=4),\"Baja\",IF(AND(Tabla2[[#This Row],[Disponibilidad]]+Tabla2[[#This Row],[Integridad]]+Tabla2[[#This Row],[Confidencialidad ]]>=5,Tabla2[[#This Row],[Disponibilidad]]+Tabla2[[#This Row],[Integridad]]+Tabla2[[#This Row],[Confidencialidad ]]<=7),\"Media\",IF(Tabla2[[#This Row],[Disponibilidad]]+Tabla2[[#This Row],[Integridad]]+Tabla2[[#This Row],[Confidencialidad ]]>=8,\"Alta\",\"error\")))","v":"Baja"}]
["",null,null,null,null,null,null,null,null,null,null,null,null,null,null,null,null,null,null,null,null,null,null,null,null,{"$f":"IF((Tabla2[[#This Row],[Disponibilidad]]+Tabla2[[#This Row],[Integridad]]+Tabla2[[#This Row],[Confidencialidad ]]<=4),\"Baja\",IF(AND(Tabla2[[#This Row],[Disponibilidad]]+Tabla2[[#This Row],[Integridad]]+Tabla2[[#This Row],[Confidencialidad ]]>=5,Tabla2[[#This Row],[Disponibilidad]]+Tabla2[[#This Row],[Integridad]]+Tabla2[[#This Row],[Confidencialidad ]]<=7),\"Media\",IF(Tabla2[[#This Row],[Disponibilidad]]+Tabla2[[#This Row],[Integridad]]+Tabla2[[#This Row],[Confidencialidad ]]>=8,\"Alta\",\"error\")))","v":"Baja"}]
[{"$f":"IF(C618<>\"\",1,\"\")","v":""},null,null,null,null,null,null,null,null,null,null,null,null,null,null,null,null,null,null,null,null,null,null,null,null,{"$f":"IF((Tabla2[[#This Row],[Disponibilidad]]+Tabla2[[#This Row],[Integridad]]+Tabla2[[#This Row],[Confidencialidad ]]<=4),\"Baja\",IF(AND(Tabla2[[#This Row],[Disponibilidad]]+Tabla2[[#This Row],[Integridad]]+Tabla2[[#This Row],[Confidencialidad ]]>=5,Tabla2[[#This Row],[Disponibilidad]]+Tabla2[[#This Row],[Integridad]]+Tabla2[[#This Row],[Confidencialidad ]]<=7),\"Media\",IF(Tabla2[[#This Row],[Disponibilidad]]+Tabla2[[#This Row],[Integridad]]+Tabla2[[#This Row],[Confidencialidad ]]>=8,\"Alta\",\"error\")))","v":"Baja"}]
["",null,null,null,null,null,null,null,null,null,null,null,null,null,null,null,null,null,null,null,null,null,null,null,null,{"$f":"IF((Tabla2[[#This Row],[Disponibilidad]]+Tabla2[[#This Row],[Integridad]]+Tabla2[[#This Row],[Confidencialidad ]]<=4),\"Baja\",IF(AND(Tabla2[[#This Row],[Disponibilidad]]+Tabla2[[#This Row],[Integridad]]+Tabla2[[#This Row],[Confidencialidad ]]>=5,Tabla2[[#This Row],[Disponibilidad]]+Tabla2[[#This Row],[Integridad]]+Tabla2[[#This Row],[Confidencialidad ]]<=7),\"Media\",IF(Tabla2[[#This Row],[Disponibilidad]]+Tabla2[[#This Row],[Integridad]]+Tabla2[[#This Row],[Confidencialidad ]]>=8,\"Alta\",\"error\")))","v":"Baja"}]
["",null,null,null,null,null,null,null,null,null,null,null,null,null,null,null,null,null,null,null,null,null,null,null,null,{"$f":"IF((Tabla2[[#This Row],[Disponibilidad]]+Tabla2[[#This Row],[Integridad]]+Tabla2[[#This Row],[Confidencialidad ]]<=4),\"Baja\",IF(AND(Tabla2[[#This Row],[Disponibilidad]]+Tabla2[[#This Row],[Integridad]]+Tabla2[[#This Row],[Confidencialidad ]]>=5,Tabla2[[#This Row],[Disponibilidad]]+Tabla2[[#This Row],[Integridad]]+Tabla2[[#This Row],[Confidencialidad ]]<=7),\"Media\",IF(Tabla2[[#This Row],[Disponibilidad]]+Tabla2[[#This Row],[Integridad]]+Tabla2[[#This Row],[Confidencialidad ]]>=8,\"Alta\",\"error\")))","v":"Baja"}]
["",null,null,null,null,null,null,null,null,null,null,null,null,null,null,null,null,null,null,null,null,null,null,null,null,{"$f":"IF((Tabla2[[#This Row],[Disponibilidad]]+Tabla2[[#This Row],[Integridad]]+Tabla2[[#This Row],[Confidencialidad ]]<=4),\"Baja\",IF(AND(Tabla2[[#This Row],[Disponibilidad]]+Tabla2[[#This Row],[Integridad]]+Tabla2[[#This Row],[Confidencialidad ]]>=5,Tabla2[[#This Row],[Disponibilidad]]+Tabla2[[#This Row],[Integridad]]+Tabla2[[#This Row],[Confidencialidad ]]<=7),\"Media\",IF(Tabla2[[#This Row],[Disponibilidad]]+Tabla2[[#This Row],[Integridad]]+Tabla2[[#This Row],[Confidencialidad ]]>=8,\"Alta\",\"error\")))","v":"Baja"}]
["",null,null,null,null,null,null,null,null,null,null,null,null,null,null,null,null,null,null,null,null,null,null,null,null,{"$f":"IF((Tabla2[[#This Row],[Disponibilidad]]+Tabla2[[#This Row],[Integridad]]+Tabla2[[#This Row],[Confidencialidad ]]<=4),\"Baja\",IF(AND(Tabla2[[#This Row],[Disponibilidad]]+Tabla2[[#This Row],[Integridad]]+Tabla2[[#This Row],[Confidencialidad ]]>=5,Tabla2[[#This Row],[Disponibilidad]]+Tabla2[[#This Row],[Integridad]]+Tabla2[[#This Row],[Confidencialidad ]]<=7),\"Media\",IF(Tabla2[[#This Row],[Disponibilidad]]+Tabla2[[#This Row],[Integridad]]+Tabla2[[#This Row],[Confidencialidad ]]>=8,\"Alta\",\"error\")))","v":"Baja"}]
["",null,null,null,null,null,null,null,null,null,null,null,null,null,null,null,null,null,null,null,null,null,null,null,null,{"$f":"IF((Tabla2[[#This Row],[Disponibilidad]]+Tabla2[[#This Row],[Integridad]]+Tabla2[[#This Row],[Confidencialidad ]]<=4),\"Baja\",IF(AND(Tabla2[[#This Row],[Disponibilidad]]+Tabla2[[#This Row],[Integridad]]+Tabla2[[#This Row],[Confidencialidad ]]>=5,Tabla2[[#This Row],[Disponibilidad]]+Tabla2[[#This Row],[Integridad]]+Tabla2[[#This Row],[Confidencialidad ]]<=7),\"Media\",IF(Tabla2[[#This Row],[Disponibilidad]]+Tabla2[[#This Row],[Integridad]]+Tabla2[[#This Row],[Confidencialidad ]]>=8,\"Alta\",\"error\")))","v":"Baja"}]
["",null,null,null,null,null,null,null,null,null,null,null,null,null,null,null,null,null,null,null,null,null,null,null,null,{"$f":"IF((Tabla2[[#This Row],[Disponibilidad]]+Tabla2[[#This Row],[Integridad]]+Tabla2[[#This Row],[Confidencialidad ]]<=4),\"Baja\",IF(AND(Tabla2[[#This Row],[Disponibilidad]]+Tabla2[[#This Row],[Integridad]]+Tabla2[[#This Row],[Confidencialidad ]]>=5,Tabla2[[#This Row],[Disponibilidad]]+Tabla2[[#This Row],[Integridad]]+Tabla2[[#This Row],[Confidencialidad ]]<=7),\"Media\",IF(Tabla2[[#This Row],[Disponibilidad]]+Tabla2[[#This Row],[Integridad]]+Tabla2[[#This Row],[Confidencialidad ]]>=8,\"Alta\",\"error\")))","v":"Baja"}]
["",null,null,null,null,null,null,null,null,null,null,null,null,null,null,null,null,null,null,null,null,null,null,null,null,{"$f":"IF((Tabla2[[#This Row],[Disponibilidad]]+Tabla2[[#This Row],[Integridad]]+Tabla2[[#This Row],[Confidencialidad ]]<=4),\"Baja\",IF(AND(Tabla2[[#This Row],[Disponibilidad]]+Tabla2[[#This Row],[Integridad]]+Tabla2[[#This Row],[Confidencialidad ]]>=5,Tabla2[[#This Row],[Disponibilidad]]+Tabla2[[#This Row],[Integridad]]+Tabla2[[#This Row],[Confidencialidad ]]<=7),\"Media\",IF(Tabla2[[#This Row],[Disponibilidad]]+Tabla2[[#This Row],[Integridad]]+Tabla2[[#This Row],[Confidencialidad ]]>=8,\"Alta\",\"error\")))","v":"Baja"}]
["",null,null,null,null,null,null,null,null,null,null,null,null,null,null,null,null,null,null,null,null,null,null,null,null,{"$f":"IF((Tabla2[[#This Row],[Disponibilidad]]+Tabla2[[#This Row],[Integridad]]+Tabla2[[#This Row],[Confidencialidad ]]<=4),\"Baja\",IF(AND(Tabla2[[#This Row],[Disponibilidad]]+Tabla2[[#This Row],[Integridad]]+Tabla2[[#This Row],[Confidencialidad ]]>=5,Tabla2[[#This Row],[Disponibilidad]]+Tabla2[[#This Row],[Integridad]]+Tabla2[[#This Row],[Confidencialidad ]]<=7),\"Media\",IF(Tabla2[[#This Row],[Disponibilidad]]+Tabla2[[#This Row],[Integridad]]+Tabla2[[#This Row],[Confidencialidad ]]>=8,\"Alta\",\"error\")))","v":"Baja"}]
["",null,null,null,null,null,null,null,null,null,null,null,null,null,null,null,null,null,null,null,null,null,null,null,null,{"$f":"IF((Tabla2[[#This Row],[Disponibilidad]]+Tabla2[[#This Row],[Integridad]]+Tabla2[[#This Row],[Confidencialidad ]]<=4),\"Baja\",IF(AND(Tabla2[[#This Row],[Disponibilidad]]+Tabla2[[#This Row],[Integridad]]+Tabla2[[#This Row],[Confidencialidad ]]>=5,Tabla2[[#This Row],[Disponibilidad]]+Tabla2[[#This Row],[Integridad]]+Tabla2[[#This Row],[Confidencialidad ]]<=7),\"Media\",IF(Tabla2[[#This Row],[Disponibilidad]]+Tabla2[[#This Row],[Integridad]]+Tabla2[[#This Row],[Confidencialidad ]]>=8,\"Alta\",\"error\")))","v":"Baja"}]
["",null,null,null,null,null,null,null,null,null,null,null,null,null,null,null,null,null,null,null,null,null,null,null,null,{"$f":"IF((Tabla2[[#This Row],[Disponibilidad]]+Tabla2[[#This Row],[Integridad]]+Tabla2[[#This Row],[Confidencialidad ]]<=4),\"Baja\",IF(AND(Tabla2[[#This Row],[Disponibilidad]]+Tabla2[[#This Row],[Integridad]]+Tabla2[[#This Row],[Confidencialidad ]]>=5,Tabla2[[#This Row],[Disponibilidad]]+Tabla2[[#This Row],[Integridad]]+Tabla2[[#This Row],[Confidencialidad ]]<=7),\"Media\",IF(Tabla2[[#This Row],[Disponibilidad]]+Tabla2[[#This Row],[Integridad]]+Tabla2[[#This Row],[Confidencialidad ]]>=8,\"Alta\",\"error\")))","v":"Baja"}]
["",null,null,null,null,null,null,null,null,null,null,null,null,null,null,null,null,null,null,null,null,null,null,null,null,{"$f":"IF((Tabla2[[#This Row],[Disponibilidad]]+Tabla2[[#This Row],[Integridad]]+Tabla2[[#This Row],[Confidencialidad ]]<=4),\"Baja\",IF(AND(Tabla2[[#This Row],[Disponibilidad]]+Tabla2[[#This Row],[Integridad]]+Tabla2[[#This Row],[Confidencialidad ]]>=5,Tabla2[[#This Row],[Disponibilidad]]+Tabla2[[#This Row],[Integridad]]+Tabla2[[#This Row],[Confidencialidad ]]<=7),\"Media\",IF(Tabla2[[#This Row],[Disponibilidad]]+Tabla2[[#This Row],[Integridad]]+Tabla2[[#This Row],[Confidencialidad ]]>=8,\"Alta\",\"error\")))","v":"Baja"}]
["",null,null,null,null,null,null,null,null,null,null,null,null,null,null,null,null,null,null,null,null,null,null,null,null,{"$f":"IF((Tabla2[[#This Row],[Disponibilidad]]+Tabla2[[#This Row],[Integridad]]+Tabla2[[#This Row],[Confidencialidad ]]<=4),\"Baja\",IF(AND(Tabla2[[#This Row],[Disponibilidad]]+Tabla2[[#This Row],[Integridad]]+Tabla2[[#This Row],[Confidencialidad ]]>=5,Tabla2[[#This Row],[Disponibilidad]]+Tabla2[[#This Row],[Integridad]]+Tabla2[[#This Row],[Confidencialidad ]]<=7),\"Media\",IF(Tabla2[[#This Row],[Disponibilidad]]+Tabla2[[#This Row],[Integridad]]+Tabla2[[#This Row],[Confidencialidad ]]>=8,\"Alta\",\"error\")))","v":"Baja"}]
["",null,null,null,null,null,null,null,null,null,null,null,null,null,null,null,null,null,null,null,null,null,null,null,null,{"$f":"IF((Tabla2[[#This Row],[Disponibilidad]]+Tabla2[[#This Row],[Integridad]]+Tabla2[[#This Row],[Confidencialidad ]]<=4),\"Baja\",IF(AND(Tabla2[[#This Row],[Disponibilidad]]+Tabla2[[#This Row],[Integridad]]+Tabla2[[#This Row],[Confidencialidad ]]>=5,Tabla2[[#This Row],[Disponibilidad]]+Tabla2[[#This Row],[Integridad]]+Tabla2[[#This Row],[Confidencialidad ]]<=7),\"Media\",IF(Tabla2[[#This Row],[Disponibilidad]]+Tabla2[[#This Row],[Integridad]]+Tabla2[[#This Row],[Confidencialidad ]]>=8,\"Alta\",\"error\")))","v":"Baja"}]
["",null,null,null,null,null,null,null,null,null,null,null,null,null,null,null,null,null,null,null,null,null,null,null,null,{"$f":"IF((Tabla2[[#This Row],[Disponibilidad]]+Tabla2[[#This Row],[Integridad]]+Tabla2[[#This Row],[Confidencialidad ]]<=4),\"Baja\",IF(AND(Tabla2[[#This Row],[Disponibilidad]]+Tabla2[[#This Row],[Integridad]]+Tabla2[[#This Row],[Confidencialidad ]]>=5,Tabla2[[#This Row],[Disponibilidad]]+Tabla2[[#This Row],[Integridad]]+Tabla2[[#This Row],[Confidencialidad ]]<=7),\"Media\",IF(Tabla2[[#This Row],[Disponibilidad]]+Tabla2[[#This Row],[Integridad]]+Tabla2[[#This Row],[Confidencialidad ]]>=8,\"Alta\",\"error\")))","v":"Baja"}]
["",null,null,null,null,null,null,null,null,null,null,null,null,null,null,null,null,null,null,null,null,null,null,null,null,{"$f":"IF((Tabla2[[#This Row],[Disponibilidad]]+Tabla2[[#This Row],[Integridad]]+Tabla2[[#This Row],[Confidencialidad ]]<=4),\"Baja\",IF(AND(Tabla2[[#This Row],[Disponibilidad]]+Tabla2[[#This Row],[Integridad]]+Tabla2[[#This Row],[Confidencialidad ]]>=5,Tabla2[[#This Row],[Disponibilidad]]+Tabla2[[#This Row],[Integridad]]+Tabla2[[#This Row],[Confidencialidad ]]<=7),\"Media\",IF(Tabla2[[#This Row],[Disponibilidad]]+Tabla2[[#This Row],[Integridad]]+Tabla2[[#This Row],[Confidencialidad ]]>=8,\"Alta\",\"error\")))","v":"Baja"}]
["",null,null,null,null,null,null,null,null,null,null,null,null,null,null,null,null,null,null,null,null,null,null,null,null,{"$f":"IF((Tabla2[[#This Row],[Disponibilidad]]+Tabla2[[#This Row],[Integridad]]+Tabla2[[#This Row],[Confidencialidad ]]<=4),\"Baja\",IF(AND(Tabla2[[#This Row],[Disponibilidad]]+Tabla2[[#This Row],[Integridad]]+Tabla2[[#This Row],[Confidencialidad ]]>=5,Tabla2[[#This Row],[Disponibilidad]]+Tabla2[[#This Row],[Integridad]]+Tabla2[[#This Row],[Confidencialidad ]]<=7),\"Media\",IF(Tabla2[[#This Row],[Disponibilidad]]+Tabla2[[#This Row],[Integridad]]+Tabla2[[#This Row],[Confidencialidad ]]>=8,\"Alta\",\"error\")))","v":"Baja"}]
["",null,null,null,null,null,null,null,null,null,null,null,null,null,null,null,null,null,null,null,null,null,null,null,null,{"$f":"IF((Tabla2[[#This Row],[Disponibilidad]]+Tabla2[[#This Row],[Integridad]]+Tabla2[[#This Row],[Confidencialidad ]]<=4),\"Baja\",IF(AND(Tabla2[[#This Row],[Disponibilidad]]+Tabla2[[#This Row],[Integridad]]+Tabla2[[#This Row],[Confidencialidad ]]>=5,Tabla2[[#This Row],[Disponibilidad]]+Tabla2[[#This Row],[Integridad]]+Tabla2[[#This Row],[Confidencialidad ]]<=7),\"Media\",IF(Tabla2[[#This Row],[Disponibilidad]]+Tabla2[[#This Row],[Integridad]]+Tabla2[[#This Row],[Confidencialidad ]]>=8,\"Alta\",\"error\")))","v":"Baja"}]
["",null,null,null,null,null,null,null,null,null,null,null,null,null,null,null,null,null,null,null,null,null,null,null,null,{"$f":"IF((Tabla2[[#This Row],[Disponibilidad]]+Tabla2[[#This Row],[Integridad]]+Tabla2[[#This Row],[Confidencialidad ]]<=4),\"Baja\",IF(AND(Tabla2[[#This Row],[Disponibilidad]]+Tabla2[[#This Row],[Integridad]]+Tabla2[[#This Row],[Confidencialidad ]]>=5,Tabla2[[#This Row],[Disponibilidad]]+Tabla2[[#This Row],[Integridad]]+Tabla2[[#This Row],[Confidencialidad ]]<=7),\"Media\",IF(Tabla2[[#This Row],[Disponibilidad]]+Tabla2[[#This Row],[Integridad]]+Tabla2[[#This Row],[Confidencialidad ]]>=8,\"Alta\",\"error\")))","v":"Baja"}]
["",null,null,null,null,null,null,null,null,null,null,null,null,null,null,null,null,null,null,null,null,null,null,null,null,{"$f":"IF((Tabla2[[#This Row],[Disponibilidad]]+Tabla2[[#This Row],[Integridad]]+Tabla2[[#This Row],[Confidencialidad ]]<=4),\"Baja\",IF(AND(Tabla2[[#This Row],[Disponibilidad]]+Tabla2[[#This Row],[Integridad]]+Tabla2[[#This Row],[Confidencialidad ]]>=5,Tabla2[[#This Row],[Disponibilidad]]+Tabla2[[#This Row],[Integridad]]+Tabla2[[#This Row],[Confidencialidad ]]<=7),\"Media\",IF(Tabla2[[#This Row],[Disponibilidad]]+Tabla2[[#This Row],[Integridad]]+Tabla2[[#This Row],[Confidencialidad ]]>=8,\"Alta\",\"error\")))","v":"Baja"}]
["",null,null,null,null,null,null,null,null,null,null,null,null,null,null,null,null,null,null,null,null,null,null,null,null,{"$f":"IF((Tabla2[[#This Row],[Disponibilidad]]+Tabla2[[#This Row],[Integridad]]+Tabla2[[#This Row],[Confidencialidad ]]<=4),\"Baja\",IF(AND(Tabla2[[#This Row],[Disponibilidad]]+Tabla2[[#This Row],[Integridad]]+Tabla2[[#This Row],[Confidencialidad ]]>=5,Tabla2[[#This Row],[Disponibilidad]]+Tabla2[[#This Row],[Integridad]]+Tabla2[[#This Row],[Confidencialidad ]]<=7),\"Media\",IF(Tabla2[[#This Row],[Disponibilidad]]+Tabla2[[#This Row],[Integridad]]+Tabla2[[#This Row],[Confidencialidad ]]>=8,\"Alta\",\"error\")))","v":"Baja"}]
["",null,null,null,null,null,null,null,null,null,null,null,null,null,null,null,null,null,null,null,null,null,null,null,null,{"$f":"IF((Tabla2[[#This Row],[Disponibilidad]]+Tabla2[[#This Row],[Integridad]]+Tabla2[[#This Row],[Confidencialidad ]]<=4),\"Baja\",IF(AND(Tabla2[[#This Row],[Disponibilidad]]+Tabla2[[#This Row],[Integridad]]+Tabla2[[#This Row],[Confidencialidad ]]>=5,Tabla2[[#This Row],[Disponibilidad]]+Tabla2[[#This Row],[Integridad]]+Tabla2[[#This Row],[Confidencialidad ]]<=7),\"Media\",IF(Tabla2[[#This Row],[Disponibilidad]]+Tabla2[[#This Row],[Integridad]]+Tabla2[[#This Row],[Confidencialidad ]]>=8,\"Alta\",\"error\")))","v":"Baja"}]
["",null,null,null,null,null,null,null,null,null,null,null,null,null,null,null,null,null,null,null,null,null,null,null,null,{"$f":"IF((Tabla2[[#This Row],[Disponibilidad]]+Tabla2[[#This Row],[Integridad]]+Tabla2[[#This Row],[Confidencialidad ]]<=4),\"Baja\",IF(AND(Tabla2[[#This Row],[Disponibilidad]]+Tabla2[[#This Row],[Integridad]]+Tabla2[[#This Row],[Confidencialidad ]]>=5,Tabla2[[#This Row],[Disponibilidad]]+Tabla2[[#This Row],[Integridad]]+Tabla2[[#This Row],[Confidencialidad ]]<=7),\"Media\",IF(Tabla2[[#This Row],[Disponibilidad]]+Tabla2[[#This Row],[Integridad]]+Tabla2[[#This Row],[Confidencialidad ]]>=8,\"Alta\",\"error\")))","v":"Baja"}]
["",null,null,null,null,null,null,null,null,null,null,null,null,null,null,null,null,null,null,null,null,null,null,null,null,{"$f":"IF((Tabla2[[#This Row],[Disponibilidad]]+Tabla2[[#This Row],[Integridad]]+Tabla2[[#This Row],[Confidencialidad ]]<=4),\"Baja\",IF(AND(Tabla2[[#This Row],[Disponibilidad]]+Tabla2[[#This Row],[Integridad]]+Tabla2[[#This Row],[Confidencialidad ]]>=5,Tabla2[[#This Row],[Disponibilidad]]+Tabla2[[#This Row],[Integridad]]+Tabla2[[#This Row],[Confidencialidad ]]<=7),\"Media\",IF(Tabla2[[#This Row],[Disponibilidad]]+Tabla2[[#This Row],[Integridad]]+Tabla2[[#This Row],[Confidencialidad ]]>=8,\"Alta\",\"error\")))","v":"Baja"}]
["",null,null,null,null,null,null,null,null,null,null,null,null,null,null,null,null,null,null,null,null,null,null,null,null,{"$f":"IF((Tabla2[[#This Row],[Disponibilidad]]+Tabla2[[#This Row],[Integridad]]+Tabla2[[#This Row],[Confidencialidad ]]<=4),\"Baja\",IF(AND(Tabla2[[#This Row],[Disponibilidad]]+Tabla2[[#This Row],[Integridad]]+Tabla2[[#This Row],[Confidencialidad ]]>=5,Tabla2[[#This Row],[Disponibilidad]]+Tabla2[[#This Row],[Integridad]]+Tabla2[[#This Row],[Confidencialidad ]]<=7),\"Media\",IF(Tabla2[[#This Row],[Disponibilidad]]+Tabla2[[#This Row],[Integridad]]+Tabla2[[#This Row],[Confidencialidad ]]>=8,\"Alta\",\"error\")))","v":"Baja"}]
["",null,null,null,null,null,null,null,null,null,null,null,null,null,null,null,null,null,null,null,null,null,null,null,null,{"$f":"IF((Tabla2[[#This Row],[Disponibilidad]]+Tabla2[[#This Row],[Integridad]]+Tabla2[[#This Row],[Confidencialidad ]]<=4),\"Baja\",IF(AND(Tabla2[[#This Row],[Disponibilidad]]+Tabla2[[#This Row],[Integridad]]+Tabla2[[#This Row],[Confidencialidad ]]>=5,Tabla2[[#This Row],[Disponibilidad]]+Tabla2[[#This Row],[Integridad]]+Tabla2[[#This Row],[Confidencialidad ]]<=7),\"Media\",IF(Tabla2[[#This Row],[Disponibilidad]]+Tabla2[[#This Row],[Integridad]]+Tabla2[[#This Row],[Confidencialidad ]]>=8,\"Alta\",\"error\")))","v":"Baja"}]
["",null,null,null,null,null,null,null,null,null,null,null,null,null,null,null,null,null,null,null,null,null,null,null,null,{"$f":"IF((Tabla2[[#This Row],[Disponibilidad]]+Tabla2[[#This Row],[Integridad]]+Tabla2[[#This Row],[Confidencialidad ]]<=4),\"Baja\",IF(AND(Tabla2[[#This Row],[Disponibilidad]]+Tabla2[[#This Row],[Integridad]]+Tabla2[[#This Row],[Confidencialidad ]]>=5,Tabla2[[#This Row],[Disponibilidad]]+Tabla2[[#This Row],[Integridad]]+Tabla2[[#This Row],[Confidencialidad ]]<=7),\"Media\",IF(Tabla2[[#This Row],[Disponibilidad]]+Tabla2[[#This Row],[Integridad]]+Tabla2[[#This Row],[Confidencialidad ]]>=8,\"Alta\",\"error\")))","v":"Baja"}]
["",null,null,null,null,null,null,null,null,null,null,null,null,null,null,null,null,null,null,null,null,null,null,null,null,{"$f":"IF((Tabla2[[#This Row],[Disponibilidad]]+Tabla2[[#This Row],[Integridad]]+Tabla2[[#This Row],[Confidencialidad ]]<=4),\"Baja\",IF(AND(Tabla2[[#This Row],[Disponibilidad]]+Tabla2[[#This Row],[Integridad]]+Tabla2[[#This Row],[Confidencialidad ]]>=5,Tabla2[[#This Row],[Disponibilidad]]+Tabla2[[#This Row],[Integridad]]+Tabla2[[#This Row],[Confidencialidad ]]<=7),\"Media\",IF(Tabla2[[#This Row],[Disponibilidad]]+Tabla2[[#This Row],[Integridad]]+Tabla2[[#This Row],[Confidencialidad ]]>=8,\"Alta\",\"error\")))","v":"Baja"}]
["",null,null,null,null,null,null,null,null,null,null,null,null,null,null,null,null,null,null,null,null,null,null,null,null,{"$f":"IF((Tabla2[[#This Row],[Disponibilidad]]+Tabla2[[#This Row],[Integridad]]+Tabla2[[#This Row],[Confidencialidad ]]<=4),\"Baja\",IF(AND(Tabla2[[#This Row],[Disponibilidad]]+Tabla2[[#This Row],[Integridad]]+Tabla2[[#This Row],[Confidencialidad ]]>=5,Tabla2[[#This Row],[Disponibilidad]]+Tabla2[[#This Row],[Integridad]]+Tabla2[[#This Row],[Confidencialidad ]]<=7),\"Media\",IF(Tabla2[[#This Row],[Disponibilidad]]+Tabla2[[#This Row],[Integridad]]+Tabla2[[#This Row],[Confidencialidad ]]>=8,\"Alta\",\"error\")))","v":"Baja"}]
["",null,null,null,null,null,null,null,null,null,null,null,null,null,null,null,null,null,null,null,null,null,null,null,null,{"$f":"IF((Tabla2[[#This Row],[Disponibilidad]]+Tabla2[[#This Row],[Integridad]]+Tabla2[[#This Row],[Confidencialidad ]]<=4),\"Baja\",IF(AND(Tabla2[[#This Row],[Disponibilidad]]+Tabla2[[#This Row],[Integridad]]+Tabla2[[#This Row],[Confidencialidad ]]>=5,Tabla2[[#This Row],[Disponibilidad]]+Tabla2[[#This Row],[Integridad]]+Tabla2[[#This Row],[Confidencialidad ]]<=7),\"Media\",IF(Tabla2[[#This Row],[Disponibilidad]]+Tabla2[[#This Row],[Integridad]]+Tabla2[[#This Row],[Confidencialidad ]]>=8,\"Alta\",\"error\")))","v":"Baja"}]
["",null,null,null,null,null,null,null,null,null,null,null,null,null,null,null,null,null,null,null,null,null,null,null,null,{"$f":"IF((Tabla2[[#This Row],[Disponibilidad]]+Tabla2[[#This Row],[Integridad]]+Tabla2[[#This Row],[Confidencialidad ]]<=4),\"Baja\",IF(AND(Tabla2[[#This Row],[Disponibilidad]]+Tabla2[[#This Row],[Integridad]]+Tabla2[[#This Row],[Confidencialidad ]]>=5,Tabla2[[#This Row],[Disponibilidad]]+Tabla2[[#This Row],[Integridad]]+Tabla2[[#This Row],[Confidencialidad ]]<=7),\"Media\",IF(Tabla2[[#This Row],[Disponibilidad]]+Tabla2[[#This Row],[Integridad]]+Tabla2[[#This Row],[Confidencialidad ]]>=8,\"Alta\",\"error\")))","v":"Baja"}]
["",null,null,null,null,null,null,null,null,null,null,null,null,null,null,null,null,null,null,null,null,null,null,null,null,{"$f":"IF((Tabla2[[#This Row],[Disponibilidad]]+Tabla2[[#This Row],[Integridad]]+Tabla2[[#This Row],[Confidencialidad ]]<=4),\"Baja\",IF(AND(Tabla2[[#This Row],[Disponibilidad]]+Tabla2[[#This Row],[Integridad]]+Tabla2[[#This Row],[Confidencialidad ]]>=5,Tabla2[[#This Row],[Disponibilidad]]+Tabla2[[#This Row],[Integridad]]+Tabla2[[#This Row],[Confidencialidad ]]<=7),\"Media\",IF(Tabla2[[#This Row],[Disponibilidad]]+Tabla2[[#This Row],[Integridad]]+Tabla2[[#This Row],[Confidencialidad ]]>=8,\"Alta\",\"error\")))","v":"Baja"}]
[{"$f":"IF(C650<>\"\",1,\"\")","v":""},null,null,null,null,null,null,null,null,null,null,null,null,null,null,null,null,null,null,null,null,null,null,null,null,{"$f":"IF((Tabla2[[#This Row],[Disponibilidad]]+Tabla2[[#This Row],[Integridad]]+Tabla2[[#This Row],[Confidencialidad ]]<=4),\"Baja\",IF(AND(Tabla2[[#This Row],[Disponibilidad]]+Tabla2[[#This Row],[Integridad]]+Tabla2[[#This Row],[Confidencialidad ]]>=5,Tabla2[[#This Row],[Disponibilidad]]+Tabla2[[#This Row],[Integridad]]+Tabla2[[#This Row],[Confidencialidad ]]<=7),\"Media\",IF(Tabla2[[#This Row],[Disponibilidad]]+Tabla2[[#This Row],[Integridad]]+Tabla2[[#This Row],[Confidencialidad ]]>=8,\"Alta\",\"error\")))","v":"Baja"}]
["",null,null,null,null,null,null,null,null,null,null,null,null,null,null,null,null,null,null,null,null,null,null,null,null,{"$f":"IF((Tabla2[[#This Row],[Disponibilidad]]+Tabla2[[#This Row],[Integridad]]+Tabla2[[#This Row],[Confidencialidad ]]<=4),\"Baja\",IF(AND(Tabla2[[#This Row],[Disponibilidad]]+Tabla2[[#This Row],[Integridad]]+Tabla2[[#This Row],[Confidencialidad ]]>=5,Tabla2[[#This Row],[Disponibilidad]]+Tabla2[[#This Row],[Integridad]]+Tabla2[[#This Row],[Confidencialidad ]]<=7),\"Media\",IF(Tabla2[[#This Row],[Disponibilidad]]+Tabla2[[#This Row],[Integridad]]+Tabla2[[#This Row],[Confidencialidad ]]>=8,\"Alta\",\"error\")))","v":"Baja"}]
["",null,null,null,null,null,null,null,null,null,null,null,null,null,null,null,null,null,null,null,null,null,null,null,null,{"$f":"IF((Tabla2[[#This Row],[Disponibilidad]]+Tabla2[[#This Row],[Integridad]]+Tabla2[[#This Row],[Confidencialidad ]]<=4),\"Baja\",IF(AND(Tabla2[[#This Row],[Disponibilidad]]+Tabla2[[#This Row],[Integridad]]+Tabla2[[#This Row],[Confidencialidad ]]>=5,Tabla2[[#This Row],[Disponibilidad]]+Tabla2[[#This Row],[Integridad]]+Tabla2[[#This Row],[Confidencialidad ]]<=7),\"Media\",IF(Tabla2[[#This Row],[Disponibilidad]]+Tabla2[[#This Row],[Integridad]]+Tabla2[[#This Row],[Confidencialidad ]]>=8,\"Alta\",\"error\")))","v":"Baja"}]
["",null,null,null,null,null,null,null,null,null,null,null,null,null,null,null,null,null,null,null,null,null,null,null,null,{"$f":"IF((Tabla2[[#This Row],[Disponibilidad]]+Tabla2[[#This Row],[Integridad]]+Tabla2[[#This Row],[Confidencialidad ]]<=4),\"Baja\",IF(AND(Tabla2[[#This Row],[Disponibilidad]]+Tabla2[[#This Row],[Integridad]]+Tabla2[[#This Row],[Confidencialidad ]]>=5,Tabla2[[#This Row],[Disponibilidad]]+Tabla2[[#This Row],[Integridad]]+Tabla2[[#This Row],[Confidencialidad ]]<=7),\"Media\",IF(Tabla2[[#This Row],[Disponibilidad]]+Tabla2[[#This Row],[Integridad]]+Tabla2[[#This Row],[Confidencialidad ]]>=8,\"Alta\",\"error\")))","v":"Baja"}]
["",null,null,null,null,null,null,null,null,null,null,null,null,null,null,null,null,null,null,null,null,null,null,null,null,{"$f":"IF((Tabla2[[#This Row],[Disponibilidad]]+Tabla2[[#This Row],[Integridad]]+Tabla2[[#This Row],[Confidencialidad ]]<=4),\"Baja\",IF(AND(Tabla2[[#This Row],[Disponibilidad]]+Tabla2[[#This Row],[Integridad]]+Tabla2[[#This Row],[Confidencialidad ]]>=5,Tabla2[[#This Row],[Disponibilidad]]+Tabla2[[#This Row],[Integridad]]+Tabla2[[#This Row],[Confidencialidad ]]<=7),\"Media\",IF(Tabla2[[#This Row],[Disponibilidad]]+Tabla2[[#This Row],[Integridad]]+Tabla2[[#This Row],[Confidencialidad ]]>=8,\"Alta\",\"error\")))","v":"Baja"}]
["",null,null,null,null,null,null,null,null,null,null,null,null,null,null,null,null,null,null,null,null,null,null,null,null,{"$f":"IF((Tabla2[[#This Row],[Disponibilidad]]+Tabla2[[#This Row],[Integridad]]+Tabla2[[#This Row],[Confidencialidad ]]<=4),\"Baja\",IF(AND(Tabla2[[#This Row],[Disponibilidad]]+Tabla2[[#This Row],[Integridad]]+Tabla2[[#This Row],[Confidencialidad ]]>=5,Tabla2[[#This Row],[Disponibilidad]]+Tabla2[[#This Row],[Integridad]]+Tabla2[[#This Row],[Confidencialidad ]]<=7),\"Media\",IF(Tabla2[[#This Row],[Disponibilidad]]+Tabla2[[#This Row],[Integridad]]+Tabla2[[#This Row],[Confidencialidad ]]>=8,\"Alta\",\"error\")))","v":"Baja"}]
["",null,null,null,null,null,null,null,null,null,null,null,null,null,null,null,null,null,null,null,null,null,null,null,null,{"$f":"IF((Tabla2[[#This Row],[Disponibilidad]]+Tabla2[[#This Row],[Integridad]]+Tabla2[[#This Row],[Confidencialidad ]]<=4),\"Baja\",IF(AND(Tabla2[[#This Row],[Disponibilidad]]+Tabla2[[#This Row],[Integridad]]+Tabla2[[#This Row],[Confidencialidad ]]>=5,Tabla2[[#This Row],[Disponibilidad]]+Tabla2[[#This Row],[Integridad]]+Tabla2[[#This Row],[Confidencialidad ]]<=7),\"Media\",IF(Tabla2[[#This Row],[Disponibilidad]]+Tabla2[[#This Row],[Integridad]]+Tabla2[[#This Row],[Confidencialidad ]]>=8,\"Alta\",\"error\")))","v":"Baja"}]
["",null,null,null,null,null,null,null,null,null,null,null,null,null,null,null,null,null,null,null,null,null,null,null,null,{"$f":"IF((Tabla2[[#This Row],[Disponibilidad]]+Tabla2[[#This Row],[Integridad]]+Tabla2[[#This Row],[Confidencialidad ]]<=4),\"Baja\",IF(AND(Tabla2[[#This Row],[Disponibilidad]]+Tabla2[[#This Row],[Integridad]]+Tabla2[[#This Row],[Confidencialidad ]]>=5,Tabla2[[#This Row],[Disponibilidad]]+Tabla2[[#This Row],[Integridad]]+Tabla2[[#This Row],[Confidencialidad ]]<=7),\"Media\",IF(Tabla2[[#This Row],[Disponibilidad]]+Tabla2[[#This Row],[Integridad]]+Tabla2[[#This Row],[Confidencialidad ]]>=8,\"Alta\",\"error\")))","v":"Baja"}]
["",null,null,null,null,null,null,null,null,null,null,null,null,null,null,null,null,null,null,null,null,null,null,null,null,{"$f":"IF((Tabla2[[#This Row],[Disponibilidad]]+Tabla2[[#This Row],[Integridad]]+Tabla2[[#This Row],[Confidencialidad ]]<=4),\"Baja\",IF(AND(Tabla2[[#This Row],[Disponibilidad]]+Tabla2[[#This Row],[Integridad]]+Tabla2[[#This Row],[Confidencialidad ]]>=5,Tabla2[[#This Row],[Disponibilidad]]+Tabla2[[#This Row],[Integridad]]+Tabla2[[#This Row],[Confidencialidad ]]<=7),\"Media\",IF(Tabla2[[#This Row],[Disponibilidad]]+Tabla2[[#This Row],[Integridad]]+Tabla2[[#This Row],[Confidencialidad ]]>=8,\"Alta\",\"error\")))","v":"Baja"}]
["",null,null,null,null,null,null,null,null,null,null,null,null,null,null,null,null,null,null,null,null,null,null,null,null,{"$f":"IF((Tabla2[[#This Row],[Disponibilidad]]+Tabla2[[#This Row],[Integridad]]+Tabla2[[#This Row],[Confidencialidad ]]<=4),\"Baja\",IF(AND(Tabla2[[#This Row],[Disponibilidad]]+Tabla2[[#This Row],[Integridad]]+Tabla2[[#This Row],[Confidencialidad ]]>=5,Tabla2[[#This Row],[Disponibilidad]]+Tabla2[[#This Row],[Integridad]]+Tabla2[[#This Row],[Confidencialidad ]]<=7),\"Media\",IF(Tabla2[[#This Row],[Disponibilidad]]+Tabla2[[#This Row],[Integridad]]+Tabla2[[#This Row],[Confidencialidad ]]>=8,\"Alta\",\"error\")))","v":"Baja"}]
["",null,null,null,null,null,null,null,null,null,null,null,null,null,null,null,null,null,null,null,null,null,null,null,null,{"$f":"IF((Tabla2[[#This Row],[Disponibilidad]]+Tabla2[[#This Row],[Integridad]]+Tabla2[[#This Row],[Confidencialidad ]]<=4),\"Baja\",IF(AND(Tabla2[[#This Row],[Disponibilidad]]+Tabla2[[#This Row],[Integridad]]+Tabla2[[#This Row],[Confidencialidad ]]>=5,Tabla2[[#This Row],[Disponibilidad]]+Tabla2[[#This Row],[Integridad]]+Tabla2[[#This Row],[Confidencialidad ]]<=7),\"Media\",IF(Tabla2[[#This Row],[Disponibilidad]]+Tabla2[[#This Row],[Integridad]]+Tabla2[[#This Row],[Confidencialidad ]]>=8,\"Alta\",\"error\")))","v":"Baja"}]
["",null,null,null,null,null,null,null,null,null,null,null,null,null,null,null,null,null,null,null,null,null,null,null,null,{"$f":"IF((Tabla2[[#This Row],[Disponibilidad]]+Tabla2[[#This Row],[Integridad]]+Tabla2[[#This Row],[Confidencialidad ]]<=4),\"Baja\",IF(AND(Tabla2[[#This Row],[Disponibilidad]]+Tabla2[[#This Row],[Integridad]]+Tabla2[[#This Row],[Confidencialidad ]]>=5,Tabla2[[#This Row],[Disponibilidad]]+Tabla2[[#This Row],[Integridad]]+Tabla2[[#This Row],[Confidencialidad ]]<=7),\"Media\",IF(Tabla2[[#This Row],[Disponibilidad]]+Tabla2[[#This Row],[Integridad]]+Tabla2[[#This Row],[Confidencialidad ]]>=8,\"Alta\",\"error\")))","v":"Baja"}]
["",null,null,null,null,null,null,null,null,null,null,null,null,null,null,null,null,null,null,null,null,null,null,null,null,{"$f":"IF((Tabla2[[#This Row],[Disponibilidad]]+Tabla2[[#This Row],[Integridad]]+Tabla2[[#This Row],[Confidencialidad ]]<=4),\"Baja\",IF(AND(Tabla2[[#This Row],[Disponibilidad]]+Tabla2[[#This Row],[Integridad]]+Tabla2[[#This Row],[Confidencialidad ]]>=5,Tabla2[[#This Row],[Disponibilidad]]+Tabla2[[#This Row],[Integridad]]+Tabla2[[#This Row],[Confidencialidad ]]<=7),\"Media\",IF(Tabla2[[#This Row],[Disponibilidad]]+Tabla2[[#This Row],[Integridad]]+Tabla2[[#This Row],[Confidencialidad ]]>=8,\"Alta\",\"error\")))","v":"Baja"}]
["",null,null,null,null,null,null,null,null,null,null,null,null,null,null,null,null,null,null,null,null,null,null,null,null,{"$f":"IF((Tabla2[[#This Row],[Disponibilidad]]+Tabla2[[#This Row],[Integridad]]+Tabla2[[#This Row],[Confidencialidad ]]<=4),\"Baja\",IF(AND(Tabla2[[#This Row],[Disponibilidad]]+Tabla2[[#This Row],[Integridad]]+Tabla2[[#This Row],[Confidencialidad ]]>=5,Tabla2[[#This Row],[Disponibilidad]]+Tabla2[[#This Row],[Integridad]]+Tabla2[[#This Row],[Confidencialidad ]]<=7),\"Media\",IF(Tabla2[[#This Row],[Disponibilidad]]+Tabla2[[#This Row],[Integridad]]+Tabla2[[#This Row],[Confidencialidad ]]>=8,\"Alta\",\"error\")))","v":"Baja"}]
["",null,null,null,null,null,null,null,null,null,null,null,null,null,null,null,null,null,null,null,null,null,null,null,null,{"$f":"IF((Tabla2[[#This Row],[Disponibilidad]]+Tabla2[[#This Row],[Integridad]]+Tabla2[[#This Row],[Confidencialidad ]]<=4),\"Baja\",IF(AND(Tabla2[[#This Row],[Disponibilidad]]+Tabla2[[#This Row],[Integridad]]+Tabla2[[#This Row],[Confidencialidad ]]>=5,Tabla2[[#This Row],[Disponibilidad]]+Tabla2[[#This Row],[Integridad]]+Tabla2[[#This Row],[Confidencialidad ]]<=7),\"Media\",IF(Tabla2[[#This Row],[Disponibilidad]]+Tabla2[[#This Row],[Integridad]]+Tabla2[[#This Row],[Confidencialidad ]]>=8,\"Alta\",\"error\")))","v":"Baja"}]
["",null,null,null,null,null,null,null,null,null,null,null,null,null,null,null,null,null,null,null,null,null,null,null,null,{"$f":"IF((Tabla2[[#This Row],[Disponibilidad]]+Tabla2[[#This Row],[Integridad]]+Tabla2[[#This Row],[Confidencialidad ]]<=4),\"Baja\",IF(AND(Tabla2[[#This Row],[Disponibilidad]]+Tabla2[[#This Row],[Integridad]]+Tabla2[[#This Row],[Confidencialidad ]]>=5,Tabla2[[#This Row],[Disponibilidad]]+Tabla2[[#This Row],[Integridad]]+Tabla2[[#This Row],[Confidencialidad ]]<=7),\"Media\",IF(Tabla2[[#This Row],[Disponibilidad]]+Tabla2[[#This Row],[Integridad]]+Tabla2[[#This Row],[Confidencialidad ]]>=8,\"Alta\",\"error\")))","v":"Baja"}]
["",null,null,null,null,null,null,null,null,null,null,null,null,null,null,null,null,null,null,null,null,null,null,null,null,{"$f":"IF((Tabla2[[#This Row],[Disponibilidad]]+Tabla2[[#This Row],[Integridad]]+Tabla2[[#This Row],[Confidencialidad ]]<=4),\"Baja\",IF(AND(Tabla2[[#This Row],[Disponibilidad]]+Tabla2[[#This Row],[Integridad]]+Tabla2[[#This Row],[Confidencialidad ]]>=5,Tabla2[[#This Row],[Disponibilidad]]+Tabla2[[#This Row],[Integridad]]+Tabla2[[#This Row],[Confidencialidad ]]<=7),\"Media\",IF(Tabla2[[#This Row],[Disponibilidad]]+Tabla2[[#This Row],[Integridad]]+Tabla2[[#This Row],[Confidencialidad ]]>=8,\"Alta\",\"error\")))","v":"Baja"}]
["",null,null,null,null,null,null,null,null,null,null,null,null,null,null,null,null,null,null,null,null,null,null,null,null,{"$f":"IF((Tabla2[[#This Row],[Disponibilidad]]+Tabla2[[#This Row],[Integridad]]+Tabla2[[#This Row],[Confidencialidad ]]<=4),\"Baja\",IF(AND(Tabla2[[#This Row],[Disponibilidad]]+Tabla2[[#This Row],[Integridad]]+Tabla2[[#This Row],[Confidencialidad ]]>=5,Tabla2[[#This Row],[Disponibilidad]]+Tabla2[[#This Row],[Integridad]]+Tabla2[[#This Row],[Confidencialidad ]]<=7),\"Media\",IF(Tabla2[[#This Row],[Disponibilidad]]+Tabla2[[#This Row],[Integridad]]+Tabla2[[#This Row],[Confidencialidad ]]>=8,\"Alta\",\"error\")))","v":"Baja"}]
["",null,null,null,null,null,null,null,null,null,null,null,null,null,null,null,null,null,null,null,null,null,null,null,null,{"$f":"IF((Tabla2[[#This Row],[Disponibilidad]]+Tabla2[[#This Row],[Integridad]]+Tabla2[[#This Row],[Confidencialidad ]]<=4),\"Baja\",IF(AND(Tabla2[[#This Row],[Disponibilidad]]+Tabla2[[#This Row],[Integridad]]+Tabla2[[#This Row],[Confidencialidad ]]>=5,Tabla2[[#This Row],[Disponibilidad]]+Tabla2[[#This Row],[Integridad]]+Tabla2[[#This Row],[Confidencialidad ]]<=7),\"Media\",IF(Tabla2[[#This Row],[Disponibilidad]]+Tabla2[[#This Row],[Integridad]]+Tabla2[[#This Row],[Confidencialidad ]]>=8,\"Alta\",\"error\")))","v":"Baja"}]
["",null,null,null,null,null,null,null,null,null,null,null,null,null,null,null,null,null,null,null,null,null,null,null,null,{"$f":"IF((Tabla2[[#This Row],[Disponibilidad]]+Tabla2[[#This Row],[Integridad]]+Tabla2[[#This Row],[Confidencialidad ]]<=4),\"Baja\",IF(AND(Tabla2[[#This Row],[Disponibilidad]]+Tabla2[[#This Row],[Integridad]]+Tabla2[[#This Row],[Confidencialidad ]]>=5,Tabla2[[#This Row],[Disponibilidad]]+Tabla2[[#This Row],[Integridad]]+Tabla2[[#This Row],[Confidencialidad ]]<=7),\"Media\",IF(Tabla2[[#This Row],[Disponibilidad]]+Tabla2[[#This Row],[Integridad]]+Tabla2[[#This Row],[Confidencialidad ]]>=8,\"Alta\",\"error\")))","v":"Baja"}]
["",null,null,null,null,null,null,null,null,null,null,null,null,null,null,null,null,null,null,null,null,null,null,null,null,{"$f":"IF((Tabla2[[#This Row],[Disponibilidad]]+Tabla2[[#This Row],[Integridad]]+Tabla2[[#This Row],[Confidencialidad ]]<=4),\"Baja\",IF(AND(Tabla2[[#This Row],[Disponibilidad]]+Tabla2[[#This Row],[Integridad]]+Tabla2[[#This Row],[Confidencialidad ]]>=5,Tabla2[[#This Row],[Disponibilidad]]+Tabla2[[#This Row],[Integridad]]+Tabla2[[#This Row],[Confidencialidad ]]<=7),\"Media\",IF(Tabla2[[#This Row],[Disponibilidad]]+Tabla2[[#This Row],[Integridad]]+Tabla2[[#This Row],[Confidencialidad ]]>=8,\"Alta\",\"error\")))","v":"Baja"}]
["",null,null,null,null,null,null,null,null,null,null,null,null,null,null,null,null,null,null,null,null,null,null,null,null,{"$f":"IF((Tabla2[[#This Row],[Disponibilidad]]+Tabla2[[#This Row],[Integridad]]+Tabla2[[#This Row],[Confidencialidad ]]<=4),\"Baja\",IF(AND(Tabla2[[#This Row],[Disponibilidad]]+Tabla2[[#This Row],[Integridad]]+Tabla2[[#This Row],[Confidencialidad ]]>=5,Tabla2[[#This Row],[Disponibilidad]]+Tabla2[[#This Row],[Integridad]]+Tabla2[[#This Row],[Confidencialidad ]]<=7),\"Media\",IF(Tabla2[[#This Row],[Disponibilidad]]+Tabla2[[#This Row],[Integridad]]+Tabla2[[#This Row],[Confidencialidad ]]>=8,\"Alta\",\"error\")))","v":"Baja"}]
["",null,null,null,null,null,null,null,null,null,null,null,null,null,null,null,null,null,null,null,null,null,null,null,null,{"$f":"IF((Tabla2[[#This Row],[Disponibilidad]]+Tabla2[[#This Row],[Integridad]]+Tabla2[[#This Row],[Confidencialidad ]]<=4),\"Baja\",IF(AND(Tabla2[[#This Row],[Disponibilidad]]+Tabla2[[#This Row],[Integridad]]+Tabla2[[#This Row],[Confidencialidad ]]>=5,Tabla2[[#This Row],[Disponibilidad]]+Tabla2[[#This Row],[Integridad]]+Tabla2[[#This Row],[Confidencialidad ]]<=7),\"Media\",IF(Tabla2[[#This Row],[Disponibilidad]]+Tabla2[[#This Row],[Integridad]]+Tabla2[[#This Row],[Confidencialidad ]]>=8,\"Alta\",\"error\")))","v":"Baja"}]
["",null,null,null,null,null,null,null,null,null,null,null,null,null,null,null,null,null,null,null,null,null,null,null,null,{"$f":"IF((Tabla2[[#This Row],[Disponibilidad]]+Tabla2[[#This Row],[Integridad]]+Tabla2[[#This Row],[Confidencialidad ]]<=4),\"Baja\",IF(AND(Tabla2[[#This Row],[Disponibilidad]]+Tabla2[[#This Row],[Integridad]]+Tabla2[[#This Row],[Confidencialidad ]]>=5,Tabla2[[#This Row],[Disponibilidad]]+Tabla2[[#This Row],[Integridad]]+Tabla2[[#This Row],[Confidencialidad ]]<=7),\"Media\",IF(Tabla2[[#This Row],[Disponibilidad]]+Tabla2[[#This Row],[Integridad]]+Tabla2[[#This Row],[Confidencialidad ]]>=8,\"Alta\",\"error\")))","v":"Baja"}]
["",null,null,null,null,null,null,null,null,null,null,null,null,null,null,null,null,null,null,null,null,null,null,null,null,{"$f":"IF((Tabla2[[#This Row],[Disponibilidad]]+Tabla2[[#This Row],[Integridad]]+Tabla2[[#This Row],[Confidencialidad ]]<=4),\"Baja\",IF(AND(Tabla2[[#This Row],[Disponibilidad]]+Tabla2[[#This Row],[Integridad]]+Tabla2[[#This Row],[Confidencialidad ]]>=5,Tabla2[[#This Row],[Disponibilidad]]+Tabla2[[#This Row],[Integridad]]+Tabla2[[#This Row],[Confidencialidad ]]<=7),\"Media\",IF(Tabla2[[#This Row],[Disponibilidad]]+Tabla2[[#This Row],[Integridad]]+Tabla2[[#This Row],[Confidencialidad ]]>=8,\"Alta\",\"error\")))","v":"Baja"}]
["",null,null,null,null,null,null,null,null,null,null,null,null,null,null,null,null,null,null,null,null,null,null,null,null,{"$f":"IF((Tabla2[[#This Row],[Disponibilidad]]+Tabla2[[#This Row],[Integridad]]+Tabla2[[#This Row],[Confidencialidad ]]<=4),\"Baja\",IF(AND(Tabla2[[#This Row],[Disponibilidad]]+Tabla2[[#This Row],[Integridad]]+Tabla2[[#This Row],[Confidencialidad ]]>=5,Tabla2[[#This Row],[Disponibilidad]]+Tabla2[[#This Row],[Integridad]]+Tabla2[[#This Row],[Confidencialidad ]]<=7),\"Media\",IF(Tabla2[[#This Row],[Disponibilidad]]+Tabla2[[#This Row],[Integridad]]+Tabla2[[#This Row],[Confidencialidad ]]>=8,\"Alta\",\"error\")))","v":"Baja"}]
["",null,null,null,null,null,null,null,null,null,null,null,null,null,null,null,null,null,null,null,null,null,null,null,null,{"$f":"IF((Tabla2[[#This Row],[Disponibilidad]]+Tabla2[[#This Row],[Integridad]]+Tabla2[[#This Row],[Confidencialidad ]]<=4),\"Baja\",IF(AND(Tabla2[[#This Row],[Disponibilidad]]+Tabla2[[#This Row],[Integridad]]+Tabla2[[#This Row],[Confidencialidad ]]>=5,Tabla2[[#This Row],[Disponibilidad]]+Tabla2[[#This Row],[Integridad]]+Tabla2[[#This Row],[Confidencialidad ]]<=7),\"Media\",IF(Tabla2[[#This Row],[Disponibilidad]]+Tabla2[[#This Row],[Integridad]]+Tabla2[[#This Row],[Confidencialidad ]]>=8,\"Alta\",\"error\")))","v":"Baja"}]
["",null,null,null,null,null,null,null,null,null,null,null,null,null,null,null,null,null,null,null,null,null,null,null,null,{"$f":"IF((Tabla2[[#This Row],[Disponibilidad]]+Tabla2[[#This Row],[Integridad]]+Tabla2[[#This Row],[Confidencialidad ]]<=4),\"Baja\",IF(AND(Tabla2[[#This Row],[Disponibilidad]]+Tabla2[[#This Row],[Integridad]]+Tabla2[[#This Row],[Confidencialidad ]]>=5,Tabla2[[#This Row],[Disponibilidad]]+Tabla2[[#This Row],[Integridad]]+Tabla2[[#This Row],[Confidencialidad ]]<=7),\"Media\",IF(Tabla2[[#This Row],[Disponibilidad]]+Tabla2[[#This Row],[Integridad]]+Tabla2[[#This Row],[Confidencialidad ]]>=8,\"Alta\",\"error\")))","v":"Baja"}]
["",null,null,null,null,null,null,null,null,null,null,null,null,null,null,null,null,null,null,null,null,null,null,null,null,{"$f":"IF((Tabla2[[#This Row],[Disponibilidad]]+Tabla2[[#This Row],[Integridad]]+Tabla2[[#This Row],[Confidencialidad ]]<=4),\"Baja\",IF(AND(Tabla2[[#This Row],[Disponibilidad]]+Tabla2[[#This Row],[Integridad]]+Tabla2[[#This Row],[Confidencialidad ]]>=5,Tabla2[[#This Row],[Disponibilidad]]+Tabla2[[#This Row],[Integridad]]+Tabla2[[#This Row],[Confidencialidad ]]<=7),\"Media\",IF(Tabla2[[#This Row],[Disponibilidad]]+Tabla2[[#This Row],[Integridad]]+Tabla2[[#This Row],[Confidencialidad ]]>=8,\"Alta\",\"error\")))","v":"Baja"}]
["",null,null,null,null,null,null,null,null,null,null,null,null,null,null,null,null,null,null,null,null,null,null,null,null,{"$f":"IF((Tabla2[[#This Row],[Disponibilidad]]+Tabla2[[#This Row],[Integridad]]+Tabla2[[#This Row],[Confidencialidad ]]<=4),\"Baja\",IF(AND(Tabla2[[#This Row],[Disponibilidad]]+Tabla2[[#This Row],[Integridad]]+Tabla2[[#This Row],[Confidencialidad ]]>=5,Tabla2[[#This Row],[Disponibilidad]]+Tabla2[[#This Row],[Integridad]]+Tabla2[[#This Row],[Confidencialidad ]]<=7),\"Media\",IF(Tabla2[[#This Row],[Disponibilidad]]+Tabla2[[#This Row],[Integridad]]+Tabla2[[#This Row],[Confidencialidad ]]>=8,\"Alta\",\"error\")))","v":"Baja"}]
["",null,null,null,null,null,null,null,null,null,null,null,null,null,null,null,null,null,null,null,null,null,null,null,null,{"$f":"IF((Tabla2[[#This Row],[Disponibilidad]]+Tabla2[[#This Row],[Integridad]]+Tabla2[[#This Row],[Confidencialidad ]]<=4),\"Baja\",IF(AND(Tabla2[[#This Row],[Disponibilidad]]+Tabla2[[#This Row],[Integridad]]+Tabla2[[#This Row],[Confidencialidad ]]>=5,Tabla2[[#This Row],[Disponibilidad]]+Tabla2[[#This Row],[Integridad]]+Tabla2[[#This Row],[Confidencialidad ]]<=7),\"Media\",IF(Tabla2[[#This Row],[Disponibilidad]]+Tabla2[[#This Row],[Integridad]]+Tabla2[[#This Row],[Confidencialidad ]]>=8,\"Alta\",\"error\")))","v":"Baja"}]
["",null,null,null,null,null,null,null,null,null,null,null,null,null,null,null,null,null,null,null,null,null,null,null,null,{"$f":"IF((Tabla2[[#This Row],[Disponibilidad]]+Tabla2[[#This Row],[Integridad]]+Tabla2[[#This Row],[Confidencialidad ]]<=4),\"Baja\",IF(AND(Tabla2[[#This Row],[Disponibilidad]]+Tabla2[[#This Row],[Integridad]]+Tabla2[[#This Row],[Confidencialidad ]]>=5,Tabla2[[#This Row],[Disponibilidad]]+Tabla2[[#This Row],[Integridad]]+Tabla2[[#This Row],[Confidencialidad ]]<=7),\"Media\",IF(Tabla2[[#This Row],[Disponibilidad]]+Tabla2[[#This Row],[Integridad]]+Tabla2[[#This Row],[Confidencialidad ]]>=8,\"Alta\",\"error\")))","v":"Baja"}]
[{"$f":"IF(C682<>\"\",1,\"\")","v":""},null,null,null,null,null,null,null,null,null,null,null,null,null,null,null,null,null,null,null,null,null,null,null,null,{"$f":"IF((Tabla2[[#This Row],[Disponibilidad]]+Tabla2[[#This Row],[Integridad]]+Tabla2[[#This Row],[Confidencialidad ]]<=4),\"Baja\",IF(AND(Tabla2[[#This Row],[Disponibilidad]]+Tabla2[[#This Row],[Integridad]]+Tabla2[[#This Row],[Confidencialidad ]]>=5,Tabla2[[#This Row],[Disponibilidad]]+Tabla2[[#This Row],[Integridad]]+Tabla2[[#This Row],[Confidencialidad ]]<=7),\"Media\",IF(Tabla2[[#This Row],[Disponibilidad]]+Tabla2[[#This Row],[Integridad]]+Tabla2[[#This Row],[Confidencialidad ]]>=8,\"Alta\",\"error\")))","v":"Baja"}]
["",null,null,null,null,null,null,null,null,null,null,null,null,null,null,null,null,null,null,null,null,null,null,null,null,{"$f":"IF((Tabla2[[#This Row],[Disponibilidad]]+Tabla2[[#This Row],[Integridad]]+Tabla2[[#This Row],[Confidencialidad ]]<=4),\"Baja\",IF(AND(Tabla2[[#This Row],[Disponibilidad]]+Tabla2[[#This Row],[Integridad]]+Tabla2[[#This Row],[Confidencialidad ]]>=5,Tabla2[[#This Row],[Disponibilidad]]+Tabla2[[#This Row],[Integridad]]+Tabla2[[#This Row],[Confidencialidad ]]<=7),\"Media\",IF(Tabla2[[#This Row],[Disponibilidad]]+Tabla2[[#This Row],[Integridad]]+Tabla2[[#This Row],[Confidencialidad ]]>=8,\"Alta\",\"error\")))","v":"Baja"}]
["",null,null,null,null,null,null,null,null,null,null,null,null,null,null,null,null,null,null,null,null,null,null,null,null,{"$f":"IF((Tabla2[[#This Row],[Disponibilidad]]+Tabla2[[#This Row],[Integridad]]+Tabla2[[#This Row],[Confidencialidad ]]<=4),\"Baja\",IF(AND(Tabla2[[#This Row],[Disponibilidad]]+Tabla2[[#This Row],[Integridad]]+Tabla2[[#This Row],[Confidencialidad ]]>=5,Tabla2[[#This Row],[Disponibilidad]]+Tabla2[[#This Row],[Integridad]]+Tabla2[[#This Row],[Confidencialidad ]]<=7),\"Media\",IF(Tabla2[[#This Row],[Disponibilidad]]+Tabla2[[#This Row],[Integridad]]+Tabla2[[#This Row],[Confidencialidad ]]>=8,\"Alta\",\"error\")))","v":"Baja"}]
["",null,null,null,null,null,null,null,null,null,null,null,null,null,null,null,null,null,null,null,null,null,null,null,null,{"$f":"IF((Tabla2[[#This Row],[Disponibilidad]]+Tabla2[[#This Row],[Integridad]]+Tabla2[[#This Row],[Confidencialidad ]]<=4),\"Baja\",IF(AND(Tabla2[[#This Row],[Disponibilidad]]+Tabla2[[#This Row],[Integridad]]+Tabla2[[#This Row],[Confidencialidad ]]>=5,Tabla2[[#This Row],[Disponibilidad]]+Tabla2[[#This Row],[Integridad]]+Tabla2[[#This Row],[Confidencialidad ]]<=7),\"Media\",IF(Tabla2[[#This Row],[Disponibilidad]]+Tabla2[[#This Row],[Integridad]]+Tabla2[[#This Row],[Confidencialidad ]]>=8,\"Alta\",\"error\")))","v":"Baja"}]
["",null,null,null,null,null,null,null,null,null,null,null,null,null,null,null,null,null,null,null,null,null,null,null,null,{"$f":"IF((Tabla2[[#This Row],[Disponibilidad]]+Tabla2[[#This Row],[Integridad]]+Tabla2[[#This Row],[Confidencialidad ]]<=4),\"Baja\",IF(AND(Tabla2[[#This Row],[Disponibilidad]]+Tabla2[[#This Row],[Integridad]]+Tabla2[[#This Row],[Confidencialidad ]]>=5,Tabla2[[#This Row],[Disponibilidad]]+Tabla2[[#This Row],[Integridad]]+Tabla2[[#This Row],[Confidencialidad ]]<=7),\"Media\",IF(Tabla2[[#This Row],[Disponibilidad]]+Tabla2[[#This Row],[Integridad]]+Tabla2[[#This Row],[Confidencialidad ]]>=8,\"Alta\",\"error\")))","v":"Baja"}]
["",null,null,null,null,null,null,null,null,null,null,null,null,null,null,null,null,null,null,null,null,null,null,null,null,{"$f":"IF((Tabla2[[#This Row],[Disponibilidad]]+Tabla2[[#This Row],[Integridad]]+Tabla2[[#This Row],[Confidencialidad ]]<=4),\"Baja\",IF(AND(Tabla2[[#This Row],[Disponibilidad]]+Tabla2[[#This Row],[Integridad]]+Tabla2[[#This Row],[Confidencialidad ]]>=5,Tabla2[[#This Row],[Disponibilidad]]+Tabla2[[#This Row],[Integridad]]+Tabla2[[#This Row],[Confidencialidad ]]<=7),\"Media\",IF(Tabla2[[#This Row],[Disponibilidad]]+Tabla2[[#This Row],[Integridad]]+Tabla2[[#This Row],[Confidencialidad ]]>=8,\"Alta\",\"error\")))","v":"Baja"}]
["",null,null,null,null,null,null,null,null,null,null,null,null,null,null,null,null,null,null,null,null,null,null,null,null,{"$f":"IF((Tabla2[[#This Row],[Disponibilidad]]+Tabla2[[#This Row],[Integridad]]+Tabla2[[#This Row],[Confidencialidad ]]<=4),\"Baja\",IF(AND(Tabla2[[#This Row],[Disponibilidad]]+Tabla2[[#This Row],[Integridad]]+Tabla2[[#This Row],[Confidencialidad ]]>=5,Tabla2[[#This Row],[Disponibilidad]]+Tabla2[[#This Row],[Integridad]]+Tabla2[[#This Row],[Confidencialidad ]]<=7),\"Media\",IF(Tabla2[[#This Row],[Disponibilidad]]+Tabla2[[#This Row],[Integridad]]+Tabla2[[#This Row],[Confidencialidad ]]>=8,\"Alta\",\"error\")))","v":"Baja"}]
["",null,null,null,null,null,null,null,null,null,null,null,null,null,null,null,null,null,null,null,null,null,null,null,null,{"$f":"IF((Tabla2[[#This Row],[Disponibilidad]]+Tabla2[[#This Row],[Integridad]]+Tabla2[[#This Row],[Confidencialidad ]]<=4),\"Baja\",IF(AND(Tabla2[[#This Row],[Disponibilidad]]+Tabla2[[#This Row],[Integridad]]+Tabla2[[#This Row],[Confidencialidad ]]>=5,Tabla2[[#This Row],[Disponibilidad]]+Tabla2[[#This Row],[Integridad]]+Tabla2[[#This Row],[Confidencialidad ]]<=7),\"Media\",IF(Tabla2[[#This Row],[Disponibilidad]]+Tabla2[[#This Row],[Integridad]]+Tabla2[[#This Row],[Confidencialidad ]]>=8,\"Alta\",\"error\")))","v":"Baja"}]
["",null,null,null,null,null,null,null,null,null,null,null,null,null,null,null,null,null,null,null,null,null,null,null,null,{"$f":"IF((Tabla2[[#This Row],[Disponibilidad]]+Tabla2[[#This Row],[Integridad]]+Tabla2[[#This Row],[Confidencialidad ]]<=4),\"Baja\",IF(AND(Tabla2[[#This Row],[Disponibilidad]]+Tabla2[[#This Row],[Integridad]]+Tabla2[[#This Row],[Confidencialidad ]]>=5,Tabla2[[#This Row],[Disponibilidad]]+Tabla2[[#This Row],[Integridad]]+Tabla2[[#This Row],[Confidencialidad ]]<=7),\"Media\",IF(Tabla2[[#This Row],[Disponibilidad]]+Tabla2[[#This Row],[Integridad]]+Tabla2[[#This Row],[Confidencialidad ]]>=8,\"Alta\",\"error\")))","v":"Baja"}]
["",null,null,null,null,null,null,null,null,null,null,null,null,null,null,null,null,null,null,null,null,null,null,null,null,{"$f":"IF((Tabla2[[#This Row],[Disponibilidad]]+Tabla2[[#This Row],[Integridad]]+Tabla2[[#This Row],[Confidencialidad ]]<=4),\"Baja\",IF(AND(Tabla2[[#This Row],[Disponibilidad]]+Tabla2[[#This Row],[Integridad]]+Tabla2[[#This Row],[Confidencialidad ]]>=5,Tabla2[[#This Row],[Disponibilidad]]+Tabla2[[#This Row],[Integridad]]+Tabla2[[#This Row],[Confidencialidad ]]<=7),\"Media\",IF(Tabla2[[#This Row],[Disponibilidad]]+Tabla2[[#This Row],[Integridad]]+Tabla2[[#This Row],[Confidencialidad ]]>=8,\"Alta\",\"error\")))","v":"Baja"}]
["",null,null,null,null,null,null,null,null,null,null,null,null,null,null,null,null,null,null,null,null,null,null,null,null,{"$f":"IF((Tabla2[[#This Row],[Disponibilidad]]+Tabla2[[#This Row],[Integridad]]+Tabla2[[#This Row],[Confidencialidad ]]<=4),\"Baja\",IF(AND(Tabla2[[#This Row],[Disponibilidad]]+Tabla2[[#This Row],[Integridad]]+Tabla2[[#This Row],[Confidencialidad ]]>=5,Tabla2[[#This Row],[Disponibilidad]]+Tabla2[[#This Row],[Integridad]]+Tabla2[[#This Row],[Confidencialidad ]]<=7),\"Media\",IF(Tabla2[[#This Row],[Disponibilidad]]+Tabla2[[#This Row],[Integridad]]+Tabla2[[#This Row],[Confidencialidad ]]>=8,\"Alta\",\"error\")))","v":"Baja"}]
["",null,null,null,null,null,null,null,null,null,null,null,null,null,null,null,null,null,null,null,null,null,null,null,null,{"$f":"IF((Tabla2[[#This Row],[Disponibilidad]]+Tabla2[[#This Row],[Integridad]]+Tabla2[[#This Row],[Confidencialidad ]]<=4),\"Baja\",IF(AND(Tabla2[[#This Row],[Disponibilidad]]+Tabla2[[#This Row],[Integridad]]+Tabla2[[#This Row],[Confidencialidad ]]>=5,Tabla2[[#This Row],[Disponibilidad]]+Tabla2[[#This Row],[Integridad]]+Tabla2[[#This Row],[Confidencialidad ]]<=7),\"Media\",IF(Tabla2[[#This Row],[Disponibilidad]]+Tabla2[[#This Row],[Integridad]]+Tabla2[[#This Row],[Confidencialidad ]]>=8,\"Alta\",\"error\")))","v":"Baja"}]
["",null,null,null,null,null,null,null,null,null,null,null,null,null,null,null,null,null,null,null,null,null,null,null,null,{"$f":"IF((Tabla2[[#This Row],[Disponibilidad]]+Tabla2[[#This Row],[Integridad]]+Tabla2[[#This Row],[Confidencialidad ]]<=4),\"Baja\",IF(AND(Tabla2[[#This Row],[Disponibilidad]]+Tabla2[[#This Row],[Integridad]]+Tabla2[[#This Row],[Confidencialidad ]]>=5,Tabla2[[#This Row],[Disponibilidad]]+Tabla2[[#This Row],[Integridad]]+Tabla2[[#This Row],[Confidencialidad ]]<=7),\"Media\",IF(Tabla2[[#This Row],[Disponibilidad]]+Tabla2[[#This Row],[Integridad]]+Tabla2[[#This Row],[Confidencialidad ]]>=8,\"Alta\",\"error\")))","v":"Baja"}]
["",null,null,null,null,null,null,null,null,null,null,null,null,null,null,null,null,null,null,null,null,null,null,null,null,{"$f":"IF((Tabla2[[#This Row],[Disponibilidad]]+Tabla2[[#This Row],[Integridad]]+Tabla2[[#This Row],[Confidencialidad ]]<=4),\"Baja\",IF(AND(Tabla2[[#This Row],[Disponibilidad]]+Tabla2[[#This Row],[Integridad]]+Tabla2[[#This Row],[Confidencialidad ]]>=5,Tabla2[[#This Row],[Disponibilidad]]+Tabla2[[#This Row],[Integridad]]+Tabla2[[#This Row],[Confidencialidad ]]<=7),\"Media\",IF(Tabla2[[#This Row],[Disponibilidad]]+Tabla2[[#This Row],[Integridad]]+Tabla2[[#This Row],[Confidencialidad ]]>=8,\"Alta\",\"error\")))","v":"Baja"}]
["",null,null,null,null,null,null,null,null,null,null,null,null,null,null,null,null,null,null,null,null,null,null,null,null,{"$f":"IF((Tabla2[[#This Row],[Disponibilidad]]+Tabla2[[#This Row],[Integridad]]+Tabla2[[#This Row],[Confidencialidad ]]<=4),\"Baja\",IF(AND(Tabla2[[#This Row],[Disponibilidad]]+Tabla2[[#This Row],[Integridad]]+Tabla2[[#This Row],[Confidencialidad ]]>=5,Tabla2[[#This Row],[Disponibilidad]]+Tabla2[[#This Row],[Integridad]]+Tabla2[[#This Row],[Confidencialidad ]]<=7),\"Media\",IF(Tabla2[[#This Row],[Disponibilidad]]+Tabla2[[#This Row],[Integridad]]+Tabla2[[#This Row],[Confidencialidad ]]>=8,\"Alta\",\"error\")))","v":"Baja"}]
["",null,null,null,null,null,null,null,null,null,null,null,null,null,null,null,null,null,null,null,null,null,null,null,null,{"$f":"IF((Tabla2[[#This Row],[Disponibilidad]]+Tabla2[[#This Row],[Integridad]]+Tabla2[[#This Row],[Confidencialidad ]]<=4),\"Baja\",IF(AND(Tabla2[[#This Row],[Disponibilidad]]+Tabla2[[#This Row],[Integridad]]+Tabla2[[#This Row],[Confidencialidad ]]>=5,Tabla2[[#This Row],[Disponibilidad]]+Tabla2[[#This Row],[Integridad]]+Tabla2[[#This Row],[Confidencialidad ]]<=7),\"Media\",IF(Tabla2[[#This Row],[Disponibilidad]]+Tabla2[[#This Row],[Integridad]]+Tabla2[[#This Row],[Confidencialidad ]]>=8,\"Alta\",\"error\")))","v":"Baja"}]
["",null,null,null,null,null,null,null,null,null,null,null,null,null,null,null,null,null,null,null,null,null,null,null,null,{"$f":"IF((Tabla2[[#This Row],[Disponibilidad]]+Tabla2[[#This Row],[Integridad]]+Tabla2[[#This Row],[Confidencialidad ]]<=4),\"Baja\",IF(AND(Tabla2[[#This Row],[Disponibilidad]]+Tabla2[[#This Row],[Integridad]]+Tabla2[[#This Row],[Confidencialidad ]]>=5,Tabla2[[#This Row],[Disponibilidad]]+Tabla2[[#This Row],[Integridad]]+Tabla2[[#This Row],[Confidencialidad ]]<=7),\"Media\",IF(Tabla2[[#This Row],[Disponibilidad]]+Tabla2[[#This Row],[Integridad]]+Tabla2[[#This Row],[Confidencialidad ]]>=8,\"Alta\",\"error\")))","v":"Baja"}]
["",null,null,null,null,null,null,null,null,null,null,null,null,null,null,null,null,null,null,null,null,null,null,null,null,{"$f":"IF((Tabla2[[#This Row],[Disponibilidad]]+Tabla2[[#This Row],[Integridad]]+Tabla2[[#This Row],[Confidencialidad ]]<=4),\"Baja\",IF(AND(Tabla2[[#This Row],[Disponibilidad]]+Tabla2[[#This Row],[Integridad]]+Tabla2[[#This Row],[Confidencialidad ]]>=5,Tabla2[[#This Row],[Disponibilidad]]+Tabla2[[#This Row],[Integridad]]+Tabla2[[#This Row],[Confidencialidad ]]<=7),\"Media\",IF(Tabla2[[#This Row],[Disponibilidad]]+Tabla2[[#This Row],[Integridad]]+Tabla2[[#This Row],[Confidencialidad ]]>=8,\"Alta\",\"error\")))","v":"Baja"}]
["",null,null,null,null,null,null,null,null,null,null,null,null,null,null,null,null,null,null,null,null,null,null,null,null,{"$f":"IF((Tabla2[[#This Row],[Disponibilidad]]+Tabla2[[#This Row],[Integridad]]+Tabla2[[#This Row],[Confidencialidad ]]<=4),\"Baja\",IF(AND(Tabla2[[#This Row],[Disponibilidad]]+Tabla2[[#This Row],[Integridad]]+Tabla2[[#This Row],[Confidencialidad ]]>=5,Tabla2[[#This Row],[Disponibilidad]]+Tabla2[[#This Row],[Integridad]]+Tabla2[[#This Row],[Confidencialidad ]]<=7),\"Media\",IF(Tabla2[[#This Row],[Disponibilidad]]+Tabla2[[#This Row],[Integridad]]+Tabla2[[#This Row],[Confidencialidad ]]>=8,\"Alta\",\"error\")))","v":"Baja"}]
["",null,null,null,null,null,null,null,null,null,null,null,null,null,null,null,null,null,null,null,null,null,null,null,null,{"$f":"IF((Tabla2[[#This Row],[Disponibilidad]]+Tabla2[[#This Row],[Integridad]]+Tabla2[[#This Row],[Confidencialidad ]]<=4),\"Baja\",IF(AND(Tabla2[[#This Row],[Disponibilidad]]+Tabla2[[#This Row],[Integridad]]+Tabla2[[#This Row],[Confidencialidad ]]>=5,Tabla2[[#This Row],[Disponibilidad]]+Tabla2[[#This Row],[Integridad]]+Tabla2[[#This Row],[Confidencialidad ]]<=7),\"Media\",IF(Tabla2[[#This Row],[Disponibilidad]]+Tabla2[[#This Row],[Integridad]]+Tabla2[[#This Row],[Confidencialidad ]]>=8,\"Alta\",\"error\")))","v":"Baja"}]
["",null,null,null,null,null,null,null,null,null,null,null,null,null,null,null,null,null,null,null,null,null,null,null,null,{"$f":"IF((Tabla2[[#This Row],[Disponibilidad]]+Tabla2[[#This Row],[Integridad]]+Tabla2[[#This Row],[Confidencialidad ]]<=4),\"Baja\",IF(AND(Tabla2[[#This Row],[Disponibilidad]]+Tabla2[[#This Row],[Integridad]]+Tabla2[[#This Row],[Confidencialidad ]]>=5,Tabla2[[#This Row],[Disponibilidad]]+Tabla2[[#This Row],[Integridad]]+Tabla2[[#This Row],[Confidencialidad ]]<=7),\"Media\",IF(Tabla2[[#This Row],[Disponibilidad]]+Tabla2[[#This Row],[Integridad]]+Tabla2[[#This Row],[Confidencialidad ]]>=8,\"Alta\",\"error\")))","v":"Baja"}]
["",null,null,null,null,null,null,null,null,null,null,null,null,null,null,null,null,null,null,null,null,null,null,null,null,{"$f":"IF((Tabla2[[#This Row],[Disponibilidad]]+Tabla2[[#This Row],[Integridad]]+Tabla2[[#This Row],[Confidencialidad ]]<=4),\"Baja\",IF(AND(Tabla2[[#This Row],[Disponibilidad]]+Tabla2[[#This Row],[Integridad]]+Tabla2[[#This Row],[Confidencialidad ]]>=5,Tabla2[[#This Row],[Disponibilidad]]+Tabla2[[#This Row],[Integridad]]+Tabla2[[#This Row],[Confidencialidad ]]<=7),\"Media\",IF(Tabla2[[#This Row],[Disponibilidad]]+Tabla2[[#This Row],[Integridad]]+Tabla2[[#This Row],[Confidencialidad ]]>=8,\"Alta\",\"error\")))","v":"Baja"}]
["",null,null,null,null,null,null,null,null,null,null,null,null,null,null,null,null,null,null,null,null,null,null,null,null,{"$f":"IF((Tabla2[[#This Row],[Disponibilidad]]+Tabla2[[#This Row],[Integridad]]+Tabla2[[#This Row],[Confidencialidad ]]<=4),\"Baja\",IF(AND(Tabla2[[#This Row],[Disponibilidad]]+Tabla2[[#This Row],[Integridad]]+Tabla2[[#This Row],[Confidencialidad ]]>=5,Tabla2[[#This Row],[Disponibilidad]]+Tabla2[[#This Row],[Integridad]]+Tabla2[[#This Row],[Confidencialidad ]]<=7),\"Media\",IF(Tabla2[[#This Row],[Disponibilidad]]+Tabla2[[#This Row],[Integridad]]+Tabla2[[#This Row],[Confidencialidad ]]>=8,\"Alta\",\"error\")))","v":"Baja"}]
["",null,null,null,null,null,null,null,null,null,null,null,null,null,null,null,null,null,null,null,null,null,null,null,null,{"$f":"IF((Tabla2[[#This Row],[Disponibilidad]]+Tabla2[[#This Row],[Integridad]]+Tabla2[[#This Row],[Confidencialidad ]]<=4),\"Baja\",IF(AND(Tabla2[[#This Row],[Disponibilidad]]+Tabla2[[#This Row],[Integridad]]+Tabla2[[#This Row],[Confidencialidad ]]>=5,Tabla2[[#This Row],[Disponibilidad]]+Tabla2[[#This Row],[Integridad]]+Tabla2[[#This Row],[Confidencialidad ]]<=7),\"Media\",IF(Tabla2[[#This Row],[Disponibilidad]]+Tabla2[[#This Row],[Integridad]]+Tabla2[[#This Row],[Confidencialidad ]]>=8,\"Alta\",\"error\")))","v":"Baja"}]
["",null,null,null,null,null,null,null,null,null,null,null,null,null,null,null,null,null,null,null,null,null,null,null,null,{"$f":"IF((Tabla2[[#This Row],[Disponibilidad]]+Tabla2[[#This Row],[Integridad]]+Tabla2[[#This Row],[Confidencialidad ]]<=4),\"Baja\",IF(AND(Tabla2[[#This Row],[Disponibilidad]]+Tabla2[[#This Row],[Integridad]]+Tabla2[[#This Row],[Confidencialidad ]]>=5,Tabla2[[#This Row],[Disponibilidad]]+Tabla2[[#This Row],[Integridad]]+Tabla2[[#This Row],[Confidencialidad ]]<=7),\"Media\",IF(Tabla2[[#This Row],[Disponibilidad]]+Tabla2[[#This Row],[Integridad]]+Tabla2[[#This Row],[Confidencialidad ]]>=8,\"Alta\",\"error\")))","v":"Baja"}]
["",null,null,null,null,null,null,null,null,null,null,null,null,null,null,null,null,null,null,null,null,null,null,null,null,{"$f":"IF((Tabla2[[#This Row],[Disponibilidad]]+Tabla2[[#This Row],[Integridad]]+Tabla2[[#This Row],[Confidencialidad ]]<=4),\"Baja\",IF(AND(Tabla2[[#This Row],[Disponibilidad]]+Tabla2[[#This Row],[Integridad]]+Tabla2[[#This Row],[Confidencialidad ]]>=5,Tabla2[[#This Row],[Disponibilidad]]+Tabla2[[#This Row],[Integridad]]+Tabla2[[#This Row],[Confidencialidad ]]<=7),\"Media\",IF(Tabla2[[#This Row],[Disponibilidad]]+Tabla2[[#This Row],[Integridad]]+Tabla2[[#This Row],[Confidencialidad ]]>=8,\"Alta\",\"error\")))","v":"Baja"}]
["",null,null,null,null,null,null,null,null,null,null,null,null,null,null,null,null,null,null,null,null,null,null,null,null,{"$f":"IF((Tabla2[[#This Row],[Disponibilidad]]+Tabla2[[#This Row],[Integridad]]+Tabla2[[#This Row],[Confidencialidad ]]<=4),\"Baja\",IF(AND(Tabla2[[#This Row],[Disponibilidad]]+Tabla2[[#This Row],[Integridad]]+Tabla2[[#This Row],[Confidencialidad ]]>=5,Tabla2[[#This Row],[Disponibilidad]]+Tabla2[[#This Row],[Integridad]]+Tabla2[[#This Row],[Confidencialidad ]]<=7),\"Media\",IF(Tabla2[[#This Row],[Disponibilidad]]+Tabla2[[#This Row],[Integridad]]+Tabla2[[#This Row],[Confidencialidad ]]>=8,\"Alta\",\"error\")))","v":"Baja"}]
["",null,null,null,null,null,null,null,null,null,null,null,null,null,null,null,null,null,null,null,null,null,null,null,null,{"$f":"IF((Tabla2[[#This Row],[Disponibilidad]]+Tabla2[[#This Row],[Integridad]]+Tabla2[[#This Row],[Confidencialidad ]]<=4),\"Baja\",IF(AND(Tabla2[[#This Row],[Disponibilidad]]+Tabla2[[#This Row],[Integridad]]+Tabla2[[#This Row],[Confidencialidad ]]>=5,Tabla2[[#This Row],[Disponibilidad]]+Tabla2[[#This Row],[Integridad]]+Tabla2[[#This Row],[Confidencialidad ]]<=7),\"Media\",IF(Tabla2[[#This Row],[Disponibilidad]]+Tabla2[[#This Row],[Integridad]]+Tabla2[[#This Row],[Confidencialidad ]]>=8,\"Alta\",\"error\")))","v":"Baja"}]
["",null,null,null,null,null,null,null,null,null,null,null,null,null,null,null,null,null,null,null,null,null,null,null,null,{"$f":"IF((Tabla2[[#This Row],[Disponibilidad]]+Tabla2[[#This Row],[Integridad]]+Tabla2[[#This Row],[Confidencialidad ]]<=4),\"Baja\",IF(AND(Tabla2[[#This Row],[Disponibilidad]]+Tabla2[[#This Row],[Integridad]]+Tabla2[[#This Row],[Confidencialidad ]]>=5,Tabla2[[#This Row],[Disponibilidad]]+Tabla2[[#This Row],[Integridad]]+Tabla2[[#This Row],[Confidencialidad ]]<=7),\"Media\",IF(Tabla2[[#This Row],[Disponibilidad]]+Tabla2[[#This Row],[Integridad]]+Tabla2[[#This Row],[Confidencialidad ]]>=8,\"Alta\",\"error\")))","v":"Baja"}]
["",null,null,null,null,null,null,null,null,null,null,null,null,null,null,null,null,null,null,null,null,null,null,null,null,{"$f":"IF((Tabla2[[#This Row],[Disponibilidad]]+Tabla2[[#This Row],[Integridad]]+Tabla2[[#This Row],[Confidencialidad ]]<=4),\"Baja\",IF(AND(Tabla2[[#This Row],[Disponibilidad]]+Tabla2[[#This Row],[Integridad]]+Tabla2[[#This Row],[Confidencialidad ]]>=5,Tabla2[[#This Row],[Disponibilidad]]+Tabla2[[#This Row],[Integridad]]+Tabla2[[#This Row],[Confidencialidad ]]<=7),\"Media\",IF(Tabla2[[#This Row],[Disponibilidad]]+Tabla2[[#This Row],[Integridad]]+Tabla2[[#This Row],[Confidencialidad ]]>=8,\"Alta\",\"error\")))","v":"Baja"}]
["",null,null,null,null,null,null,null,null,null,null,null,null,null,null,null,null,null,null,null,null,null,null,null,null,{"$f":"IF((Tabla2[[#This Row],[Disponibilidad]]+Tabla2[[#This Row],[Integridad]]+Tabla2[[#This Row],[Confidencialidad ]]<=4),\"Baja\",IF(AND(Tabla2[[#This Row],[Disponibilidad]]+Tabla2[[#This Row],[Integridad]]+Tabla2[[#This Row],[Confidencialidad ]]>=5,Tabla2[[#This Row],[Disponibilidad]]+Tabla2[[#This Row],[Integridad]]+Tabla2[[#This Row],[Confidencialidad ]]<=7),\"Media\",IF(Tabla2[[#This Row],[Disponibilidad]]+Tabla2[[#This Row],[Integridad]]+Tabla2[[#This Row],[Confidencialidad ]]>=8,\"Alta\",\"error\")))","v":"Baja"}]
["",null,null,null,null,null,null,null,null,null,null,null,null,null,null,null,null,null,null,null,null,null,null,null,null,{"$f":"IF((Tabla2[[#This Row],[Disponibilidad]]+Tabla2[[#This Row],[Integridad]]+Tabla2[[#This Row],[Confidencialidad ]]<=4),\"Baja\",IF(AND(Tabla2[[#This Row],[Disponibilidad]]+Tabla2[[#This Row],[Integridad]]+Tabla2[[#This Row],[Confidencialidad ]]>=5,Tabla2[[#This Row],[Disponibilidad]]+Tabla2[[#This Row],[Integridad]]+Tabla2[[#This Row],[Confidencialidad ]]<=7),\"Media\",IF(Tabla2[[#This Row],[Disponibilidad]]+Tabla2[[#This Row],[Integridad]]+Tabla2[[#This Row],[Confidencialidad ]]>=8,\"Alta\",\"error\")))","v":"Baja"}]
[{"$f":"IF(C714<>\"\",1,\"\")","v":""},null,null,null,null,null,null,null,null,null,null,null,null,null,null,null,null,null,null,null,null,null,null,null,null,{"$f":"IF((Tabla2[[#This Row],[Disponibilidad]]+Tabla2[[#This Row],[Integridad]]+Tabla2[[#This Row],[Confidencialidad ]]<=4),\"Baja\",IF(AND(Tabla2[[#This Row],[Disponibilidad]]+Tabla2[[#This Row],[Integridad]]+Tabla2[[#This Row],[Confidencialidad ]]>=5,Tabla2[[#This Row],[Disponibilidad]]+Tabla2[[#This Row],[Integridad]]+Tabla2[[#This Row],[Confidencialidad ]]<=7),\"Media\",IF(Tabla2[[#This Row],[Disponibilidad]]+Tabla2[[#This Row],[Integridad]]+Tabla2[[#This Row],[Confidencialidad ]]>=8,\"Alta\",\"error\")))","v":"Baja"}]
["",null,null,null,null,null,null,null,null,null,null,null,null,null,null,null,null,null,null,null,null,null,null,null,null,{"$f":"IF((Tabla2[[#This Row],[Disponibilidad]]+Tabla2[[#This Row],[Integridad]]+Tabla2[[#This Row],[Confidencialidad ]]<=4),\"Baja\",IF(AND(Tabla2[[#This Row],[Disponibilidad]]+Tabla2[[#This Row],[Integridad]]+Tabla2[[#This Row],[Confidencialidad ]]>=5,Tabla2[[#This Row],[Disponibilidad]]+Tabla2[[#This Row],[Integridad]]+Tabla2[[#This Row],[Confidencialidad ]]<=7),\"Media\",IF(Tabla2[[#This Row],[Disponibilidad]]+Tabla2[[#This Row],[Integridad]]+Tabla2[[#This Row],[Confidencialidad ]]>=8,\"Alta\",\"error\")))","v":"Baja"}]
["",null,null,null,null,null,null,null,null,null,null,null,null,null,null,null,null,null,null,null,null,null,null,null,null,{"$f":"IF((Tabla2[[#This Row],[Disponibilidad]]+Tabla2[[#This Row],[Integridad]]+Tabla2[[#This Row],[Confidencialidad ]]<=4),\"Baja\",IF(AND(Tabla2[[#This Row],[Disponibilidad]]+Tabla2[[#This Row],[Integridad]]+Tabla2[[#This Row],[Confidencialidad ]]>=5,Tabla2[[#This Row],[Disponibilidad]]+Tabla2[[#This Row],[Integridad]]+Tabla2[[#This Row],[Confidencialidad ]]<=7),\"Media\",IF(Tabla2[[#This Row],[Disponibilidad]]+Tabla2[[#This Row],[Integridad]]+Tabla2[[#This Row],[Confidencialidad ]]>=8,\"Alta\",\"error\")))","v":"Baja"}]
["",null,null,null,null,null,null,null,null,null,null,null,null,null,null,null,null,null,null,null,null,null,null,null,null,{"$f":"IF((Tabla2[[#This Row],[Disponibilidad]]+Tabla2[[#This Row],[Integridad]]+Tabla2[[#This Row],[Confidencialidad ]]<=4),\"Baja\",IF(AND(Tabla2[[#This Row],[Disponibilidad]]+Tabla2[[#This Row],[Integridad]]+Tabla2[[#This Row],[Confidencialidad ]]>=5,Tabla2[[#This Row],[Disponibilidad]]+Tabla2[[#This Row],[Integridad]]+Tabla2[[#This Row],[Confidencialidad ]]<=7),\"Media\",IF(Tabla2[[#This Row],[Disponibilidad]]+Tabla2[[#This Row],[Integridad]]+Tabla2[[#This Row],[Confidencialidad ]]>=8,\"Alta\",\"error\")))","v":"Baja"}]
["",null,null,null,null,null,null,null,null,null,null,null,null,null,null,null,null,null,null,null,null,null,null,null,null,{"$f":"IF((Tabla2[[#This Row],[Disponibilidad]]+Tabla2[[#This Row],[Integridad]]+Tabla2[[#This Row],[Confidencialidad ]]<=4),\"Baja\",IF(AND(Tabla2[[#This Row],[Disponibilidad]]+Tabla2[[#This Row],[Integridad]]+Tabla2[[#This Row],[Confidencialidad ]]>=5,Tabla2[[#This Row],[Disponibilidad]]+Tabla2[[#This Row],[Integridad]]+Tabla2[[#This Row],[Confidencialidad ]]<=7),\"Media\",IF(Tabla2[[#This Row],[Disponibilidad]]+Tabla2[[#This Row],[Integridad]]+Tabla2[[#This Row],[Confidencialidad ]]>=8,\"Alta\",\"error\")))","v":"Baja"}]
["",null,null,null,null,null,null,null,null,null,null,null,null,null,null,null,null,null,null,null,null,null,null,null,null,{"$f":"IF((Tabla2[[#This Row],[Disponibilidad]]+Tabla2[[#This Row],[Integridad]]+Tabla2[[#This Row],[Confidencialidad ]]<=4),\"Baja\",IF(AND(Tabla2[[#This Row],[Disponibilidad]]+Tabla2[[#This Row],[Integridad]]+Tabla2[[#This Row],[Confidencialidad ]]>=5,Tabla2[[#This Row],[Disponibilidad]]+Tabla2[[#This Row],[Integridad]]+Tabla2[[#This Row],[Confidencialidad ]]<=7),\"Media\",IF(Tabla2[[#This Row],[Disponibilidad]]+Tabla2[[#This Row],[Integridad]]+Tabla2[[#This Row],[Confidencialidad ]]>=8,\"Alta\",\"error\")))","v":"Baja"}]
["",null,null,null,null,null,null,null,null,null,null,null,null,null,null,null,null,null,null,null,null,null,null,null,null,{"$f":"IF((Tabla2[[#This Row],[Disponibilidad]]+Tabla2[[#This Row],[Integridad]]+Tabla2[[#This Row],[Confidencialidad ]]<=4),\"Baja\",IF(AND(Tabla2[[#This Row],[Disponibilidad]]+Tabla2[[#This Row],[Integridad]]+Tabla2[[#This Row],[Confidencialidad ]]>=5,Tabla2[[#This Row],[Disponibilidad]]+Tabla2[[#This Row],[Integridad]]+Tabla2[[#This Row],[Confidencialidad ]]<=7),\"Media\",IF(Tabla2[[#This Row],[Disponibilidad]]+Tabla2[[#This Row],[Integridad]]+Tabla2[[#This Row],[Confidencialidad ]]>=8,\"Alta\",\"error\")))","v":"Baja"}]
["",null,null,null,null,null,null,null,null,null,null,null,null,null,null,null,null,null,null,null,null,null,null,null,null,{"$f":"IF((Tabla2[[#This Row],[Disponibilidad]]+Tabla2[[#This Row],[Integridad]]+Tabla2[[#This Row],[Confidencialidad ]]<=4),\"Baja\",IF(AND(Tabla2[[#This Row],[Disponibilidad]]+Tabla2[[#This Row],[Integridad]]+Tabla2[[#This Row],[Confidencialidad ]]>=5,Tabla2[[#This Row],[Disponibilidad]]+Tabla2[[#This Row],[Integridad]]+Tabla2[[#This Row],[Confidencialidad ]]<=7),\"Media\",IF(Tabla2[[#This Row],[Disponibilidad]]+Tabla2[[#This Row],[Integridad]]+Tabla2[[#This Row],[Confidencialidad ]]>=8,\"Alta\",\"error\")))","v":"Baja"}]
["",null,null,null,null,null,null,null,null,null,null,null,null,null,null,null,null,null,null,null,null,null,null,null,null,{"$f":"IF((Tabla2[[#This Row],[Disponibilidad]]+Tabla2[[#This Row],[Integridad]]+Tabla2[[#This Row],[Confidencialidad ]]<=4),\"Baja\",IF(AND(Tabla2[[#This Row],[Disponibilidad]]+Tabla2[[#This Row],[Integridad]]+Tabla2[[#This Row],[Confidencialidad ]]>=5,Tabla2[[#This Row],[Disponibilidad]]+Tabla2[[#This Row],[Integridad]]+Tabla2[[#This Row],[Confidencialidad ]]<=7),\"Media\",IF(Tabla2[[#This Row],[Disponibilidad]]+Tabla2[[#This Row],[Integridad]]+Tabla2[[#This Row],[Confidencialidad ]]>=8,\"Alta\",\"error\")))","v":"Baja"}]
["",null,null,null,null,null,null,null,null,null,null,null,null,null,null,null,null,null,null,null,null,null,null,null,null,{"$f":"IF((Tabla2[[#This Row],[Disponibilidad]]+Tabla2[[#This Row],[Integridad]]+Tabla2[[#This Row],[Confidencialidad ]]<=4),\"Baja\",IF(AND(Tabla2[[#This Row],[Disponibilidad]]+Tabla2[[#This Row],[Integridad]]+Tabla2[[#This Row],[Confidencialidad ]]>=5,Tabla2[[#This Row],[Disponibilidad]]+Tabla2[[#This Row],[Integridad]]+Tabla2[[#This Row],[Confidencialidad ]]<=7),\"Media\",IF(Tabla2[[#This Row],[Disponibilidad]]+Tabla2[[#This Row],[Integridad]]+Tabla2[[#This Row],[Confidencialidad ]]>=8,\"Alta\",\"error\")))","v":"Baja"}]
["",null,null,null,null,null,null,null,null,null,null,null,null,null,null,null,null,null,null,null,null,null,null,null,null,{"$f":"IF((Tabla2[[#This Row],[Disponibilidad]]+Tabla2[[#This Row],[Integridad]]+Tabla2[[#This Row],[Confidencialidad ]]<=4),\"Baja\",IF(AND(Tabla2[[#This Row],[Disponibilidad]]+Tabla2[[#This Row],[Integridad]]+Tabla2[[#This Row],[Confidencialidad ]]>=5,Tabla2[[#This Row],[Disponibilidad]]+Tabla2[[#This Row],[Integridad]]+Tabla2[[#This Row],[Confidencialidad ]]<=7),\"Media\",IF(Tabla2[[#This Row],[Disponibilidad]]+Tabla2[[#This Row],[Integridad]]+Tabla2[[#This Row],[Confidencialidad ]]>=8,\"Alta\",\"error\")))","v":"Baja"}]
["",null,null,null,null,null,null,null,null,null,null,null,null,null,null,null,null,null,null,null,null,null,null,null,null,{"$f":"IF((Tabla2[[#This Row],[Disponibilidad]]+Tabla2[[#This Row],[Integridad]]+Tabla2[[#This Row],[Confidencialidad ]]<=4),\"Baja\",IF(AND(Tabla2[[#This Row],[Disponibilidad]]+Tabla2[[#This Row],[Integridad]]+Tabla2[[#This Row],[Confidencialidad ]]>=5,Tabla2[[#This Row],[Disponibilidad]]+Tabla2[[#This Row],[Integridad]]+Tabla2[[#This Row],[Confidencialidad ]]<=7),\"Media\",IF(Tabla2[[#This Row],[Disponibilidad]]+Tabla2[[#This Row],[Integridad]]+Tabla2[[#This Row],[Confidencialidad ]]>=8,\"Alta\",\"error\")))","v":"Baja"}]
["",null,null,null,null,null,null,null,null,null,null,null,null,null,null,null,null,null,null,null,null,null,null,null,null,{"$f":"IF((Tabla2[[#This Row],[Disponibilidad]]+Tabla2[[#This Row],[Integridad]]+Tabla2[[#This Row],[Confidencialidad ]]<=4),\"Baja\",IF(AND(Tabla2[[#This Row],[Disponibilidad]]+Tabla2[[#This Row],[Integridad]]+Tabla2[[#This Row],[Confidencialidad ]]>=5,Tabla2[[#This Row],[Disponibilidad]]+Tabla2[[#This Row],[Integridad]]+Tabla2[[#This Row],[Confidencialidad ]]<=7),\"Media\",IF(Tabla2[[#This Row],[Disponibilidad]]+Tabla2[[#This Row],[Integridad]]+Tabla2[[#This Row],[Confidencialidad ]]>=8,\"Alta\",\"error\")))","v":"Baja"}]
["",null,null,null,null,null,null,null,null,null,null,null,null,null,null,null,null,null,null,null,null,null,null,null,null,{"$f":"IF((Tabla2[[#This Row],[Disponibilidad]]+Tabla2[[#This Row],[Integridad]]+Tabla2[[#This Row],[Confidencialidad ]]<=4),\"Baja\",IF(AND(Tabla2[[#This Row],[Disponibilidad]]+Tabla2[[#This Row],[Integridad]]+Tabla2[[#This Row],[Confidencialidad ]]>=5,Tabla2[[#This Row],[Disponibilidad]]+Tabla2[[#This Row],[Integridad]]+Tabla2[[#This Row],[Confidencialidad ]]<=7),\"Media\",IF(Tabla2[[#This Row],[Disponibilidad]]+Tabla2[[#This Row],[Integridad]]+Tabla2[[#This Row],[Confidencialidad ]]>=8,\"Alta\",\"error\")))","v":"Baja"}]
["",null,null,null,null,null,null,null,null,null,null,null,null,null,null,null,null,null,null,null,null,null,null,null,null,{"$f":"IF((Tabla2[[#This Row],[Disponibilidad]]+Tabla2[[#This Row],[Integridad]]+Tabla2[[#This Row],[Confidencialidad ]]<=4),\"Baja\",IF(AND(Tabla2[[#This Row],[Disponibilidad]]+Tabla2[[#This Row],[Integridad]]+Tabla2[[#This Row],[Confidencialidad ]]>=5,Tabla2[[#This Row],[Disponibilidad]]+Tabla2[[#This Row],[Integridad]]+Tabla2[[#This Row],[Confidencialidad ]]<=7),\"Media\",IF(Tabla2[[#This Row],[Disponibilidad]]+Tabla2[[#This Row],[Integridad]]+Tabla2[[#This Row],[Confidencialidad ]]>=8,\"Alta\",\"error\")))","v":"Baja"}]
["",null,null,null,null,null,null,null,null,null,null,null,null,null,null,null,null,null,null,null,null,null,null,null,null,{"$f":"IF((Tabla2[[#This Row],[Disponibilidad]]+Tabla2[[#This Row],[Integridad]]+Tabla2[[#This Row],[Confidencialidad ]]<=4),\"Baja\",IF(AND(Tabla2[[#This Row],[Disponibilidad]]+Tabla2[[#This Row],[Integridad]]+Tabla2[[#This Row],[Confidencialidad ]]>=5,Tabla2[[#This Row],[Disponibilidad]]+Tabla2[[#This Row],[Integridad]]+Tabla2[[#This Row],[Confidencialidad ]]<=7),\"Media\",IF(Tabla2[[#This Row],[Disponibilidad]]+Tabla2[[#This Row],[Integridad]]+Tabla2[[#This Row],[Confidencialidad ]]>=8,\"Alta\",\"error\")))","v":"Baja"}]
["",null,null,null,null,null,null,null,null,null,null,null,null,null,null,null,null,null,null,null,null,null,null,null,null,{"$f":"IF((Tabla2[[#This Row],[Disponibilidad]]+Tabla2[[#This Row],[Integridad]]+Tabla2[[#This Row],[Confidencialidad ]]<=4),\"Baja\",IF(AND(Tabla2[[#This Row],[Disponibilidad]]+Tabla2[[#This Row],[Integridad]]+Tabla2[[#This Row],[Confidencialidad ]]>=5,Tabla2[[#This Row],[Disponibilidad]]+Tabla2[[#This Row],[Integridad]]+Tabla2[[#This Row],[Confidencialidad ]]<=7),\"Media\",IF(Tabla2[[#This Row],[Disponibilidad]]+Tabla2[[#This Row],[Integridad]]+Tabla2[[#This Row],[Confidencialidad ]]>=8,\"Alta\",\"error\")))","v":"Baja"}]
["",null,null,null,null,null,null,null,null,null,null,null,null,null,null,null,null,null,null,null,null,null,null,null,null,{"$f":"IF((Tabla2[[#This Row],[Disponibilidad]]+Tabla2[[#This Row],[Integridad]]+Tabla2[[#This Row],[Confidencialidad ]]<=4),\"Baja\",IF(AND(Tabla2[[#This Row],[Disponibilidad]]+Tabla2[[#This Row],[Integridad]]+Tabla2[[#This Row],[Confidencialidad ]]>=5,Tabla2[[#This Row],[Disponibilidad]]+Tabla2[[#This Row],[Integridad]]+Tabla2[[#This Row],[Confidencialidad ]]<=7),\"Media\",IF(Tabla2[[#This Row],[Disponibilidad]]+Tabla2[[#This Row],[Integridad]]+Tabla2[[#This Row],[Confidencialidad ]]>=8,\"Alta\",\"error\")))","v":"Baja"}]
["",null,null,null,null,null,null,null,null,null,null,null,null,null,null,null,null,null,null,null,null,null,null,null,null,{"$f":"IF((Tabla2[[#This Row],[Disponibilidad]]+Tabla2[[#This Row],[Integridad]]+Tabla2[[#This Row],[Confidencialidad ]]<=4),\"Baja\",IF(AND(Tabla2[[#This Row],[Disponibilidad]]+Tabla2[[#This Row],[Integridad]]+Tabla2[[#This Row],[Confidencialidad ]]>=5,Tabla2[[#This Row],[Disponibilidad]]+Tabla2[[#This Row],[Integridad]]+Tabla2[[#This Row],[Confidencialidad ]]<=7),\"Media\",IF(Tabla2[[#This Row],[Disponibilidad]]+Tabla2[[#This Row],[Integridad]]+Tabla2[[#This Row],[Confidencialidad ]]>=8,\"Alta\",\"error\")))","v":"Baja"}]
["",null,null,null,null,null,null,null,null,null,null,null,null,null,null,null,null,null,null,null,null,null,null,null,null,{"$f":"IF((Tabla2[[#This Row],[Disponibilidad]]+Tabla2[[#This Row],[Integridad]]+Tabla2[[#This Row],[Confidencialidad ]]<=4),\"Baja\",IF(AND(Tabla2[[#This Row],[Disponibilidad]]+Tabla2[[#This Row],[Integridad]]+Tabla2[[#This Row],[Confidencialidad ]]>=5,Tabla2[[#This Row],[Disponibilidad]]+Tabla2[[#This Row],[Integridad]]+Tabla2[[#This Row],[Confidencialidad ]]<=7),\"Media\",IF(Tabla2[[#This Row],[Disponibilidad]]+Tabla2[[#This Row],[Integridad]]+Tabla2[[#This Row],[Confidencialidad ]]>=8,\"Alta\",\"error\")))","v":"Baja"}]
["",null,null,null,null,null,null,null,null,null,null,null,null,null,null,null,null,null,null,null,null,null,null,null,null,{"$f":"IF((Tabla2[[#This Row],[Disponibilidad]]+Tabla2[[#This Row],[Integridad]]+Tabla2[[#This Row],[Confidencialidad ]]<=4),\"Baja\",IF(AND(Tabla2[[#This Row],[Disponibilidad]]+Tabla2[[#This Row],[Integridad]]+Tabla2[[#This Row],[Confidencialidad ]]>=5,Tabla2[[#This Row],[Disponibilidad]]+Tabla2[[#This Row],[Integridad]]+Tabla2[[#This Row],[Confidencialidad ]]<=7),\"Media\",IF(Tabla2[[#This Row],[Disponibilidad]]+Tabla2[[#This Row],[Integridad]]+Tabla2[[#This Row],[Confidencialidad ]]>=8,\"Alta\",\"error\")))","v":"Baja"}]
["",null,null,null,null,null,null,null,null,null,null,null,null,null,null,null,null,null,null,null,null,null,null,null,null,{"$f":"IF((Tabla2[[#This Row],[Disponibilidad]]+Tabla2[[#This Row],[Integridad]]+Tabla2[[#This Row],[Confidencialidad ]]<=4),\"Baja\",IF(AND(Tabla2[[#This Row],[Disponibilidad]]+Tabla2[[#This Row],[Integridad]]+Tabla2[[#This Row],[Confidencialidad ]]>=5,Tabla2[[#This Row],[Disponibilidad]]+Tabla2[[#This Row],[Integridad]]+Tabla2[[#This Row],[Confidencialidad ]]<=7),\"Media\",IF(Tabla2[[#This Row],[Disponibilidad]]+Tabla2[[#This Row],[Integridad]]+Tabla2[[#This Row],[Confidencialidad ]]>=8,\"Alta\",\"error\")))","v":"Baja"}]
["",null,null,null,null,null,null,null,null,null,null,null,null,null,null,null,null,null,null,null,null,null,null,null,null,{"$f":"IF((Tabla2[[#This Row],[Disponibilidad]]+Tabla2[[#This Row],[Integridad]]+Tabla2[[#This Row],[Confidencialidad ]]<=4),\"Baja\",IF(AND(Tabla2[[#This Row],[Disponibilidad]]+Tabla2[[#This Row],[Integridad]]+Tabla2[[#This Row],[Confidencialidad ]]>=5,Tabla2[[#This Row],[Disponibilidad]]+Tabla2[[#This Row],[Integridad]]+Tabla2[[#This Row],[Confidencialidad ]]<=7),\"Media\",IF(Tabla2[[#This Row],[Disponibilidad]]+Tabla2[[#This Row],[Integridad]]+Tabla2[[#This Row],[Confidencialidad ]]>=8,\"Alta\",\"error\")))","v":"Baja"}]
["",null,null,null,null,null,null,null,null,null,null,null,null,null,null,null,null,null,null,null,null,null,null,null,null,{"$f":"IF((Tabla2[[#This Row],[Disponibilidad]]+Tabla2[[#This Row],[Integridad]]+Tabla2[[#This Row],[Confidencialidad ]]<=4),\"Baja\",IF(AND(Tabla2[[#This Row],[Disponibilidad]]+Tabla2[[#This Row],[Integridad]]+Tabla2[[#This Row],[Confidencialidad ]]>=5,Tabla2[[#This Row],[Disponibilidad]]+Tabla2[[#This Row],[Integridad]]+Tabla2[[#This Row],[Confidencialidad ]]<=7),\"Media\",IF(Tabla2[[#This Row],[Disponibilidad]]+Tabla2[[#This Row],[Integridad]]+Tabla2[[#This Row],[Confidencialidad ]]>=8,\"Alta\",\"error\")))","v":"Baja"}]
["",null,null,null,null,null,null,null,null,null,null,null,null,null,null,null,null,null,null,null,null,null,null,null,null,{"$f":"IF((Tabla2[[#This Row],[Disponibilidad]]+Tabla2[[#This Row],[Integridad]]+Tabla2[[#This Row],[Confidencialidad ]]<=4),\"Baja\",IF(AND(Tabla2[[#This Row],[Disponibilidad]]+Tabla2[[#This Row],[Integridad]]+Tabla2[[#This Row],[Confidencialidad ]]>=5,Tabla2[[#This Row],[Disponibilidad]]+Tabla2[[#This Row],[Integridad]]+Tabla2[[#This Row],[Confidencialidad ]]<=7),\"Media\",IF(Tabla2[[#This Row],[Disponibilidad]]+Tabla2[[#This Row],[Integridad]]+Tabla2[[#This Row],[Confidencialidad ]]>=8,\"Alta\",\"error\")))","v":"Baja"}]
[{"$f":"IF(C739<>\"\",1,\"\")","v":""},null,null,null,null,null,null,null,null,null,null,null,null,null,null,null,null,null,null,null,null,null,null,null,null,{"$f":"IF((Tabla2[[#This Row],[Disponibilidad]]+Tabla2[[#This Row],[Integridad]]+Tabla2[[#This Row],[Confidencialidad ]]<=4),\"Baja\",IF(AND(Tabla2[[#This Row],[Disponibilidad]]+Tabla2[[#This Row],[Integridad]]+Tabla2[[#This Row],[Confidencialidad ]]>=5,Tabla2[[#This Row],[Disponibilidad]]+Tabla2[[#This Row],[Integridad]]+Tabla2[[#This Row],[Confidencialidad ]]<=7),\"Media\",IF(Tabla2[[#This Row],[Disponibilidad]]+Tabla2[[#This Row],[Integridad]]+Tabla2[[#This Row],[Confidencialidad ]]>=8,\"Alta\",\"error\")))","v":"Baja"}]
["",null,null,null,null,null,null,null,null,null,null,null,null,null,null,null,null,null,null,null,null,null,null,null,null,{"$f":"IF((Tabla2[[#This Row],[Disponibilidad]]+Tabla2[[#This Row],[Integridad]]+Tabla2[[#This Row],[Confidencialidad ]]<=4),\"Baja\",IF(AND(Tabla2[[#This Row],[Disponibilidad]]+Tabla2[[#This Row],[Integridad]]+Tabla2[[#This Row],[Confidencialidad ]]>=5,Tabla2[[#This Row],[Disponibilidad]]+Tabla2[[#This Row],[Integridad]]+Tabla2[[#This Row],[Confidencialidad ]]<=7),\"Media\",IF(Tabla2[[#This Row],[Disponibilidad]]+Tabla2[[#This Row],[Integridad]]+Tabla2[[#This Row],[Confidencialidad ]]>=8,\"Alta\",\"error\")))","v":"Baja"}]
["",null,null,null,null,null,null,null,null,null,null,null,null,null,null,null,null,null,null,null,null,null,null,null,null,{"$f":"IF((Tabla2[[#This Row],[Disponibilidad]]+Tabla2[[#This Row],[Integridad]]+Tabla2[[#This Row],[Confidencialidad ]]<=4),\"Baja\",IF(AND(Tabla2[[#This Row],[Disponibilidad]]+Tabla2[[#This Row],[Integridad]]+Tabla2[[#This Row],[Confidencialidad ]]>=5,Tabla2[[#This Row],[Disponibilidad]]+Tabla2[[#This Row],[Integridad]]+Tabla2[[#This Row],[Confidencialidad ]]<=7),\"Media\",IF(Tabla2[[#This Row],[Disponibilidad]]+Tabla2[[#This Row],[Integridad]]+Tabla2[[#This Row],[Confidencialidad ]]>=8,\"Alta\",\"error\")))","v":"Baja"}]
["",null,null,null,null,null,null,null,null,null,null,null,null,null,null,null,null,null,null,null,null,null,null,null,null,{"$f":"IF((Tabla2[[#This Row],[Disponibilidad]]+Tabla2[[#This Row],[Integridad]]+Tabla2[[#This Row],[Confidencialidad ]]<=4),\"Baja\",IF(AND(Tabla2[[#This Row],[Disponibilidad]]+Tabla2[[#This Row],[Integridad]]+Tabla2[[#This Row],[Confidencialidad ]]>=5,Tabla2[[#This Row],[Disponibilidad]]+Tabla2[[#This Row],[Integridad]]+Tabla2[[#This Row],[Confidencialidad ]]<=7),\"Media\",IF(Tabla2[[#This Row],[Disponibilidad]]+Tabla2[[#This Row],[Integridad]]+Tabla2[[#This Row],[Confidencialidad ]]>=8,\"Alta\",\"error\")))","v":"Baja"}]
["",null,null,null,null,null,null,null,null,null,null,null,null,null,null,null,null,null,null,null,null,null,null,null,null,{"$f":"IF((Tabla2[[#This Row],[Disponibilidad]]+Tabla2[[#This Row],[Integridad]]+Tabla2[[#This Row],[Confidencialidad ]]<=4),\"Baja\",IF(AND(Tabla2[[#This Row],[Disponibilidad]]+Tabla2[[#This Row],[Integridad]]+Tabla2[[#This Row],[Confidencialidad ]]>=5,Tabla2[[#This Row],[Disponibilidad]]+Tabla2[[#This Row],[Integridad]]+Tabla2[[#This Row],[Confidencialidad ]]<=7),\"Media\",IF(Tabla2[[#This Row],[Disponibilidad]]+Tabla2[[#This Row],[Integridad]]+Tabla2[[#This Row],[Confidencialidad ]]>=8,\"Alta\",\"error\")))","v":"Baja"}]
["",null,null,null,null,null,null,null,null,null,null,null,null,null,null,null,null,null,null,null,null,null,null,null,null,{"$f":"IF((Tabla2[[#This Row],[Disponibilidad]]+Tabla2[[#This Row],[Integridad]]+Tabla2[[#This Row],[Confidencialidad ]]<=4),\"Baja\",IF(AND(Tabla2[[#This Row],[Disponibilidad]]+Tabla2[[#This Row],[Integridad]]+Tabla2[[#This Row],[Confidencialidad ]]>=5,Tabla2[[#This Row],[Disponibilidad]]+Tabla2[[#This Row],[Integridad]]+Tabla2[[#This Row],[Confidencialidad ]]<=7),\"Media\",IF(Tabla2[[#This Row],[Disponibilidad]]+Tabla2[[#This Row],[Integridad]]+Tabla2[[#This Row],[Confidencialidad ]]>=8,\"Alta\",\"error\")))","v":"Baja"}]
["",null,null,null,null,null,null,null,null,null,null,null,null,null,null,null,null,null,null,null,null,null,null,null,null,{"$f":"IF((Tabla2[[#This Row],[Disponibilidad]]+Tabla2[[#This Row],[Integridad]]+Tabla2[[#This Row],[Confidencialidad ]]<=4),\"Baja\",IF(AND(Tabla2[[#This Row],[Disponibilidad]]+Tabla2[[#This Row],[Integridad]]+Tabla2[[#This Row],[Confidencialidad ]]>=5,Tabla2[[#This Row],[Disponibilidad]]+Tabla2[[#This Row],[Integridad]]+Tabla2[[#This Row],[Confidencialidad ]]<=7),\"Media\",IF(Tabla2[[#This Row],[Disponibilidad]]+Tabla2[[#This Row],[Integridad]]+Tabla2[[#This Row],[Confidencialidad ]]>=8,\"Alta\",\"error\")))","v":"Baja"}]
["",null,null,null,null,null,null,null,null,null,null,null,null,null,null,null,null,null,null,null,null,null,null,null,null,{"$f":"IF((Tabla2[[#This Row],[Disponibilidad]]+Tabla2[[#This Row],[Integridad]]+Tabla2[[#This Row],[Confidencialidad ]]<=4),\"Baja\",IF(AND(Tabla2[[#This Row],[Disponibilidad]]+Tabla2[[#This Row],[Integridad]]+Tabla2[[#This Row],[Confidencialidad ]]>=5,Tabla2[[#This Row],[Disponibilidad]]+Tabla2[[#This Row],[Integridad]]+Tabla2[[#This Row],[Confidencialidad ]]<=7),\"Media\",IF(Tabla2[[#This Row],[Disponibilidad]]+Tabla2[[#This Row],[Integridad]]+Tabla2[[#This Row],[Confidencialidad ]]>=8,\"Alta\",\"error\")))","v":"Baja"}]
["",null,null,null,null,null,null,null,null,null,null,null,null,null,null,null,null,null,null,null,null,null,null,null,null,{"$f":"IF((Tabla2[[#This Row],[Disponibilidad]]+Tabla2[[#This Row],[Integridad]]+Tabla2[[#This Row],[Confidencialidad ]]<=4),\"Baja\",IF(AND(Tabla2[[#This Row],[Disponibilidad]]+Tabla2[[#This Row],[Integridad]]+Tabla2[[#This Row],[Confidencialidad ]]>=5,Tabla2[[#This Row],[Disponibilidad]]+Tabla2[[#This Row],[Integridad]]+Tabla2[[#This Row],[Confidencialidad ]]<=7),\"Media\",IF(Tabla2[[#This Row],[Disponibilidad]]+Tabla2[[#This Row],[Integridad]]+Tabla2[[#This Row],[Confidencialidad ]]>=8,\"Alta\",\"error\")))","v":"Baja"}]
["",null,null,null,null,null,null,null,null,null,null,null,null,null,null,null,null,null,null,null,null,null,null,null,null,{"$f":"IF((Tabla2[[#This Row],[Disponibilidad]]+Tabla2[[#This Row],[Integridad]]+Tabla2[[#This Row],[Confidencialidad ]]<=4),\"Baja\",IF(AND(Tabla2[[#This Row],[Disponibilidad]]+Tabla2[[#This Row],[Integridad]]+Tabla2[[#This Row],[Confidencialidad ]]>=5,Tabla2[[#This Row],[Disponibilidad]]+Tabla2[[#This Row],[Integridad]]+Tabla2[[#This Row],[Confidencialidad ]]<=7),\"Media\",IF(Tabla2[[#This Row],[Disponibilidad]]+Tabla2[[#This Row],[Integridad]]+Tabla2[[#This Row],[Confidencialidad ]]>=8,\"Alta\",\"error\")))","v":"Baja"}]
["",null,null,null,null,null,null,null,null,null,null,null,null,null,null,null,null,null,null,null,null,null,null,null,null,{"$f":"IF((Tabla2[[#This Row],[Disponibilidad]]+Tabla2[[#This Row],[Integridad]]+Tabla2[[#This Row],[Confidencialidad ]]<=4),\"Baja\",IF(AND(Tabla2[[#This Row],[Disponibilidad]]+Tabla2[[#This Row],[Integridad]]+Tabla2[[#This Row],[Confidencialidad ]]>=5,Tabla2[[#This Row],[Disponibilidad]]+Tabla2[[#This Row],[Integridad]]+Tabla2[[#This Row],[Confidencialidad ]]<=7),\"Media\",IF(Tabla2[[#This Row],[Disponibilidad]]+Tabla2[[#This Row],[Integridad]]+Tabla2[[#This Row],[Confidencialidad ]]>=8,\"Alta\",\"error\")))","v":"Baja"}]
["",null,null,null,null,null,null,null,null,null,null,null,null,null,null,null,null,null,null,null,null,null,null,null,null,{"$f":"IF((Tabla2[[#This Row],[Disponibilidad]]+Tabla2[[#This Row],[Integridad]]+Tabla2[[#This Row],[Confidencialidad ]]<=4),\"Baja\",IF(AND(Tabla2[[#This Row],[Disponibilidad]]+Tabla2[[#This Row],[Integridad]]+Tabla2[[#This Row],[Confidencialidad ]]>=5,Tabla2[[#This Row],[Disponibilidad]]+Tabla2[[#This Row],[Integridad]]+Tabla2[[#This Row],[Confidencialidad ]]<=7),\"Media\",IF(Tabla2[[#This Row],[Disponibilidad]]+Tabla2[[#This Row],[Integridad]]+Tabla2[[#This Row],[Confidencialidad ]]>=8,\"Alta\",\"error\")))","v":"Baja"}]
["",null,null,null,null,null,null,null,null,null,null,null,null,null,null,null,null,null,null,null,null,null,null,null,null,{"$f":"IF((Tabla2[[#This Row],[Disponibilidad]]+Tabla2[[#This Row],[Integridad]]+Tabla2[[#This Row],[Confidencialidad ]]<=4),\"Baja\",IF(AND(Tabla2[[#This Row],[Disponibilidad]]+Tabla2[[#This Row],[Integridad]]+Tabla2[[#This Row],[Confidencialidad ]]>=5,Tabla2[[#This Row],[Disponibilidad]]+Tabla2[[#This Row],[Integridad]]+Tabla2[[#This Row],[Confidencialidad ]]<=7),\"Media\",IF(Tabla2[[#This Row],[Disponibilidad]]+Tabla2[[#This Row],[Integridad]]+Tabla2[[#This Row],[Confidencialidad ]]>=8,\"Alta\",\"error\")))","v":"Baja"}]
["",null,null,null,null,null,null,null,null,null,null,null,null,null,null,null,null,null,null,null,null,null,null,null,null,{"$f":"IF((Tabla2[[#This Row],[Disponibilidad]]+Tabla2[[#This Row],[Integridad]]+Tabla2[[#This Row],[Confidencialidad ]]<=4),\"Baja\",IF(AND(Tabla2[[#This Row],[Disponibilidad]]+Tabla2[[#This Row],[Integridad]]+Tabla2[[#This Row],[Confidencialidad ]]>=5,Tabla2[[#This Row],[Disponibilidad]]+Tabla2[[#This Row],[Integridad]]+Tabla2[[#This Row],[Confidencialidad ]]<=7),\"Media\",IF(Tabla2[[#This Row],[Disponibilidad]]+Tabla2[[#This Row],[Integridad]]+Tabla2[[#This Row],[Confidencialidad ]]>=8,\"Alta\",\"error\")))","v":"Baja"}]
["",null,null,null,null,null,null,null,null,null,null,null,null,null,null,null,null,null,null,null,null,null,null,null,null,{"$f":"IF((Tabla2[[#This Row],[Disponibilidad]]+Tabla2[[#This Row],[Integridad]]+Tabla2[[#This Row],[Confidencialidad ]]<=4),\"Baja\",IF(AND(Tabla2[[#This Row],[Disponibilidad]]+Tabla2[[#This Row],[Integridad]]+Tabla2[[#This Row],[Confidencialidad ]]>=5,Tabla2[[#This Row],[Disponibilidad]]+Tabla2[[#This Row],[Integridad]]+Tabla2[[#This Row],[Confidencialidad ]]<=7),\"Media\",IF(Tabla2[[#This Row],[Disponibilidad]]+Tabla2[[#This Row],[Integridad]]+Tabla2[[#This Row],[Confidencialidad ]]>=8,\"Alta\",\"error\")))","v":"Baja"}]
["",null,null,null,null,null,null,null,null,null,null,null,null,null,null,null,null,null,null,null,null,null,null,null,null,{"$f":"IF((Tabla2[[#This Row],[Disponibilidad]]+Tabla2[[#This Row],[Integridad]]+Tabla2[[#This Row],[Confidencialidad ]]<=4),\"Baja\",IF(AND(Tabla2[[#This Row],[Disponibilidad]]+Tabla2[[#This Row],[Integridad]]+Tabla2[[#This Row],[Confidencialidad ]]>=5,Tabla2[[#This Row],[Disponibilidad]]+Tabla2[[#This Row],[Integridad]]+Tabla2[[#This Row],[Confidencialidad ]]<=7),\"Media\",IF(Tabla2[[#This Row],[Disponibilidad]]+Tabla2[[#This Row],[Integridad]]+Tabla2[[#This Row],[Confidencialidad ]]>=8,\"Alta\",\"error\")))","v":"Baja"}]
["",null,null,null,null,null,null,null,null,null,null,null,null,null,null,null,null,null,null,null,null,null,null,null,null,{"$f":"IF((Tabla2[[#This Row],[Disponibilidad]]+Tabla2[[#This Row],[Integridad]]+Tabla2[[#This Row],[Confidencialidad ]]<=4),\"Baja\",IF(AND(Tabla2[[#This Row],[Disponibilidad]]+Tabla2[[#This Row],[Integridad]]+Tabla2[[#This Row],[Confidencialidad ]]>=5,Tabla2[[#This Row],[Disponibilidad]]+Tabla2[[#This Row],[Integridad]]+Tabla2[[#This Row],[Confidencialidad ]]<=7),\"Media\",IF(Tabla2[[#This Row],[Disponibilidad]]+Tabla2[[#This Row],[Integridad]]+Tabla2[[#This Row],[Confidencialidad ]]>=8,\"Alta\",\"error\")))","v":"Baja"}]
["",null,null,null,null,null,null,null,null,null,null,null,null,null,null,null,null,null,null,null,null,null,null,null,null,{"$f":"IF((Tabla2[[#This Row],[Disponibilidad]]+Tabla2[[#This Row],[Integridad]]+Tabla2[[#This Row],[Confidencialidad ]]<=4),\"Baja\",IF(AND(Tabla2[[#This Row],[Disponibilidad]]+Tabla2[[#This Row],[Integridad]]+Tabla2[[#This Row],[Confidencialidad ]]>=5,Tabla2[[#This Row],[Disponibilidad]]+Tabla2[[#This Row],[Integridad]]+Tabla2[[#This Row],[Confidencialidad ]]<=7),\"Media\",IF(Tabla2[[#This Row],[Disponibilidad]]+Tabla2[[#This Row],[Integridad]]+Tabla2[[#This Row],[Confidencialidad ]]>=8,\"Alta\",\"error\")))","v":"Baja"}]
["",null,null,null,null,null,null,null,null,null,null,null,null,null,null,null,null,null,null,null,null,null,null,null,null,{"$f":"IF((Tabla2[[#This Row],[Disponibilidad]]+Tabla2[[#This Row],[Integridad]]+Tabla2[[#This Row],[Confidencialidad ]]<=4),\"Baja\",IF(AND(Tabla2[[#This Row],[Disponibilidad]]+Tabla2[[#This Row],[Integridad]]+Tabla2[[#This Row],[Confidencialidad ]]>=5,Tabla2[[#This Row],[Disponibilidad]]+Tabla2[[#This Row],[Integridad]]+Tabla2[[#This Row],[Confidencialidad ]]<=7),\"Media\",IF(Tabla2[[#This Row],[Disponibilidad]]+Tabla2[[#This Row],[Integridad]]+Tabla2[[#This Row],[Confidencialidad ]]>=8,\"Alta\",\"error\")))","v":"Baja"}]
["",null,null,null,null,null,null,null,null,null,null,null,null,null,null,null,null,null,null,null,null,null,null,null,null,{"$f":"IF((Tabla2[[#This Row],[Disponibilidad]]+Tabla2[[#This Row],[Integridad]]+Tabla2[[#This Row],[Confidencialidad ]]<=4),\"Baja\",IF(AND(Tabla2[[#This Row],[Disponibilidad]]+Tabla2[[#This Row],[Integridad]]+Tabla2[[#This Row],[Confidencialidad ]]>=5,Tabla2[[#This Row],[Disponibilidad]]+Tabla2[[#This Row],[Integridad]]+Tabla2[[#This Row],[Confidencialidad ]]<=7),\"Media\",IF(Tabla2[[#This Row],[Disponibilidad]]+Tabla2[[#This Row],[Integridad]]+Tabla2[[#This Row],[Confidencialidad ]]>=8,\"Alta\",\"error\")))","v":"Baja"}]
["",null,null,null,null,null,null,null,null,null,null,null,null,null,null,null,null,null,null,null,null,null,null,null,null,{"$f":"IF((Tabla2[[#This Row],[Disponibilidad]]+Tabla2[[#This Row],[Integridad]]+Tabla2[[#This Row],[Confidencialidad ]]<=4),\"Baja\",IF(AND(Tabla2[[#This Row],[Disponibilidad]]+Tabla2[[#This Row],[Integridad]]+Tabla2[[#This Row],[Confidencialidad ]]>=5,Tabla2[[#This Row],[Disponibilidad]]+Tabla2[[#This Row],[Integridad]]+Tabla2[[#This Row],[Confidencialidad ]]<=7),\"Media\",IF(Tabla2[[#This Row],[Disponibilidad]]+Tabla2[[#This Row],[Integridad]]+Tabla2[[#This Row],[Confidencialidad ]]>=8,\"Alta\",\"error\")))","v":"Baja"}]
["",null,null,null,null,null,null,null,null,null,null,null,null,null,null,null,null,null,null,null,null,null,null,null,null,{"$f":"IF((Tabla2[[#This Row],[Disponibilidad]]+Tabla2[[#This Row],[Integridad]]+Tabla2[[#This Row],[Confidencialidad ]]<=4),\"Baja\",IF(AND(Tabla2[[#This Row],[Disponibilidad]]+Tabla2[[#This Row],[Integridad]]+Tabla2[[#This Row],[Confidencialidad ]]>=5,Tabla2[[#This Row],[Disponibilidad]]+Tabla2[[#This Row],[Integridad]]+Tabla2[[#This Row],[Confidencialidad ]]<=7),\"Media\",IF(Tabla2[[#This Row],[Disponibilidad]]+Tabla2[[#This Row],[Integridad]]+Tabla2[[#This Row],[Confidencialidad ]]>=8,\"Alta\",\"error\")))","v":"Baja"}]
["",null,null,null,null,null,null,null,null,null,null,null,null,null,null,null,null,null,null,null,null,null,null,null,null,{"$f":"IF((Tabla2[[#This Row],[Disponibilidad]]+Tabla2[[#This Row],[Integridad]]+Tabla2[[#This Row],[Confidencialidad ]]<=4),\"Baja\",IF(AND(Tabla2[[#This Row],[Disponibilidad]]+Tabla2[[#This Row],[Integridad]]+Tabla2[[#This Row],[Confidencialidad ]]>=5,Tabla2[[#This Row],[Disponibilidad]]+Tabla2[[#This Row],[Integridad]]+Tabla2[[#This Row],[Confidencialidad ]]<=7),\"Media\",IF(Tabla2[[#This Row],[Disponibilidad]]+Tabla2[[#This Row],[Integridad]]+Tabla2[[#This Row],[Confidencialidad ]]>=8,\"Alta\",\"error\")))","v":"Baja"}]
["",null,null,null,null,null,null,null,null,null,null,null,null,null,null,null,null,null,null,null,null,null,null,null,null,{"$f":"IF((Tabla2[[#This Row],[Disponibilidad]]+Tabla2[[#This Row],[Integridad]]+Tabla2[[#This Row],[Confidencialidad ]]<=4),\"Baja\",IF(AND(Tabla2[[#This Row],[Disponibilidad]]+Tabla2[[#This Row],[Integridad]]+Tabla2[[#This Row],[Confidencialidad ]]>=5,Tabla2[[#This Row],[Disponibilidad]]+Tabla2[[#This Row],[Integridad]]+Tabla2[[#This Row],[Confidencialidad ]]<=7),\"Media\",IF(Tabla2[[#This Row],[Disponibilidad]]+Tabla2[[#This Row],[Integridad]]+Tabla2[[#This Row],[Confidencialidad ]]>=8,\"Alta\",\"error\")))","v":"Baja"}]
["",null,null,null,null,null,null,null,null,null,null,null,null,null,null,null,null,null,null,null,null,null,null,null,null,{"$f":"IF((Tabla2[[#This Row],[Disponibilidad]]+Tabla2[[#This Row],[Integridad]]+Tabla2[[#This Row],[Confidencialidad ]]<=4),\"Baja\",IF(AND(Tabla2[[#This Row],[Disponibilidad]]+Tabla2[[#This Row],[Integridad]]+Tabla2[[#This Row],[Confidencialidad ]]>=5,Tabla2[[#This Row],[Disponibilidad]]+Tabla2[[#This Row],[Integridad]]+Tabla2[[#This Row],[Confidencialidad ]]<=7),\"Media\",IF(Tabla2[[#This Row],[Disponibilidad]]+Tabla2[[#This Row],[Integridad]]+Tabla2[[#This Row],[Confidencialidad ]]>=8,\"Alta\",\"error\")))","v":"Baja"}]
["",null,null,null,null,null,null,null,null,null,null,null,null,null,null,null,null,null,null,null,null,null,null,null,null,{"$f":"IF((Tabla2[[#This Row],[Disponibilidad]]+Tabla2[[#This Row],[Integridad]]+Tabla2[[#This Row],[Confidencialidad ]]<=4),\"Baja\",IF(AND(Tabla2[[#This Row],[Disponibilidad]]+Tabla2[[#This Row],[Integridad]]+Tabla2[[#This Row],[Confidencialidad ]]>=5,Tabla2[[#This Row],[Disponibilidad]]+Tabla2[[#This Row],[Integridad]]+Tabla2[[#This Row],[Confidencialidad ]]<=7),\"Media\",IF(Tabla2[[#This Row],[Disponibilidad]]+Tabla2[[#This Row],[Integridad]]+Tabla2[[#This Row],[Confidencialidad ]]>=8,\"Alta\",\"error\")))","v":"Baja"}]
["",null,null,null,null,null,null,null,null,null,null,null,null,null,null,null,null,null,null,null,null,null,null,null,null,{"$f":"IF((Tabla2[[#This Row],[Disponibilidad]]+Tabla2[[#This Row],[Integridad]]+Tabla2[[#This Row],[Confidencialidad ]]<=4),\"Baja\",IF(AND(Tabla2[[#This Row],[Disponibilidad]]+Tabla2[[#This Row],[Integridad]]+Tabla2[[#This Row],[Confidencialidad ]]>=5,Tabla2[[#This Row],[Disponibilidad]]+Tabla2[[#This Row],[Integridad]]+Tabla2[[#This Row],[Confidencialidad ]]<=7),\"Media\",IF(Tabla2[[#This Row],[Disponibilidad]]+Tabla2[[#This Row],[Integridad]]+Tabla2[[#This Row],[Confidencialidad ]]>=8,\"Alta\",\"error\")))","v":"Baja"}]
["",null,null,null,null,null,null,null,null,null,null,null,null,null,null,null,null,null,null,null,null,null,null,null,null,{"$f":"IF((Tabla2[[#This Row],[Disponibilidad]]+Tabla2[[#This Row],[Integridad]]+Tabla2[[#This Row],[Confidencialidad ]]<=4),\"Baja\",IF(AND(Tabla2[[#This Row],[Disponibilidad]]+Tabla2[[#This Row],[Integridad]]+Tabla2[[#This Row],[Confidencialidad ]]>=5,Tabla2[[#This Row],[Disponibilidad]]+Tabla2[[#This Row],[Integridad]]+Tabla2[[#This Row],[Confidencialidad ]]<=7),\"Media\",IF(Tabla2[[#This Row],[Disponibilidad]]+Tabla2[[#This Row],[Integridad]]+Tabla2[[#This Row],[Confidencialidad ]]>=8,\"Alta\",\"error\")))","v":"Baja"}]
["",null,null,null,null,null,null,null,null,null,null,null,null,null,null,null,null,null,null,null,null,null,null,null,null,{"$f":"IF((Tabla2[[#This Row],[Disponibilidad]]+Tabla2[[#This Row],[Integridad]]+Tabla2[[#This Row],[Confidencialidad ]]<=4),\"Baja\",IF(AND(Tabla2[[#This Row],[Disponibilidad]]+Tabla2[[#This Row],[Integridad]]+Tabla2[[#This Row],[Confidencialidad ]]>=5,Tabla2[[#This Row],[Disponibilidad]]+Tabla2[[#This Row],[Integridad]]+Tabla2[[#This Row],[Confidencialidad ]]<=7),\"Media\",IF(Tabla2[[#This Row],[Disponibilidad]]+Tabla2[[#This Row],[Integridad]]+Tabla2[[#This Row],[Confidencialidad ]]>=8,\"Alta\",\"error\")))","v":"Baja"}]
["",null,null,null,null,null,null,null,null,null,null,null,null,null,null,null,null,null,null,null,null,null,null,null,null,{"$f":"IF((Tabla2[[#This Row],[Disponibilidad]]+Tabla2[[#This Row],[Integridad]]+Tabla2[[#This Row],[Confidencialidad ]]<=4),\"Baja\",IF(AND(Tabla2[[#This Row],[Disponibilidad]]+Tabla2[[#This Row],[Integridad]]+Tabla2[[#This Row],[Confidencialidad ]]>=5,Tabla2[[#This Row],[Disponibilidad]]+Tabla2[[#This Row],[Integridad]]+Tabla2[[#This Row],[Confidencialidad ]]<=7),\"Media\",IF(Tabla2[[#This Row],[Disponibilidad]]+Tabla2[[#This Row],[Integridad]]+Tabla2[[#This Row],[Confidencialidad ]]>=8,\"Alta\",\"error\")))","v":"Baja"}]
["",null,null,null,null,null,null,null,null,null,null,null,null,null,null,null,null,null,null,null,null,null,null,null,null,{"$f":"IF((Tabla2[[#This Row],[Disponibilidad]]+Tabla2[[#This Row],[Integridad]]+Tabla2[[#This Row],[Confidencialidad ]]<=4),\"Baja\",IF(AND(Tabla2[[#This Row],[Disponibilidad]]+Tabla2[[#This Row],[Integridad]]+Tabla2[[#This Row],[Confidencialidad ]]>=5,Tabla2[[#This Row],[Disponibilidad]]+Tabla2[[#This Row],[Integridad]]+Tabla2[[#This Row],[Confidencialidad ]]<=7),\"Media\",IF(Tabla2[[#This Row],[Disponibilidad]]+Tabla2[[#This Row],[Integridad]]+Tabla2[[#This Row],[Confidencialidad ]]>=8,\"Alta\",\"error\")))","v":"Baja"}]
["",null,null,null,null,null,null,null,null,null,null,null,null,null,null,null,null,null,null,null,null,null,null,null,null,{"$f":"IF((Tabla2[[#This Row],[Disponibilidad]]+Tabla2[[#This Row],[Integridad]]+Tabla2[[#This Row],[Confidencialidad ]]<=4),\"Baja\",IF(AND(Tabla2[[#This Row],[Disponibilidad]]+Tabla2[[#This Row],[Integridad]]+Tabla2[[#This Row],[Confidencialidad ]]>=5,Tabla2[[#This Row],[Disponibilidad]]+Tabla2[[#This Row],[Integridad]]+Tabla2[[#This Row],[Confidencialidad ]]<=7),\"Media\",IF(Tabla2[[#This Row],[Disponibilidad]]+Tabla2[[#This Row],[Integridad]]+Tabla2[[#This Row],[Confidencialidad ]]>=8,\"Alta\",\"error\")))","v":"Baja"}]
[{"$f":"IF(C771<>\"\",1,\"\")","v":""},null,null,null,null,null,null,null,null,null,null,null,null,null,null,null,null,null,null,null,null,null,null,null,null,{"$f":"IF((Tabla2[[#This Row],[Disponibilidad]]+Tabla2[[#This Row],[Integridad]]+Tabla2[[#This Row],[Confidencialidad ]]<=4),\"Baja\",IF(AND(Tabla2[[#This Row],[Disponibilidad]]+Tabla2[[#This Row],[Integridad]]+Tabla2[[#This Row],[Confidencialidad ]]>=5,Tabla2[[#This Row],[Disponibilidad]]+Tabla2[[#This Row],[Integridad]]+Tabla2[[#This Row],[Confidencialidad ]]<=7),\"Media\",IF(Tabla2[[#This Row],[Disponibilidad]]+Tabla2[[#This Row],[Integridad]]+Tabla2[[#This Row],[Confidencialidad ]]>=8,\"Alta\",\"error\")))","v":"Baja"}]
["",null,null,null,null,null,null,null,null,null,null,null,null,null,null,null,null,null,null,null,null,null,null,null,null,{"$f":"IF((Tabla2[[#This Row],[Disponibilidad]]+Tabla2[[#This Row],[Integridad]]+Tabla2[[#This Row],[Confidencialidad ]]<=4),\"Baja\",IF(AND(Tabla2[[#This Row],[Disponibilidad]]+Tabla2[[#This Row],[Integridad]]+Tabla2[[#This Row],[Confidencialidad ]]>=5,Tabla2[[#This Row],[Disponibilidad]]+Tabla2[[#This Row],[Integridad]]+Tabla2[[#This Row],[Confidencialidad ]]<=7),\"Media\",IF(Tabla2[[#This Row],[Disponibilidad]]+Tabla2[[#This Row],[Integridad]]+Tabla2[[#This Row],[Confidencialidad ]]>=8,\"Alta\",\"error\")))","v":"Baja"}]
["",null,null,null,null,null,null,null,null,null,null,null,null,null,null,null,null,null,null,null,null,null,null,null,null,{"$f":"IF((Tabla2[[#This Row],[Disponibilidad]]+Tabla2[[#This Row],[Integridad]]+Tabla2[[#This Row],[Confidencialidad ]]<=4),\"Baja\",IF(AND(Tabla2[[#This Row],[Disponibilidad]]+Tabla2[[#This Row],[Integridad]]+Tabla2[[#This Row],[Confidencialidad ]]>=5,Tabla2[[#This Row],[Disponibilidad]]+Tabla2[[#This Row],[Integridad]]+Tabla2[[#This Row],[Confidencialidad ]]<=7),\"Media\",IF(Tabla2[[#This Row],[Disponibilidad]]+Tabla2[[#This Row],[Integridad]]+Tabla2[[#This Row],[Confidencialidad ]]>=8,\"Alta\",\"error\")))","v":"Baja"}]
["",null,null,null,null,null,null,null,null,null,null,null,null,null,null,null,null,null,null,null,null,null,null,null,null,{"$f":"IF((Tabla2[[#This Row],[Disponibilidad]]+Tabla2[[#This Row],[Integridad]]+Tabla2[[#This Row],[Confidencialidad ]]<=4),\"Baja\",IF(AND(Tabla2[[#This Row],[Disponibilidad]]+Tabla2[[#This Row],[Integridad]]+Tabla2[[#This Row],[Confidencialidad ]]>=5,Tabla2[[#This Row],[Disponibilidad]]+Tabla2[[#This Row],[Integridad]]+Tabla2[[#This Row],[Confidencialidad ]]<=7),\"Media\",IF(Tabla2[[#This Row],[Disponibilidad]]+Tabla2[[#This Row],[Integridad]]+Tabla2[[#This Row],[Confidencialidad ]]>=8,\"Alta\",\"error\")))","v":"Baja"}]
["",null,null,null,null,null,null,null,null,null,null,null,null,null,null,null,null,null,null,null,null,null,null,null,null,{"$f":"IF((Tabla2[[#This Row],[Disponibilidad]]+Tabla2[[#This Row],[Integridad]]+Tabla2[[#This Row],[Confidencialidad ]]<=4),\"Baja\",IF(AND(Tabla2[[#This Row],[Disponibilidad]]+Tabla2[[#This Row],[Integridad]]+Tabla2[[#This Row],[Confidencialidad ]]>=5,Tabla2[[#This Row],[Disponibilidad]]+Tabla2[[#This Row],[Integridad]]+Tabla2[[#This Row],[Confidencialidad ]]<=7),\"Media\",IF(Tabla2[[#This Row],[Disponibilidad]]+Tabla2[[#This Row],[Integridad]]+Tabla2[[#This Row],[Confidencialidad ]]>=8,\"Alta\",\"error\")))","v":"Baja"}]
["",null,null,null,null,null,null,null,null,null,null,null,null,null,null,null,null,null,null,null,null,null,null,null,null,{"$f":"IF((Tabla2[[#This Row],[Disponibilidad]]+Tabla2[[#This Row],[Integridad]]+Tabla2[[#This Row],[Confidencialidad ]]<=4),\"Baja\",IF(AND(Tabla2[[#This Row],[Disponibilidad]]+Tabla2[[#This Row],[Integridad]]+Tabla2[[#This Row],[Confidencialidad ]]>=5,Tabla2[[#This Row],[Disponibilidad]]+Tabla2[[#This Row],[Integridad]]+Tabla2[[#This Row],[Confidencialidad ]]<=7),\"Media\",IF(Tabla2[[#This Row],[Disponibilidad]]+Tabla2[[#This Row],[Integridad]]+Tabla2[[#This Row],[Confidencialidad ]]>=8,\"Alta\",\"error\")))","v":"Baja"}]
["",null,null,null,null,null,null,null,null,null,null,null,null,null,null,null,null,null,null,null,null,null,null,null,null,{"$f":"IF((Tabla2[[#This Row],[Disponibilidad]]+Tabla2[[#This Row],[Integridad]]+Tabla2[[#This Row],[Confidencialidad ]]<=4),\"Baja\",IF(AND(Tabla2[[#This Row],[Disponibilidad]]+Tabla2[[#This Row],[Integridad]]+Tabla2[[#This Row],[Confidencialidad ]]>=5,Tabla2[[#This Row],[Disponibilidad]]+Tabla2[[#This Row],[Integridad]]+Tabla2[[#This Row],[Confidencialidad ]]<=7),\"Media\",IF(Tabla2[[#This Row],[Disponibilidad]]+Tabla2[[#This Row],[Integridad]]+Tabla2[[#This Row],[Confidencialidad ]]>=8,\"Alta\",\"error\")))","v":"Baja"}]
["",null,null,null,null,null,null,null,null,null,null,null,null,null,null,null,null,null,null,null,null,null,null,null,null,{"$f":"IF((Tabla2[[#This Row],[Disponibilidad]]+Tabla2[[#This Row],[Integridad]]+Tabla2[[#This Row],[Confidencialidad ]]<=4),\"Baja\",IF(AND(Tabla2[[#This Row],[Disponibilidad]]+Tabla2[[#This Row],[Integridad]]+Tabla2[[#This Row],[Confidencialidad ]]>=5,Tabla2[[#This Row],[Disponibilidad]]+Tabla2[[#This Row],[Integridad]]+Tabla2[[#This Row],[Confidencialidad ]]<=7),\"Media\",IF(Tabla2[[#This Row],[Disponibilidad]]+Tabla2[[#This Row],[Integridad]]+Tabla2[[#This Row],[Confidencialidad ]]>=8,\"Alta\",\"error\")))","v":"Baja"}]
["",null,null,null,null,null,null,null,null,null,null,null,null,null,null,null,null,null,null,null,null,null,null,null,null,{"$f":"IF((Tabla2[[#This Row],[Disponibilidad]]+Tabla2[[#This Row],[Integridad]]+Tabla2[[#This Row],[Confidencialidad ]]<=4),\"Baja\",IF(AND(Tabla2[[#This Row],[Disponibilidad]]+Tabla2[[#This Row],[Integridad]]+Tabla2[[#This Row],[Confidencialidad ]]>=5,Tabla2[[#This Row],[Disponibilidad]]+Tabla2[[#This Row],[Integridad]]+Tabla2[[#This Row],[Confidencialidad ]]<=7),\"Media\",IF(Tabla2[[#This Row],[Disponibilidad]]+Tabla2[[#This Row],[Integridad]]+Tabla2[[#This Row],[Confidencialidad ]]>=8,\"Alta\",\"error\")))","v":"Baja"}]
["",null,null,null,null,null,null,null,null,null,null,null,null,null,null,null,null,null,null,null,null,null,null,null,null,{"$f":"IF((Tabla2[[#This Row],[Disponibilidad]]+Tabla2[[#This Row],[Integridad]]+Tabla2[[#This Row],[Confidencialidad ]]<=4),\"Baja\",IF(AND(Tabla2[[#This Row],[Disponibilidad]]+Tabla2[[#This Row],[Integridad]]+Tabla2[[#This Row],[Confidencialidad ]]>=5,Tabla2[[#This Row],[Disponibilidad]]+Tabla2[[#This Row],[Integridad]]+Tabla2[[#This Row],[Confidencialidad ]]<=7),\"Media\",IF(Tabla2[[#This Row],[Disponibilidad]]+Tabla2[[#This Row],[Integridad]]+Tabla2[[#This Row],[Confidencialidad ]]>=8,\"Alta\",\"error\")))","v":"Baja"}]
["",null,null,null,null,null,null,null,null,null,null,null,null,null,null,null,null,null,null,null,null,null,null,null,null,{"$f":"IF((Tabla2[[#This Row],[Disponibilidad]]+Tabla2[[#This Row],[Integridad]]+Tabla2[[#This Row],[Confidencialidad ]]<=4),\"Baja\",IF(AND(Tabla2[[#This Row],[Disponibilidad]]+Tabla2[[#This Row],[Integridad]]+Tabla2[[#This Row],[Confidencialidad ]]>=5,Tabla2[[#This Row],[Disponibilidad]]+Tabla2[[#This Row],[Integridad]]+Tabla2[[#This Row],[Confidencialidad ]]<=7),\"Media\",IF(Tabla2[[#This Row],[Disponibilidad]]+Tabla2[[#This Row],[Integridad]]+Tabla2[[#This Row],[Confidencialidad ]]>=8,\"Alta\",\"error\")))","v":"Baja"}]
["",null,null,null,null,null,null,null,null,null,null,null,null,null,null,null,null,null,null,null,null,null,null,null,null,{"$f":"IF((Tabla2[[#This Row],[Disponibilidad]]+Tabla2[[#This Row],[Integridad]]+Tabla2[[#This Row],[Confidencialidad ]]<=4),\"Baja\",IF(AND(Tabla2[[#This Row],[Disponibilidad]]+Tabla2[[#This Row],[Integridad]]+Tabla2[[#This Row],[Confidencialidad ]]>=5,Tabla2[[#This Row],[Disponibilidad]]+Tabla2[[#This Row],[Integridad]]+Tabla2[[#This Row],[Confidencialidad ]]<=7),\"Media\",IF(Tabla2[[#This Row],[Disponibilidad]]+Tabla2[[#This Row],[Integridad]]+Tabla2[[#This Row],[Confidencialidad ]]>=8,\"Alta\",\"error\")))","v":"Baja"}]
["",null,null,null,null,null,null,null,null,null,null,null,null,null,null,null,null,null,null,null,null,null,null,null,null,{"$f":"IF((Tabla2[[#This Row],[Disponibilidad]]+Tabla2[[#This Row],[Integridad]]+Tabla2[[#This Row],[Confidencialidad ]]<=4),\"Baja\",IF(AND(Tabla2[[#This Row],[Disponibilidad]]+Tabla2[[#This Row],[Integridad]]+Tabla2[[#This Row],[Confidencialidad ]]>=5,Tabla2[[#This Row],[Disponibilidad]]+Tabla2[[#This Row],[Integridad]]+Tabla2[[#This Row],[Confidencialidad ]]<=7),\"Media\",IF(Tabla2[[#This Row],[Disponibilidad]]+Tabla2[[#This Row],[Integridad]]+Tabla2[[#This Row],[Confidencialidad ]]>=8,\"Alta\",\"error\")))","v":"Baja"}]
["",null,null,null,null,null,null,null,null,null,null,null,null,null,null,null,null,null,null,null,null,null,null,null,null,{"$f":"IF((Tabla2[[#This Row],[Disponibilidad]]+Tabla2[[#This Row],[Integridad]]+Tabla2[[#This Row],[Confidencialidad ]]<=4),\"Baja\",IF(AND(Tabla2[[#This Row],[Disponibilidad]]+Tabla2[[#This Row],[Integridad]]+Tabla2[[#This Row],[Confidencialidad ]]>=5,Tabla2[[#This Row],[Disponibilidad]]+Tabla2[[#This Row],[Integridad]]+Tabla2[[#This Row],[Confidencialidad ]]<=7),\"Media\",IF(Tabla2[[#This Row],[Disponibilidad]]+Tabla2[[#This Row],[Integridad]]+Tabla2[[#This Row],[Confidencialidad ]]>=8,\"Alta\",\"error\")))","v":"Baja"}]
["",null,null,null,null,null,null,null,null,null,null,null,null,null,null,null,null,null,null,null,null,null,null,null,null,{"$f":"IF((Tabla2[[#This Row],[Disponibilidad]]+Tabla2[[#This Row],[Integridad]]+Tabla2[[#This Row],[Confidencialidad ]]<=4),\"Baja\",IF(AND(Tabla2[[#This Row],[Disponibilidad]]+Tabla2[[#This Row],[Integridad]]+Tabla2[[#This Row],[Confidencialidad ]]>=5,Tabla2[[#This Row],[Disponibilidad]]+Tabla2[[#This Row],[Integridad]]+Tabla2[[#This Row],[Confidencialidad ]]<=7),\"Media\",IF(Tabla2[[#This Row],[Disponibilidad]]+Tabla2[[#This Row],[Integridad]]+Tabla2[[#This Row],[Confidencialidad ]]>=8,\"Alta\",\"error\")))","v":"Baja"}]
["",null,null,null,null,null,null,null,null,null,null,null,null,null,null,null,null,null,null,null,null,null,null,null,null,{"$f":"IF((Tabla2[[#This Row],[Disponibilidad]]+Tabla2[[#This Row],[Integridad]]+Tabla2[[#This Row],[Confidencialidad ]]<=4),\"Baja\",IF(AND(Tabla2[[#This Row],[Disponibilidad]]+Tabla2[[#This Row],[Integridad]]+Tabla2[[#This Row],[Confidencialidad ]]>=5,Tabla2[[#This Row],[Disponibilidad]]+Tabla2[[#This Row],[Integridad]]+Tabla2[[#This Row],[Confidencialidad ]]<=7),\"Media\",IF(Tabla2[[#This Row],[Disponibilidad]]+Tabla2[[#This Row],[Integridad]]+Tabla2[[#This Row],[Confidencialidad ]]>=8,\"Alta\",\"error\")))","v":"Baja"}]
["",null,null,null,null,null,null,null,null,null,null,null,null,null,null,null,null,null,null,null,null,null,null,null,null,{"$f":"IF((Tabla2[[#This Row],[Disponibilidad]]+Tabla2[[#This Row],[Integridad]]+Tabla2[[#This Row],[Confidencialidad ]]<=4),\"Baja\",IF(AND(Tabla2[[#This Row],[Disponibilidad]]+Tabla2[[#This Row],[Integridad]]+Tabla2[[#This Row],[Confidencialidad ]]>=5,Tabla2[[#This Row],[Disponibilidad]]+Tabla2[[#This Row],[Integridad]]+Tabla2[[#This Row],[Confidencialidad ]]<=7),\"Media\",IF(Tabla2[[#This Row],[Disponibilidad]]+Tabla2[[#This Row],[Integridad]]+Tabla2[[#This Row],[Confidencialidad ]]>=8,\"Alta\",\"error\")))","v":"Baja"}]
["",null,null,null,null,null,null,null,null,null,null,null,null,null,null,null,null,null,null,null,null,null,null,null,null,{"$f":"IF((Tabla2[[#This Row],[Disponibilidad]]+Tabla2[[#This Row],[Integridad]]+Tabla2[[#This Row],[Confidencialidad ]]<=4),\"Baja\",IF(AND(Tabla2[[#This Row],[Disponibilidad]]+Tabla2[[#This Row],[Integridad]]+Tabla2[[#This Row],[Confidencialidad ]]>=5,Tabla2[[#This Row],[Disponibilidad]]+Tabla2[[#This Row],[Integridad]]+Tabla2[[#This Row],[Confidencialidad ]]<=7),\"Media\",IF(Tabla2[[#This Row],[Disponibilidad]]+Tabla2[[#This Row],[Integridad]]+Tabla2[[#This Row],[Confidencialidad ]]>=8,\"Alta\",\"error\")))","v":"Baja"}]
["",null,null,null,null,null,null,null,null,null,null,null,null,null,null,null,null,null,null,null,null,null,null,null,null,{"$f":"IF((Tabla2[[#This Row],[Disponibilidad]]+Tabla2[[#This Row],[Integridad]]+Tabla2[[#This Row],[Confidencialidad ]]<=4),\"Baja\",IF(AND(Tabla2[[#This Row],[Disponibilidad]]+Tabla2[[#This Row],[Integridad]]+Tabla2[[#This Row],[Confidencialidad ]]>=5,Tabla2[[#This Row],[Disponibilidad]]+Tabla2[[#This Row],[Integridad]]+Tabla2[[#This Row],[Confidencialidad ]]<=7),\"Media\",IF(Tabla2[[#This Row],[Disponibilidad]]+Tabla2[[#This Row],[Integridad]]+Tabla2[[#This Row],[Confidencialidad ]]>=8,\"Alta\",\"error\")))","v":"Baja"}]
["",null,null,null,null,null,null,null,null,null,null,null,null,null,null,null,null,null,null,null,null,null,null,null,null,{"$f":"IF((Tabla2[[#This Row],[Disponibilidad]]+Tabla2[[#This Row],[Integridad]]+Tabla2[[#This Row],[Confidencialidad ]]<=4),\"Baja\",IF(AND(Tabla2[[#This Row],[Disponibilidad]]+Tabla2[[#This Row],[Integridad]]+Tabla2[[#This Row],[Confidencialidad ]]>=5,Tabla2[[#This Row],[Disponibilidad]]+Tabla2[[#This Row],[Integridad]]+Tabla2[[#This Row],[Confidencialidad ]]<=7),\"Media\",IF(Tabla2[[#This Row],[Disponibilidad]]+Tabla2[[#This Row],[Integridad]]+Tabla2[[#This Row],[Confidencialidad ]]>=8,\"Alta\",\"error\")))","v":"Baja"}]
["",null,null,null,null,null,null,null,null,null,null,null,null,null,null,null,null,null,null,null,null,null,null,null,null,{"$f":"IF((Tabla2[[#This Row],[Disponibilidad]]+Tabla2[[#This Row],[Integridad]]+Tabla2[[#This Row],[Confidencialidad ]]<=4),\"Baja\",IF(AND(Tabla2[[#This Row],[Disponibilidad]]+Tabla2[[#This Row],[Integridad]]+Tabla2[[#This Row],[Confidencialidad ]]>=5,Tabla2[[#This Row],[Disponibilidad]]+Tabla2[[#This Row],[Integridad]]+Tabla2[[#This Row],[Confidencialidad ]]<=7),\"Media\",IF(Tabla2[[#This Row],[Disponibilidad]]+Tabla2[[#This Row],[Integridad]]+Tabla2[[#This Row],[Confidencialidad ]]>=8,\"Alta\",\"error\")))","v":"Baja"}]
["",null,null,null,null,null,null,null,null,null,null,null,null,null,null,null,null,null,null,null,null,null,null,null,null,{"$f":"IF((Tabla2[[#This Row],[Disponibilidad]]+Tabla2[[#This Row],[Integridad]]+Tabla2[[#This Row],[Confidencialidad ]]<=4),\"Baja\",IF(AND(Tabla2[[#This Row],[Disponibilidad]]+Tabla2[[#This Row],[Integridad]]+Tabla2[[#This Row],[Confidencialidad ]]>=5,Tabla2[[#This Row],[Disponibilidad]]+Tabla2[[#This Row],[Integridad]]+Tabla2[[#This Row],[Confidencialidad ]]<=7),\"Media\",IF(Tabla2[[#This Row],[Disponibilidad]]+Tabla2[[#This Row],[Integridad]]+Tabla2[[#This Row],[Confidencialidad ]]>=8,\"Alta\",\"error\")))","v":"Baja"}]
["",null,null,null,null,null,null,null,null,null,null,null,null,null,null,null,null,null,null,null,null,null,null,null,null,{"$f":"IF((Tabla2[[#This Row],[Disponibilidad]]+Tabla2[[#This Row],[Integridad]]+Tabla2[[#This Row],[Confidencialidad ]]<=4),\"Baja\",IF(AND(Tabla2[[#This Row],[Disponibilidad]]+Tabla2[[#This Row],[Integridad]]+Tabla2[[#This Row],[Confidencialidad ]]>=5,Tabla2[[#This Row],[Disponibilidad]]+Tabla2[[#This Row],[Integridad]]+Tabla2[[#This Row],[Confidencialidad ]]<=7),\"Media\",IF(Tabla2[[#This Row],[Disponibilidad]]+Tabla2[[#This Row],[Integridad]]+Tabla2[[#This Row],[Confidencialidad ]]>=8,\"Alta\",\"error\")))","v":"Baja"}]
["",null,null,null,null,null,null,null,null,null,null,null,null,null,null,null,null,null,null,null,null,null,null,null,null,{"$f":"IF((Tabla2[[#This Row],[Disponibilidad]]+Tabla2[[#This Row],[Integridad]]+Tabla2[[#This Row],[Confidencialidad ]]<=4),\"Baja\",IF(AND(Tabla2[[#This Row],[Disponibilidad]]+Tabla2[[#This Row],[Integridad]]+Tabla2[[#This Row],[Confidencialidad ]]>=5,Tabla2[[#This Row],[Disponibilidad]]+Tabla2[[#This Row],[Integridad]]+Tabla2[[#This Row],[Confidencialidad ]]<=7),\"Media\",IF(Tabla2[[#This Row],[Disponibilidad]]+Tabla2[[#This Row],[Integridad]]+Tabla2[[#This Row],[Confidencialidad ]]>=8,\"Alta\",\"error\")))","v":"Baja"}]
["",null,null,null,null,null,null,null,null,null,null,null,null,null,null,null,null,null,null,null,null,null,null,null,null,{"$f":"IF((Tabla2[[#This Row],[Disponibilidad]]+Tabla2[[#This Row],[Integridad]]+Tabla2[[#This Row],[Confidencialidad ]]<=4),\"Baja\",IF(AND(Tabla2[[#This Row],[Disponibilidad]]+Tabla2[[#This Row],[Integridad]]+Tabla2[[#This Row],[Confidencialidad ]]>=5,Tabla2[[#This Row],[Disponibilidad]]+Tabla2[[#This Row],[Integridad]]+Tabla2[[#This Row],[Confidencialidad ]]<=7),\"Media\",IF(Tabla2[[#This Row],[Disponibilidad]]+Tabla2[[#This Row],[Integridad]]+Tabla2[[#This Row],[Confidencialidad ]]>=8,\"Alta\",\"error\")))","v":"Baja"}]
["",null,null,null,null,null,null,null,null,null,null,null,null,null,null,null,null,null,null,null,null,null,null,null,null,{"$f":"IF((Tabla2[[#This Row],[Disponibilidad]]+Tabla2[[#This Row],[Integridad]]+Tabla2[[#This Row],[Confidencialidad ]]<=4),\"Baja\",IF(AND(Tabla2[[#This Row],[Disponibilidad]]+Tabla2[[#This Row],[Integridad]]+Tabla2[[#This Row],[Confidencialidad ]]>=5,Tabla2[[#This Row],[Disponibilidad]]+Tabla2[[#This Row],[Integridad]]+Tabla2[[#This Row],[Confidencialidad ]]<=7),\"Media\",IF(Tabla2[[#This Row],[Disponibilidad]]+Tabla2[[#This Row],[Integridad]]+Tabla2[[#This Row],[Confidencialidad ]]>=8,\"Alta\",\"error\")))","v":"Baja"}]
["",null,null,null,null,null,null,null,null,null,null,null,null,null,null,null,null,null,null,null,null,null,null,null,null,{"$f":"IF((Tabla2[[#This Row],[Disponibilidad]]+Tabla2[[#This Row],[Integridad]]+Tabla2[[#This Row],[Confidencialidad ]]<=4),\"Baja\",IF(AND(Tabla2[[#This Row],[Disponibilidad]]+Tabla2[[#This Row],[Integridad]]+Tabla2[[#This Row],[Confidencialidad ]]>=5,Tabla2[[#This Row],[Disponibilidad]]+Tabla2[[#This Row],[Integridad]]+Tabla2[[#This Row],[Confidencialidad ]]<=7),\"Media\",IF(Tabla2[[#This Row],[Disponibilidad]]+Tabla2[[#This Row],[Integridad]]+Tabla2[[#This Row],[Confidencialidad ]]>=8,\"Alta\",\"error\")))","v":"Baja"}]
["",null,null,null,null,null,null,null,null,null,null,null,null,null,null,null,null,null,null,null,null,null,null,null,null,{"$f":"IF((Tabla2[[#This Row],[Disponibilidad]]+Tabla2[[#This Row],[Integridad]]+Tabla2[[#This Row],[Confidencialidad ]]<=4),\"Baja\",IF(AND(Tabla2[[#This Row],[Disponibilidad]]+Tabla2[[#This Row],[Integridad]]+Tabla2[[#This Row],[Confidencialidad ]]>=5,Tabla2[[#This Row],[Disponibilidad]]+Tabla2[[#This Row],[Integridad]]+Tabla2[[#This Row],[Confidencialidad ]]<=7),\"Media\",IF(Tabla2[[#This Row],[Disponibilidad]]+Tabla2[[#This Row],[Integridad]]+Tabla2[[#This Row],[Confidencialidad ]]>=8,\"Alta\",\"error\")))","v":"Baja"}]
["",null,null,null,null,null,null,null,null,null,null,null,null,null,null,null,null,null,null,null,null,null,null,null,null,{"$f":"IF((Tabla2[[#This Row],[Disponibilidad]]+Tabla2[[#This Row],[Integridad]]+Tabla2[[#This Row],[Confidencialidad ]]<=4),\"Baja\",IF(AND(Tabla2[[#This Row],[Disponibilidad]]+Tabla2[[#This Row],[Integridad]]+Tabla2[[#This Row],[Confidencialidad ]]>=5,Tabla2[[#This Row],[Disponibilidad]]+Tabla2[[#This Row],[Integridad]]+Tabla2[[#This Row],[Confidencialidad ]]<=7),\"Media\",IF(Tabla2[[#This Row],[Disponibilidad]]+Tabla2[[#This Row],[Integridad]]+Tabla2[[#This Row],[Confidencialidad ]]>=8,\"Alta\",\"error\")))","v":"Baja"}]
["",null,null,null,null,null,null,null,null,null,null,null,null,null,null,null,null,null,null,null,null,null,null,null,null,{"$f":"IF((Tabla2[[#This Row],[Disponibilidad]]+Tabla2[[#This Row],[Integridad]]+Tabla2[[#This Row],[Confidencialidad ]]<=4),\"Baja\",IF(AND(Tabla2[[#This Row],[Disponibilidad]]+Tabla2[[#This Row],[Integridad]]+Tabla2[[#This Row],[Confidencialidad ]]>=5,Tabla2[[#This Row],[Disponibilidad]]+Tabla2[[#This Row],[Integridad]]+Tabla2[[#This Row],[Confidencialidad ]]<=7),\"Media\",IF(Tabla2[[#This Row],[Disponibilidad]]+Tabla2[[#This Row],[Integridad]]+Tabla2[[#This Row],[Confidencialidad ]]>=8,\"Alta\",\"error\")))","v":"Baja"}]
["",null,null,null,null,null,null,null,null,null,null,null,null,null,null,null,null,null,null,null,null,null,null,null,null,{"$f":"IF((Tabla2[[#This Row],[Disponibilidad]]+Tabla2[[#This Row],[Integridad]]+Tabla2[[#This Row],[Confidencialidad ]]<=4),\"Baja\",IF(AND(Tabla2[[#This Row],[Disponibilidad]]+Tabla2[[#This Row],[Integridad]]+Tabla2[[#This Row],[Confidencialidad ]]>=5,Tabla2[[#This Row],[Disponibilidad]]+Tabla2[[#This Row],[Integridad]]+Tabla2[[#This Row],[Confidencialidad ]]<=7),\"Media\",IF(Tabla2[[#This Row],[Disponibilidad]]+Tabla2[[#This Row],[Integridad]]+Tabla2[[#This Row],[Confidencialidad ]]>=8,\"Alta\",\"error\")))","v":"Baja"}]
["",null,null,null,null,null,null,null,null,null,null,null,null,null,null,null,null,null,null,null,null,null,null,null,null,{"$f":"IF((Tabla2[[#This Row],[Disponibilidad]]+Tabla2[[#This Row],[Integridad]]+Tabla2[[#This Row],[Confidencialidad ]]<=4),\"Baja\",IF(AND(Tabla2[[#This Row],[Disponibilidad]]+Tabla2[[#This Row],[Integridad]]+Tabla2[[#This Row],[Confidencialidad ]]>=5,Tabla2[[#This Row],[Disponibilidad]]+Tabla2[[#This Row],[Integridad]]+Tabla2[[#This Row],[Confidencialidad ]]<=7),\"Media\",IF(Tabla2[[#This Row],[Disponibilidad]]+Tabla2[[#This Row],[Integridad]]+Tabla2[[#This Row],[Confidencialidad ]]>=8,\"Alta\",\"error\")))","v":"Baja"}]
[{"$f":"IF(C803<>\"\",1,\"\")","v":""},null,null,null,null,null,null,null,null,null,null,null,null,null,null,null,null,null,null,null,null,null,null,null,null,{"$f":"IF((Tabla2[[#This Row],[Disponibilidad]]+Tabla2[[#This Row],[Integridad]]+Tabla2[[#This Row],[Confidencialidad ]]<=4),\"Baja\",IF(AND(Tabla2[[#This Row],[Disponibilidad]]+Tabla2[[#This Row],[Integridad]]+Tabla2[[#This Row],[Confidencialidad ]]>=5,Tabla2[[#This Row],[Disponibilidad]]+Tabla2[[#This Row],[Integridad]]+Tabla2[[#This Row],[Confidencialidad ]]<=7),\"Media\",IF(Tabla2[[#This Row],[Disponibilidad]]+Tabla2[[#This Row],[Integridad]]+Tabla2[[#This Row],[Confidencialidad ]]>=8,\"Alta\",\"error\")))","v":"Baja"}]
["",null,null,null,null,null,null,null,null,null,null,null,null,null,null,null,null,null,null,null,null,null,null,null,null,{"$f":"IF((Tabla2[[#This Row],[Disponibilidad]]+Tabla2[[#This Row],[Integridad]]+Tabla2[[#This Row],[Confidencialidad ]]<=4),\"Baja\",IF(AND(Tabla2[[#This Row],[Disponibilidad]]+Tabla2[[#This Row],[Integridad]]+Tabla2[[#This Row],[Confidencialidad ]]>=5,Tabla2[[#This Row],[Disponibilidad]]+Tabla2[[#This Row],[Integridad]]+Tabla2[[#This Row],[Confidencialidad ]]<=7),\"Media\",IF(Tabla2[[#This Row],[Disponibilidad]]+Tabla2[[#This Row],[Integridad]]+Tabla2[[#This Row],[Confidencialidad ]]>=8,\"Alta\",\"error\")))","v":"Baja"}]
["",null,null,null,null,null,null,null,null,null,null,null,null,null,null,null,null,null,null,null,null,null,null,null,null,{"$f":"IF((Tabla2[[#This Row],[Disponibilidad]]+Tabla2[[#This Row],[Integridad]]+Tabla2[[#This Row],[Confidencialidad ]]<=4),\"Baja\",IF(AND(Tabla2[[#This Row],[Disponibilidad]]+Tabla2[[#This Row],[Integridad]]+Tabla2[[#This Row],[Confidencialidad ]]>=5,Tabla2[[#This Row],[Disponibilidad]]+Tabla2[[#This Row],[Integridad]]+Tabla2[[#This Row],[Confidencialidad ]]<=7),\"Media\",IF(Tabla2[[#This Row],[Disponibilidad]]+Tabla2[[#This Row],[Integridad]]+Tabla2[[#This Row],[Confidencialidad ]]>=8,\"Alta\",\"error\")))","v":"Baja"}]
["",null,null,null,null,null,null,null,null,null,null,null,null,null,null,null,null,null,null,null,null,null,null,null,null,{"$f":"IF((Tabla2[[#This Row],[Disponibilidad]]+Tabla2[[#This Row],[Integridad]]+Tabla2[[#This Row],[Confidencialidad ]]<=4),\"Baja\",IF(AND(Tabla2[[#This Row],[Disponibilidad]]+Tabla2[[#This Row],[Integridad]]+Tabla2[[#This Row],[Confidencialidad ]]>=5,Tabla2[[#This Row],[Disponibilidad]]+Tabla2[[#This Row],[Integridad]]+Tabla2[[#This Row],[Confidencialidad ]]<=7),\"Media\",IF(Tabla2[[#This Row],[Disponibilidad]]+Tabla2[[#This Row],[Integridad]]+Tabla2[[#This Row],[Confidencialidad ]]>=8,\"Alta\",\"error\")))","v":"Baja"}]
["",null,null,null,null,null,null,null,null,null,null,null,null,null,null,null,null,null,null,null,null,null,null,null,null,{"$f":"IF((Tabla2[[#This Row],[Disponibilidad]]+Tabla2[[#This Row],[Integridad]]+Tabla2[[#This Row],[Confidencialidad ]]<=4),\"Baja\",IF(AND(Tabla2[[#This Row],[Disponibilidad]]+Tabla2[[#This Row],[Integridad]]+Tabla2[[#This Row],[Confidencialidad ]]>=5,Tabla2[[#This Row],[Disponibilidad]]+Tabla2[[#This Row],[Integridad]]+Tabla2[[#This Row],[Confidencialidad ]]<=7),\"Media\",IF(Tabla2[[#This Row],[Disponibilidad]]+Tabla2[[#This Row],[Integridad]]+Tabla2[[#This Row],[Confidencialidad ]]>=8,\"Alta\",\"error\")))","v":"Baja"}]
["",null,null,null,null,null,null,null,null,null,null,null,null,null,null,null,null,null,null,null,null,null,null,null,null,{"$f":"IF((Tabla2[[#This Row],[Disponibilidad]]+Tabla2[[#This Row],[Integridad]]+Tabla2[[#This Row],[Confidencialidad ]]<=4),\"Baja\",IF(AND(Tabla2[[#This Row],[Disponibilidad]]+Tabla2[[#This Row],[Integridad]]+Tabla2[[#This Row],[Confidencialidad ]]>=5,Tabla2[[#This Row],[Disponibilidad]]+Tabla2[[#This Row],[Integridad]]+Tabla2[[#This Row],[Confidencialidad ]]<=7),\"Media\",IF(Tabla2[[#This Row],[Disponibilidad]]+Tabla2[[#This Row],[Integridad]]+Tabla2[[#This Row],[Confidencialidad ]]>=8,\"Alta\",\"error\")))","v":"Baja"}]
["",null,null,null,null,null,null,null,null,null,null,null,null,null,null,null,null,null,null,null,null,null,null,null,null,{"$f":"IF((Tabla2[[#This Row],[Disponibilidad]]+Tabla2[[#This Row],[Integridad]]+Tabla2[[#This Row],[Confidencialidad ]]<=4),\"Baja\",IF(AND(Tabla2[[#This Row],[Disponibilidad]]+Tabla2[[#This Row],[Integridad]]+Tabla2[[#This Row],[Confidencialidad ]]>=5,Tabla2[[#This Row],[Disponibilidad]]+Tabla2[[#This Row],[Integridad]]+Tabla2[[#This Row],[Confidencialidad ]]<=7),\"Media\",IF(Tabla2[[#This Row],[Disponibilidad]]+Tabla2[[#This Row],[Integridad]]+Tabla2[[#This Row],[Confidencialidad ]]>=8,\"Alta\",\"error\")))","v":"Baja"}]
["",null,null,null,null,null,null,null,null,null,null,null,null,null,null,null,null,null,null,null,null,null,null,null,null,{"$f":"IF((Tabla2[[#This Row],[Disponibilidad]]+Tabla2[[#This Row],[Integridad]]+Tabla2[[#This Row],[Confidencialidad ]]<=4),\"Baja\",IF(AND(Tabla2[[#This Row],[Disponibilidad]]+Tabla2[[#This Row],[Integridad]]+Tabla2[[#This Row],[Confidencialidad ]]>=5,Tabla2[[#This Row],[Disponibilidad]]+Tabla2[[#This Row],[Integridad]]+Tabla2[[#This Row],[Confidencialidad ]]<=7),\"Media\",IF(Tabla2[[#This Row],[Disponibilidad]]+Tabla2[[#This Row],[Integridad]]+Tabla2[[#This Row],[Confidencialidad ]]>=8,\"Alta\",\"error\")))","v":"Baja"}]
["",null,null,null,null,null,null,null,null,null,null,null,null,null,null,null,null,null,null,null,null,null,null,null,null,{"$f":"IF((Tabla2[[#This Row],[Disponibilidad]]+Tabla2[[#This Row],[Integridad]]+Tabla2[[#This Row],[Confidencialidad ]]<=4),\"Baja\",IF(AND(Tabla2[[#This Row],[Disponibilidad]]+Tabla2[[#This Row],[Integridad]]+Tabla2[[#This Row],[Confidencialidad ]]>=5,Tabla2[[#This Row],[Disponibilidad]]+Tabla2[[#This Row],[Integridad]]+Tabla2[[#This Row],[Confidencialidad ]]<=7),\"Media\",IF(Tabla2[[#This Row],[Disponibilidad]]+Tabla2[[#This Row],[Integridad]]+Tabla2[[#This Row],[Confidencialidad ]]>=8,\"Alta\",\"error\")))","v":"Baja"}]
["",null,null,null,null,null,null,null,null,null,null,null,null,null,null,null,null,null,null,null,null,null,null,null,null,{"$f":"IF((Tabla2[[#This Row],[Disponibilidad]]+Tabla2[[#This Row],[Integridad]]+Tabla2[[#This Row],[Confidencialidad ]]<=4),\"Baja\",IF(AND(Tabla2[[#This Row],[Disponibilidad]]+Tabla2[[#This Row],[Integridad]]+Tabla2[[#This Row],[Confidencialidad ]]>=5,Tabla2[[#This Row],[Disponibilidad]]+Tabla2[[#This Row],[Integridad]]+Tabla2[[#This Row],[Confidencialidad ]]<=7),\"Media\",IF(Tabla2[[#This Row],[Disponibilidad]]+Tabla2[[#This Row],[Integridad]]+Tabla2[[#This Row],[Confidencialidad ]]>=8,\"Alta\",\"error\")))","v":"Baja"}]
["",null,null,null,null,null,null,null,null,null,null,null,null,null,null,null,null,null,null,null,null,null,null,null,null,{"$f":"IF((Tabla2[[#This Row],[Disponibilidad]]+Tabla2[[#This Row],[Integridad]]+Tabla2[[#This Row],[Confidencialidad ]]<=4),\"Baja\",IF(AND(Tabla2[[#This Row],[Disponibilidad]]+Tabla2[[#This Row],[Integridad]]+Tabla2[[#This Row],[Confidencialidad ]]>=5,Tabla2[[#This Row],[Disponibilidad]]+Tabla2[[#This Row],[Integridad]]+Tabla2[[#This Row],[Confidencialidad ]]<=7),\"Media\",IF(Tabla2[[#This Row],[Disponibilidad]]+Tabla2[[#This Row],[Integridad]]+Tabla2[[#This Row],[Confidencialidad ]]>=8,\"Alta\",\"error\")))","v":"Baja"}]
["",null,null,null,null,null,null,null,null,null,null,null,null,null,null,null,null,null,null,null,null,null,null,null,null,{"$f":"IF((Tabla2[[#This Row],[Disponibilidad]]+Tabla2[[#This Row],[Integridad]]+Tabla2[[#This Row],[Confidencialidad ]]<=4),\"Baja\",IF(AND(Tabla2[[#This Row],[Disponibilidad]]+Tabla2[[#This Row],[Integridad]]+Tabla2[[#This Row],[Confidencialidad ]]>=5,Tabla2[[#This Row],[Disponibilidad]]+Tabla2[[#This Row],[Integridad]]+Tabla2[[#This Row],[Confidencialidad ]]<=7),\"Media\",IF(Tabla2[[#This Row],[Disponibilidad]]+Tabla2[[#This Row],[Integridad]]+Tabla2[[#This Row],[Confidencialidad ]]>=8,\"Alta\",\"error\")))","v":"Baja"}]
["",null,null,null,null,null,null,null,null,null,null,null,null,null,null,null,null,null,null,null,null,null,null,null,null,{"$f":"IF((Tabla2[[#This Row],[Disponibilidad]]+Tabla2[[#This Row],[Integridad]]+Tabla2[[#This Row],[Confidencialidad ]]<=4),\"Baja\",IF(AND(Tabla2[[#This Row],[Disponibilidad]]+Tabla2[[#This Row],[Integridad]]+Tabla2[[#This Row],[Confidencialidad ]]>=5,Tabla2[[#This Row],[Disponibilidad]]+Tabla2[[#This Row],[Integridad]]+Tabla2[[#This Row],[Confidencialidad ]]<=7),\"Media\",IF(Tabla2[[#This Row],[Disponibilidad]]+Tabla2[[#This Row],[Integridad]]+Tabla2[[#This Row],[Confidencialidad ]]>=8,\"Alta\",\"error\")))","v":"Baja"}]
["",null,null,null,null,null,null,null,null,null,null,null,null,null,null,null,null,null,null,null,null,null,null,null,null,{"$f":"IF((Tabla2[[#This Row],[Disponibilidad]]+Tabla2[[#This Row],[Integridad]]+Tabla2[[#This Row],[Confidencialidad ]]<=4),\"Baja\",IF(AND(Tabla2[[#This Row],[Disponibilidad]]+Tabla2[[#This Row],[Integridad]]+Tabla2[[#This Row],[Confidencialidad ]]>=5,Tabla2[[#This Row],[Disponibilidad]]+Tabla2[[#This Row],[Integridad]]+Tabla2[[#This Row],[Confidencialidad ]]<=7),\"Media\",IF(Tabla2[[#This Row],[Disponibilidad]]+Tabla2[[#This Row],[Integridad]]+Tabla2[[#This Row],[Confidencialidad ]]>=8,\"Alta\",\"error\")))","v":"Baja"}]
["",null,null,null,null,null,null,null,null,null,null,null,null,null,null,null,null,null,null,null,null,null,null,null,null,{"$f":"IF((Tabla2[[#This Row],[Disponibilidad]]+Tabla2[[#This Row],[Integridad]]+Tabla2[[#This Row],[Confidencialidad ]]<=4),\"Baja\",IF(AND(Tabla2[[#This Row],[Disponibilidad]]+Tabla2[[#This Row],[Integridad]]+Tabla2[[#This Row],[Confidencialidad ]]>=5,Tabla2[[#This Row],[Disponibilidad]]+Tabla2[[#This Row],[Integridad]]+Tabla2[[#This Row],[Confidencialidad ]]<=7),\"Media\",IF(Tabla2[[#This Row],[Disponibilidad]]+Tabla2[[#This Row],[Integridad]]+Tabla2[[#This Row],[Confidencialidad ]]>=8,\"Alta\",\"error\")))","v":"Baja"}]
["",null,null,null,null,null,null,null,null,null,null,null,null,null,null,null,null,null,null,null,null,null,null,null,null,{"$f":"IF((Tabla2[[#This Row],[Disponibilidad]]+Tabla2[[#This Row],[Integridad]]+Tabla2[[#This Row],[Confidencialidad ]]<=4),\"Baja\",IF(AND(Tabla2[[#This Row],[Disponibilidad]]+Tabla2[[#This Row],[Integridad]]+Tabla2[[#This Row],[Confidencialidad ]]>=5,Tabla2[[#This Row],[Disponibilidad]]+Tabla2[[#This Row],[Integridad]]+Tabla2[[#This Row],[Confidencialidad ]]<=7),\"Media\",IF(Tabla2[[#This Row],[Disponibilidad]]+Tabla2[[#This Row],[Integridad]]+Tabla2[[#This Row],[Confidencialidad ]]>=8,\"Alta\",\"error\")))","v":"Baja"}]
["",null,null,null,null,null,null,null,null,null,null,null,null,null,null,null,null,null,null,null,null,null,null,null,null,{"$f":"IF((Tabla2[[#This Row],[Disponibilidad]]+Tabla2[[#This Row],[Integridad]]+Tabla2[[#This Row],[Confidencialidad ]]<=4),\"Baja\",IF(AND(Tabla2[[#This Row],[Disponibilidad]]+Tabla2[[#This Row],[Integridad]]+Tabla2[[#This Row],[Confidencialidad ]]>=5,Tabla2[[#This Row],[Disponibilidad]]+Tabla2[[#This Row],[Integridad]]+Tabla2[[#This Row],[Confidencialidad ]]<=7),\"Media\",IF(Tabla2[[#This Row],[Disponibilidad]]+Tabla2[[#This Row],[Integridad]]+Tabla2[[#This Row],[Confidencialidad ]]>=8,\"Alta\",\"error\")))","v":"Baja"}]
["",null,null,null,null,null,null,null,null,null,null,null,null,null,null,null,null,null,null,null,null,null,null,null,null,{"$f":"IF((Tabla2[[#This Row],[Disponibilidad]]+Tabla2[[#This Row],[Integridad]]+Tabla2[[#This Row],[Confidencialidad ]]<=4),\"Baja\",IF(AND(Tabla2[[#This Row],[Disponibilidad]]+Tabla2[[#This Row],[Integridad]]+Tabla2[[#This Row],[Confidencialidad ]]>=5,Tabla2[[#This Row],[Disponibilidad]]+Tabla2[[#This Row],[Integridad]]+Tabla2[[#This Row],[Confidencialidad ]]<=7),\"Media\",IF(Tabla2[[#This Row],[Disponibilidad]]+Tabla2[[#This Row],[Integridad]]+Tabla2[[#This Row],[Confidencialidad ]]>=8,\"Alta\",\"error\")))","v":"Baja"}]
["",null,null,null,null,null,null,null,null,null,null,null,null,null,null,null,null,null,null,null,null,null,null,null,null,{"$f":"IF((Tabla2[[#This Row],[Disponibilidad]]+Tabla2[[#This Row],[Integridad]]+Tabla2[[#This Row],[Confidencialidad ]]<=4),\"Baja\",IF(AND(Tabla2[[#This Row],[Disponibilidad]]+Tabla2[[#This Row],[Integridad]]+Tabla2[[#This Row],[Confidencialidad ]]>=5,Tabla2[[#This Row],[Disponibilidad]]+Tabla2[[#This Row],[Integridad]]+Tabla2[[#This Row],[Confidencialidad ]]<=7),\"Media\",IF(Tabla2[[#This Row],[Disponibilidad]]+Tabla2[[#This Row],[Integridad]]+Tabla2[[#This Row],[Confidencialidad ]]>=8,\"Alta\",\"error\")))","v":"Baja"}]
["",null,null,null,null,null,null,null,null,null,null,null,null,null,null,null,null,null,null,null,null,null,null,null,null,{"$f":"IF((Tabla2[[#This Row],[Disponibilidad]]+Tabla2[[#This Row],[Integridad]]+Tabla2[[#This Row],[Confidencialidad ]]<=4),\"Baja\",IF(AND(Tabla2[[#This Row],[Disponibilidad]]+Tabla2[[#This Row],[Integridad]]+Tabla2[[#This Row],[Confidencialidad ]]>=5,Tabla2[[#This Row],[Disponibilidad]]+Tabla2[[#This Row],[Integridad]]+Tabla2[[#This Row],[Confidencialidad ]]<=7),\"Media\",IF(Tabla2[[#This Row],[Disponibilidad]]+Tabla2[[#This Row],[Integridad]]+Tabla2[[#This Row],[Confidencialidad ]]>=8,\"Alta\",\"error\")))","v":"Baja"}]
["",null,null,null,null,null,null,null,null,null,null,null,null,null,null,null,null,null,null,null,null,null,null,null,null,{"$f":"IF((Tabla2[[#This Row],[Disponibilidad]]+Tabla2[[#This Row],[Integridad]]+Tabla2[[#This Row],[Confidencialidad ]]<=4),\"Baja\",IF(AND(Tabla2[[#This Row],[Disponibilidad]]+Tabla2[[#This Row],[Integridad]]+Tabla2[[#This Row],[Confidencialidad ]]>=5,Tabla2[[#This Row],[Disponibilidad]]+Tabla2[[#This Row],[Integridad]]+Tabla2[[#This Row],[Confidencialidad ]]<=7),\"Media\",IF(Tabla2[[#This Row],[Disponibilidad]]+Tabla2[[#This Row],[Integridad]]+Tabla2[[#This Row],[Confidencialidad ]]>=8,\"Alta\",\"error\")))","v":"Baja"}]
["",null,null,null,null,null,null,null,null,null,null,null,null,null,null,null,null,null,null,null,null,null,null,null,null,{"$f":"IF((Tabla2[[#This Row],[Disponibilidad]]+Tabla2[[#This Row],[Integridad]]+Tabla2[[#This Row],[Confidencialidad ]]<=4),\"Baja\",IF(AND(Tabla2[[#This Row],[Disponibilidad]]+Tabla2[[#This Row],[Integridad]]+Tabla2[[#This Row],[Confidencialidad ]]>=5,Tabla2[[#This Row],[Disponibilidad]]+Tabla2[[#This Row],[Integridad]]+Tabla2[[#This Row],[Confidencialidad ]]<=7),\"Media\",IF(Tabla2[[#This Row],[Disponibilidad]]+Tabla2[[#This Row],[Integridad]]+Tabla2[[#This Row],[Confidencialidad ]]>=8,\"Alta\",\"error\")))","v":"Baja"}]
["",null,null,null,null,null,null,null,null,null,null,null,null,null,null,null,null,null,null,null,null,null,null,null,null,{"$f":"IF((Tabla2[[#This Row],[Disponibilidad]]+Tabla2[[#This Row],[Integridad]]+Tabla2[[#This Row],[Confidencialidad ]]<=4),\"Baja\",IF(AND(Tabla2[[#This Row],[Disponibilidad]]+Tabla2[[#This Row],[Integridad]]+Tabla2[[#This Row],[Confidencialidad ]]>=5,Tabla2[[#This Row],[Disponibilidad]]+Tabla2[[#This Row],[Integridad]]+Tabla2[[#This Row],[Confidencialidad ]]<=7),\"Media\",IF(Tabla2[[#This Row],[Disponibilidad]]+Tabla2[[#This Row],[Integridad]]+Tabla2[[#This Row],[Confidencialidad ]]>=8,\"Alta\",\"error\")))","v":"Baja"}]
["",null,null,null,null,null,null,null,null,null,null,null,null,null,null,null,null,null,null,null,null,null,null,null,null,{"$f":"IF((Tabla2[[#This Row],[Disponibilidad]]+Tabla2[[#This Row],[Integridad]]+Tabla2[[#This Row],[Confidencialidad ]]<=4),\"Baja\",IF(AND(Tabla2[[#This Row],[Disponibilidad]]+Tabla2[[#This Row],[Integridad]]+Tabla2[[#This Row],[Confidencialidad ]]>=5,Tabla2[[#This Row],[Disponibilidad]]+Tabla2[[#This Row],[Integridad]]+Tabla2[[#This Row],[Confidencialidad ]]<=7),\"Media\",IF(Tabla2[[#This Row],[Disponibilidad]]+Tabla2[[#This Row],[Integridad]]+Tabla2[[#This Row],[Confidencialidad ]]>=8,\"Alta\",\"error\")))","v":"Baja"}]
["",null,null,null,null,null,null,null,null,null,null,null,null,null,null,null,null,null,null,null,null,null,null,null,null,{"$f":"IF((Tabla2[[#This Row],[Disponibilidad]]+Tabla2[[#This Row],[Integridad]]+Tabla2[[#This Row],[Confidencialidad ]]<=4),\"Baja\",IF(AND(Tabla2[[#This Row],[Disponibilidad]]+Tabla2[[#This Row],[Integridad]]+Tabla2[[#This Row],[Confidencialidad ]]>=5,Tabla2[[#This Row],[Disponibilidad]]+Tabla2[[#This Row],[Integridad]]+Tabla2[[#This Row],[Confidencialidad ]]<=7),\"Media\",IF(Tabla2[[#This Row],[Disponibilidad]]+Tabla2[[#This Row],[Integridad]]+Tabla2[[#This Row],[Confidencialidad ]]>=8,\"Alta\",\"error\")))","v":"Baja"}]
["",null,null,null,null,null,null,null,null,null,null,null,null,null,null,null,null,null,null,null,null,null,null,null,null,{"$f":"IF((Tabla2[[#This Row],[Disponibilidad]]+Tabla2[[#This Row],[Integridad]]+Tabla2[[#This Row],[Confidencialidad ]]<=4),\"Baja\",IF(AND(Tabla2[[#This Row],[Disponibilidad]]+Tabla2[[#This Row],[Integridad]]+Tabla2[[#This Row],[Confidencialidad ]]>=5,Tabla2[[#This Row],[Disponibilidad]]+Tabla2[[#This Row],[Integridad]]+Tabla2[[#This Row],[Confidencialidad ]]<=7),\"Media\",IF(Tabla2[[#This Row],[Disponibilidad]]+Tabla2[[#This Row],[Integridad]]+Tabla2[[#This Row],[Confidencialidad ]]>=8,\"Alta\",\"error\")))","v":"Baja"}]
["",null,null,null,null,null,null,null,null,null,null,null,null,null,null,null,null,null,null,null,null,null,null,null,null,{"$f":"IF((Tabla2[[#This Row],[Disponibilidad]]+Tabla2[[#This Row],[Integridad]]+Tabla2[[#This Row],[Confidencialidad ]]<=4),\"Baja\",IF(AND(Tabla2[[#This Row],[Disponibilidad]]+Tabla2[[#This Row],[Integridad]]+Tabla2[[#This Row],[Confidencialidad ]]>=5,Tabla2[[#This Row],[Disponibilidad]]+Tabla2[[#This Row],[Integridad]]+Tabla2[[#This Row],[Confidencialidad ]]<=7),\"Media\",IF(Tabla2[[#This Row],[Disponibilidad]]+Tabla2[[#This Row],[Integridad]]+Tabla2[[#This Row],[Confidencialidad ]]>=8,\"Alta\",\"error\")))","v":"Baja"}]
["",null,null,null,null,null,null,null,null,null,null,null,null,null,null,null,null,null,null,null,null,null,null,null,null,{"$f":"IF((Tabla2[[#This Row],[Disponibilidad]]+Tabla2[[#This Row],[Integridad]]+Tabla2[[#This Row],[Confidencialidad ]]<=4),\"Baja\",IF(AND(Tabla2[[#This Row],[Disponibilidad]]+Tabla2[[#This Row],[Integridad]]+Tabla2[[#This Row],[Confidencialidad ]]>=5,Tabla2[[#This Row],[Disponibilidad]]+Tabla2[[#This Row],[Integridad]]+Tabla2[[#This Row],[Confidencialidad ]]<=7),\"Media\",IF(Tabla2[[#This Row],[Disponibilidad]]+Tabla2[[#This Row],[Integridad]]+Tabla2[[#This Row],[Confidencialidad ]]>=8,\"Alta\",\"error\")))","v":"Baja"}]
["",null,null,null,null,null,null,null,null,null,null,null,null,null,null,null,null,null,null,null,null,null,null,null,null,{"$f":"IF((Tabla2[[#This Row],[Disponibilidad]]+Tabla2[[#This Row],[Integridad]]+Tabla2[[#This Row],[Confidencialidad ]]<=4),\"Baja\",IF(AND(Tabla2[[#This Row],[Disponibilidad]]+Tabla2[[#This Row],[Integridad]]+Tabla2[[#This Row],[Confidencialidad ]]>=5,Tabla2[[#This Row],[Disponibilidad]]+Tabla2[[#This Row],[Integridad]]+Tabla2[[#This Row],[Confidencialidad ]]<=7),\"Media\",IF(Tabla2[[#This Row],[Disponibilidad]]+Tabla2[[#This Row],[Integridad]]+Tabla2[[#This Row],[Confidencialidad ]]>=8,\"Alta\",\"error\")))","v":"Baja"}]
["",null,null,null,null,null,null,null,null,null,null,null,null,null,null,null,null,null,null,null,null,null,null,null,null,{"$f":"IF((Tabla2[[#This Row],[Disponibilidad]]+Tabla2[[#This Row],[Integridad]]+Tabla2[[#This Row],[Confidencialidad ]]<=4),\"Baja\",IF(AND(Tabla2[[#This Row],[Disponibilidad]]+Tabla2[[#This Row],[Integridad]]+Tabla2[[#This Row],[Confidencialidad ]]>=5,Tabla2[[#This Row],[Disponibilidad]]+Tabla2[[#This Row],[Integridad]]+Tabla2[[#This Row],[Confidencialidad ]]<=7),\"Media\",IF(Tabla2[[#This Row],[Disponibilidad]]+Tabla2[[#This Row],[Integridad]]+Tabla2[[#This Row],[Confidencialidad ]]>=8,\"Alta\",\"error\")))","v":"Baja"}]
["",null,null,null,null,null,null,null,null,null,null,null,null,null,null,null,null,null,null,null,null,null,null,null,null,{"$f":"IF((Tabla2[[#This Row],[Disponibilidad]]+Tabla2[[#This Row],[Integridad]]+Tabla2[[#This Row],[Confidencialidad ]]<=4),\"Baja\",IF(AND(Tabla2[[#This Row],[Disponibilidad]]+Tabla2[[#This Row],[Integridad]]+Tabla2[[#This Row],[Confidencialidad ]]>=5,Tabla2[[#This Row],[Disponibilidad]]+Tabla2[[#This Row],[Integridad]]+Tabla2[[#This Row],[Confidencialidad ]]<=7),\"Media\",IF(Tabla2[[#This Row],[Disponibilidad]]+Tabla2[[#This Row],[Integridad]]+Tabla2[[#This Row],[Confidencialidad ]]>=8,\"Alta\",\"error\")))","v":"Baja"}]
["",null,null,null,null,null,null,null,null,null,null,null,null,null,null,null,null,null,null,null,null,null,null,null,null,{"$f":"IF((Tabla2[[#This Row],[Disponibilidad]]+Tabla2[[#This Row],[Integridad]]+Tabla2[[#This Row],[Confidencialidad ]]<=4),\"Baja\",IF(AND(Tabla2[[#This Row],[Disponibilidad]]+Tabla2[[#This Row],[Integridad]]+Tabla2[[#This Row],[Confidencialidad ]]>=5,Tabla2[[#This Row],[Disponibilidad]]+Tabla2[[#This Row],[Integridad]]+Tabla2[[#This Row],[Confidencialidad ]]<=7),\"Media\",IF(Tabla2[[#This Row],[Disponibilidad]]+Tabla2[[#This Row],[Integridad]]+Tabla2[[#This Row],[Confidencialidad ]]>=8,\"Alta\",\"error\")))","v":"Baja"}]
[{"$f":"IF(C835<>\"\",1,\"\")","v":""},null,null,null,null,null,null,null,null,null,null,null,null,null,null,null,null,null,null,null,null,null,null,null,null,{"$f":"IF((Tabla2[[#This Row],[Disponibilidad]]+Tabla2[[#This Row],[Integridad]]+Tabla2[[#This Row],[Confidencialidad ]]<=4),\"Baja\",IF(AND(Tabla2[[#This Row],[Disponibilidad]]+Tabla2[[#This Row],[Integridad]]+Tabla2[[#This Row],[Confidencialidad ]]>=5,Tabla2[[#This Row],[Disponibilidad]]+Tabla2[[#This Row],[Integridad]]+Tabla2[[#This Row],[Confidencialidad ]]<=7),\"Media\",IF(Tabla2[[#This Row],[Disponibilidad]]+Tabla2[[#This Row],[Integridad]]+Tabla2[[#This Row],[Confidencialidad ]]>=8,\"Alta\",\"error\")))","v":"Baja"}]
["",null,null,null,null,null,null,null,null,null,null,null,null,null,null,null,null,null,null,null,null,null,null,null,null,{"$f":"IF((Tabla2[[#This Row],[Disponibilidad]]+Tabla2[[#This Row],[Integridad]]+Tabla2[[#This Row],[Confidencialidad ]]<=4),\"Baja\",IF(AND(Tabla2[[#This Row],[Disponibilidad]]+Tabla2[[#This Row],[Integridad]]+Tabla2[[#This Row],[Confidencialidad ]]>=5,Tabla2[[#This Row],[Disponibilidad]]+Tabla2[[#This Row],[Integridad]]+Tabla2[[#This Row],[Confidencialidad ]]<=7),\"Media\",IF(Tabla2[[#This Row],[Disponibilidad]]+Tabla2[[#This Row],[Integridad]]+Tabla2[[#This Row],[Confidencialidad ]]>=8,\"Alta\",\"error\")))","v":"Baja"}]
["",null,null,null,null,null,null,null,null,null,null,null,null,null,null,null,null,null,null,null,null,null,null,null,null,{"$f":"IF((Tabla2[[#This Row],[Disponibilidad]]+Tabla2[[#This Row],[Integridad]]+Tabla2[[#This Row],[Confidencialidad ]]<=4),\"Baja\",IF(AND(Tabla2[[#This Row],[Disponibilidad]]+Tabla2[[#This Row],[Integridad]]+Tabla2[[#This Row],[Confidencialidad ]]>=5,Tabla2[[#This Row],[Disponibilidad]]+Tabla2[[#This Row],[Integridad]]+Tabla2[[#This Row],[Confidencialidad ]]<=7),\"Media\",IF(Tabla2[[#This Row],[Disponibilidad]]+Tabla2[[#This Row],[Integridad]]+Tabla2[[#This Row],[Confidencialidad ]]>=8,\"Alta\",\"error\")))","v":"Baja"}]
["",null,null,null,null,null,null,null,null,null,null,null,null,null,null,null,null,null,null,null,null,null,null,null,null,{"$f":"IF((Tabla2[[#This Row],[Disponibilidad]]+Tabla2[[#This Row],[Integridad]]+Tabla2[[#This Row],[Confidencialidad ]]<=4),\"Baja\",IF(AND(Tabla2[[#This Row],[Disponibilidad]]+Tabla2[[#This Row],[Integridad]]+Tabla2[[#This Row],[Confidencialidad ]]>=5,Tabla2[[#This Row],[Disponibilidad]]+Tabla2[[#This Row],[Integridad]]+Tabla2[[#This Row],[Confidencialidad ]]<=7),\"Media\",IF(Tabla2[[#This Row],[Disponibilidad]]+Tabla2[[#This Row],[Integridad]]+Tabla2[[#This Row],[Confidencialidad ]]>=8,\"Alta\",\"error\")))","v":"Baja"}]
["",null,null,null,null,null,null,null,null,null,null,null,null,null,null,null,null,null,null,null,null,null,null,null,null,{"$f":"IF((Tabla2[[#This Row],[Disponibilidad]]+Tabla2[[#This Row],[Integridad]]+Tabla2[[#This Row],[Confidencialidad ]]<=4),\"Baja\",IF(AND(Tabla2[[#This Row],[Disponibilidad]]+Tabla2[[#This Row],[Integridad]]+Tabla2[[#This Row],[Confidencialidad ]]>=5,Tabla2[[#This Row],[Disponibilidad]]+Tabla2[[#This Row],[Integridad]]+Tabla2[[#This Row],[Confidencialidad ]]<=7),\"Media\",IF(Tabla2[[#This Row],[Disponibilidad]]+Tabla2[[#This Row],[Integridad]]+Tabla2[[#This Row],[Confidencialidad ]]>=8,\"Alta\",\"error\")))","v":"Baja"}]
["",null,null,null,null,null,null,null,null,null,null,null,null,null,null,null,null,null,null,null,null,null,null,null,null,{"$f":"IF((Tabla2[[#This Row],[Disponibilidad]]+Tabla2[[#This Row],[Integridad]]+Tabla2[[#This Row],[Confidencialidad ]]<=4),\"Baja\",IF(AND(Tabla2[[#This Row],[Disponibilidad]]+Tabla2[[#This Row],[Integridad]]+Tabla2[[#This Row],[Confidencialidad ]]>=5,Tabla2[[#This Row],[Disponibilidad]]+Tabla2[[#This Row],[Integridad]]+Tabla2[[#This Row],[Confidencialidad ]]<=7),\"Media\",IF(Tabla2[[#This Row],[Disponibilidad]]+Tabla2[[#This Row],[Integridad]]+Tabla2[[#This Row],[Confidencialidad ]]>=8,\"Alta\",\"error\")))","v":"Baja"}]
["",null,null,null,null,null,null,null,null,null,null,null,null,null,null,null,null,null,null,null,null,null,null,null,null,{"$f":"IF((Tabla2[[#This Row],[Disponibilidad]]+Tabla2[[#This Row],[Integridad]]+Tabla2[[#This Row],[Confidencialidad ]]<=4),\"Baja\",IF(AND(Tabla2[[#This Row],[Disponibilidad]]+Tabla2[[#This Row],[Integridad]]+Tabla2[[#This Row],[Confidencialidad ]]>=5,Tabla2[[#This Row],[Disponibilidad]]+Tabla2[[#This Row],[Integridad]]+Tabla2[[#This Row],[Confidencialidad ]]<=7),\"Media\",IF(Tabla2[[#This Row],[Disponibilidad]]+Tabla2[[#This Row],[Integridad]]+Tabla2[[#This Row],[Confidencialidad ]]>=8,\"Alta\",\"error\")))","v":"Baja"}]
["",null,null,null,null,null,null,null,null,null,null,null,null,null,null,null,null,null,null,null,null,null,null,null,null,{"$f":"IF((Tabla2[[#This Row],[Disponibilidad]]+Tabla2[[#This Row],[Integridad]]+Tabla2[[#This Row],[Confidencialidad ]]<=4),\"Baja\",IF(AND(Tabla2[[#This Row],[Disponibilidad]]+Tabla2[[#This Row],[Integridad]]+Tabla2[[#This Row],[Confidencialidad ]]>=5,Tabla2[[#This Row],[Disponibilidad]]+Tabla2[[#This Row],[Integridad]]+Tabla2[[#This Row],[Confidencialidad ]]<=7),\"Media\",IF(Tabla2[[#This Row],[Disponibilidad]]+Tabla2[[#This Row],[Integridad]]+Tabla2[[#This Row],[Confidencialidad ]]>=8,\"Alta\",\"error\")))","v":"Baja"}]
["",null,null,null,null,null,null,null,null,null,null,null,null,null,null,null,null,null,null,null,null,null,null,null,null,{"$f":"IF((Tabla2[[#This Row],[Disponibilidad]]+Tabla2[[#This Row],[Integridad]]+Tabla2[[#This Row],[Confidencialidad ]]<=4),\"Baja\",IF(AND(Tabla2[[#This Row],[Disponibilidad]]+Tabla2[[#This Row],[Integridad]]+Tabla2[[#This Row],[Confidencialidad ]]>=5,Tabla2[[#This Row],[Disponibilidad]]+Tabla2[[#This Row],[Integridad]]+Tabla2[[#This Row],[Confidencialidad ]]<=7),\"Media\",IF(Tabla2[[#This Row],[Disponibilidad]]+Tabla2[[#This Row],[Integridad]]+Tabla2[[#This Row],[Confidencialidad ]]>=8,\"Alta\",\"error\")))","v":"Baja"}]
["",null,null,null,null,null,null,null,null,null,null,null,null,null,null,null,null,null,null,null,null,null,null,null,null,{"$f":"IF((Tabla2[[#This Row],[Disponibilidad]]+Tabla2[[#This Row],[Integridad]]+Tabla2[[#This Row],[Confidencialidad ]]<=4),\"Baja\",IF(AND(Tabla2[[#This Row],[Disponibilidad]]+Tabla2[[#This Row],[Integridad]]+Tabla2[[#This Row],[Confidencialidad ]]>=5,Tabla2[[#This Row],[Disponibilidad]]+Tabla2[[#This Row],[Integridad]]+Tabla2[[#This Row],[Confidencialidad ]]<=7),\"Media\",IF(Tabla2[[#This Row],[Disponibilidad]]+Tabla2[[#This Row],[Integridad]]+Tabla2[[#This Row],[Confidencialidad ]]>=8,\"Alta\",\"error\")))","v":"Baja"}]
["",null,null,null,null,null,null,null,null,null,null,null,null,null,null,null,null,null,null,null,null,null,null,null,null,{"$f":"IF((Tabla2[[#This Row],[Disponibilidad]]+Tabla2[[#This Row],[Integridad]]+Tabla2[[#This Row],[Confidencialidad ]]<=4),\"Baja\",IF(AND(Tabla2[[#This Row],[Disponibilidad]]+Tabla2[[#This Row],[Integridad]]+Tabla2[[#This Row],[Confidencialidad ]]>=5,Tabla2[[#This Row],[Disponibilidad]]+Tabla2[[#This Row],[Integridad]]+Tabla2[[#This Row],[Confidencialidad ]]<=7),\"Media\",IF(Tabla2[[#This Row],[Disponibilidad]]+Tabla2[[#This Row],[Integridad]]+Tabla2[[#This Row],[Confidencialidad ]]>=8,\"Alta\",\"error\")))","v":"Baja"}]
["",null,null,null,null,null,null,null,null,null,null,null,null,null,null,null,null,null,null,null,null,null,null,null,null,{"$f":"IF((Tabla2[[#This Row],[Disponibilidad]]+Tabla2[[#This Row],[Integridad]]+Tabla2[[#This Row],[Confidencialidad ]]<=4),\"Baja\",IF(AND(Tabla2[[#This Row],[Disponibilidad]]+Tabla2[[#This Row],[Integridad]]+Tabla2[[#This Row],[Confidencialidad ]]>=5,Tabla2[[#This Row],[Disponibilidad]]+Tabla2[[#This Row],[Integridad]]+Tabla2[[#This Row],[Confidencialidad ]]<=7),\"Media\",IF(Tabla2[[#This Row],[Disponibilidad]]+Tabla2[[#This Row],[Integridad]]+Tabla2[[#This Row],[Confidencialidad ]]>=8,\"Alta\",\"error\")))","v":"Baja"}]
["",null,null,null,null,null,null,null,null,null,null,null,null,null,null,null,null,null,null,null,null,null,null,null,null,{"$f":"IF((Tabla2[[#This Row],[Disponibilidad]]+Tabla2[[#This Row],[Integridad]]+Tabla2[[#This Row],[Confidencialidad ]]<=4),\"Baja\",IF(AND(Tabla2[[#This Row],[Disponibilidad]]+Tabla2[[#This Row],[Integridad]]+Tabla2[[#This Row],[Confidencialidad ]]>=5,Tabla2[[#This Row],[Disponibilidad]]+Tabla2[[#This Row],[Integridad]]+Tabla2[[#This Row],[Confidencialidad ]]<=7),\"Media\",IF(Tabla2[[#This Row],[Disponibilidad]]+Tabla2[[#This Row],[Integridad]]+Tabla2[[#This Row],[Confidencialidad ]]>=8,\"Alta\",\"error\")))","v":"Baja"}]
["",null,null,null,null,null,null,null,null,null,null,null,null,null,null,null,null,null,null,null,null,null,null,null,null,{"$f":"IF((Tabla2[[#This Row],[Disponibilidad]]+Tabla2[[#This Row],[Integridad]]+Tabla2[[#This Row],[Confidencialidad ]]<=4),\"Baja\",IF(AND(Tabla2[[#This Row],[Disponibilidad]]+Tabla2[[#This Row],[Integridad]]+Tabla2[[#This Row],[Confidencialidad ]]>=5,Tabla2[[#This Row],[Disponibilidad]]+Tabla2[[#This Row],[Integridad]]+Tabla2[[#This Row],[Confidencialidad ]]<=7),\"Media\",IF(Tabla2[[#This Row],[Disponibilidad]]+Tabla2[[#This Row],[Integridad]]+Tabla2[[#This Row],[Confidencialidad ]]>=8,\"Alta\",\"error\")))","v":"Baja"}]
["",null,null,null,null,null,null,null,null,null,null,null,null,null,null,null,null,null,null,null,null,null,null,null,null,{"$f":"IF((Tabla2[[#This Row],[Disponibilidad]]+Tabla2[[#This Row],[Integridad]]+Tabla2[[#This Row],[Confidencialidad ]]<=4),\"Baja\",IF(AND(Tabla2[[#This Row],[Disponibilidad]]+Tabla2[[#This Row],[Integridad]]+Tabla2[[#This Row],[Confidencialidad ]]>=5,Tabla2[[#This Row],[Disponibilidad]]+Tabla2[[#This Row],[Integridad]]+Tabla2[[#This Row],[Confidencialidad ]]<=7),\"Media\",IF(Tabla2[[#This Row],[Disponibilidad]]+Tabla2[[#This Row],[Integridad]]+Tabla2[[#This Row],[Confidencialidad ]]>=8,\"Alta\",\"error\")))","v":"Baja"}]
["",null,null,null,null,null,null,null,null,null,null,null,null,null,null,null,null,null,null,null,null,null,null,null,null,{"$f":"IF((Tabla2[[#This Row],[Disponibilidad]]+Tabla2[[#This Row],[Integridad]]+Tabla2[[#This Row],[Confidencialidad ]]<=4),\"Baja\",IF(AND(Tabla2[[#This Row],[Disponibilidad]]+Tabla2[[#This Row],[Integridad]]+Tabla2[[#This Row],[Confidencialidad ]]>=5,Tabla2[[#This Row],[Disponibilidad]]+Tabla2[[#This Row],[Integridad]]+Tabla2[[#This Row],[Confidencialidad ]]<=7),\"Media\",IF(Tabla2[[#This Row],[Disponibilidad]]+Tabla2[[#This Row],[Integridad]]+Tabla2[[#This Row],[Confidencialidad ]]>=8,\"Alta\",\"error\")))","v":"Baja"}]
["",null,null,null,null,null,null,null,null,null,null,null,null,null,null,null,null,null,null,null,null,null,null,null,null,{"$f":"IF((Tabla2[[#This Row],[Disponibilidad]]+Tabla2[[#This Row],[Integridad]]+Tabla2[[#This Row],[Confidencialidad ]]<=4),\"Baja\",IF(AND(Tabla2[[#This Row],[Disponibilidad]]+Tabla2[[#This Row],[Integridad]]+Tabla2[[#This Row],[Confidencialidad ]]>=5,Tabla2[[#This Row],[Disponibilidad]]+Tabla2[[#This Row],[Integridad]]+Tabla2[[#This Row],[Confidencialidad ]]<=7),\"Media\",IF(Tabla2[[#This Row],[Disponibilidad]]+Tabla2[[#This Row],[Integridad]]+Tabla2[[#This Row],[Confidencialidad ]]>=8,\"Alta\",\"error\")))","v":"Baja"}]
["",null,null,null,null,null,null,null,null,null,null,null,null,null,null,null,null,null,null,null,null,null,null,null,null,{"$f":"IF((Tabla2[[#This Row],[Disponibilidad]]+Tabla2[[#This Row],[Integridad]]+Tabla2[[#This Row],[Confidencialidad ]]<=4),\"Baja\",IF(AND(Tabla2[[#This Row],[Disponibilidad]]+Tabla2[[#This Row],[Integridad]]+Tabla2[[#This Row],[Confidencialidad ]]>=5,Tabla2[[#This Row],[Disponibilidad]]+Tabla2[[#This Row],[Integridad]]+Tabla2[[#This Row],[Confidencialidad ]]<=7),\"Media\",IF(Tabla2[[#This Row],[Disponibilidad]]+Tabla2[[#This Row],[Integridad]]+Tabla2[[#This Row],[Confidencialidad ]]>=8,\"Alta\",\"error\")))","v":"Baja"}]
["",null,null,null,null,null,null,null,null,null,null,null,null,null,null,null,null,null,null,null,null,null,null,null,null,{"$f":"IF((Tabla2[[#This Row],[Disponibilidad]]+Tabla2[[#This Row],[Integridad]]+Tabla2[[#This Row],[Confidencialidad ]]<=4),\"Baja\",IF(AND(Tabla2[[#This Row],[Disponibilidad]]+Tabla2[[#This Row],[Integridad]]+Tabla2[[#This Row],[Confidencialidad ]]>=5,Tabla2[[#This Row],[Disponibilidad]]+Tabla2[[#This Row],[Integridad]]+Tabla2[[#This Row],[Confidencialidad ]]<=7),\"Media\",IF(Tabla2[[#This Row],[Disponibilidad]]+Tabla2[[#This Row],[Integridad]]+Tabla2[[#This Row],[Confidencialidad ]]>=8,\"Alta\",\"error\")))","v":"Baja"}]
["",null,null,null,null,null,null,null,null,null,null,null,null,null,null,null,null,null,null,null,null,null,null,null,null,{"$f":"IF((Tabla2[[#This Row],[Disponibilidad]]+Tabla2[[#This Row],[Integridad]]+Tabla2[[#This Row],[Confidencialidad ]]<=4),\"Baja\",IF(AND(Tabla2[[#This Row],[Disponibilidad]]+Tabla2[[#This Row],[Integridad]]+Tabla2[[#This Row],[Confidencialidad ]]>=5,Tabla2[[#This Row],[Disponibilidad]]+Tabla2[[#This Row],[Integridad]]+Tabla2[[#This Row],[Confidencialidad ]]<=7),\"Media\",IF(Tabla2[[#This Row],[Disponibilidad]]+Tabla2[[#This Row],[Integridad]]+Tabla2[[#This Row],[Confidencialidad ]]>=8,\"Alta\",\"error\")))","v":"Baja"}]
["",null,null,null,null,null,null,null,null,null,null,null,null,null,null,null,null,null,null,null,null,null,null,null,null,{"$f":"IF((Tabla2[[#This Row],[Disponibilidad]]+Tabla2[[#This Row],[Integridad]]+Tabla2[[#This Row],[Confidencialidad ]]<=4),\"Baja\",IF(AND(Tabla2[[#This Row],[Disponibilidad]]+Tabla2[[#This Row],[Integridad]]+Tabla2[[#This Row],[Confidencialidad ]]>=5,Tabla2[[#This Row],[Disponibilidad]]+Tabla2[[#This Row],[Integridad]]+Tabla2[[#This Row],[Confidencialidad ]]<=7),\"Media\",IF(Tabla2[[#This Row],[Disponibilidad]]+Tabla2[[#This Row],[Integridad]]+Tabla2[[#This Row],[Confidencialidad ]]>=8,\"Alta\",\"error\")))","v":"Baja"}]
["",null,null,null,null,null,null,null,null,null,null,null,null,null,null,null,null,null,null,null,null,null,null,null,null,{"$f":"IF((Tabla2[[#This Row],[Disponibilidad]]+Tabla2[[#This Row],[Integridad]]+Tabla2[[#This Row],[Confidencialidad ]]<=4),\"Baja\",IF(AND(Tabla2[[#This Row],[Disponibilidad]]+Tabla2[[#This Row],[Integridad]]+Tabla2[[#This Row],[Confidencialidad ]]>=5,Tabla2[[#This Row],[Disponibilidad]]+Tabla2[[#This Row],[Integridad]]+Tabla2[[#This Row],[Confidencialidad ]]<=7),\"Media\",IF(Tabla2[[#This Row],[Disponibilidad]]+Tabla2[[#This Row],[Integridad]]+Tabla2[[#This Row],[Confidencialidad ]]>=8,\"Alta\",\"error\")))","v":"Baja"}]
["",null,null,null,null,null,null,null,null,null,null,null,null,null,null,null,null,null,null,null,null,null,null,null,null,{"$f":"IF((Tabla2[[#This Row],[Disponibilidad]]+Tabla2[[#This Row],[Integridad]]+Tabla2[[#This Row],[Confidencialidad ]]<=4),\"Baja\",IF(AND(Tabla2[[#This Row],[Disponibilidad]]+Tabla2[[#This Row],[Integridad]]+Tabla2[[#This Row],[Confidencialidad ]]>=5,Tabla2[[#This Row],[Disponibilidad]]+Tabla2[[#This Row],[Integridad]]+Tabla2[[#This Row],[Confidencialidad ]]<=7),\"Media\",IF(Tabla2[[#This Row],[Disponibilidad]]+Tabla2[[#This Row],[Integridad]]+Tabla2[[#This Row],[Confidencialidad ]]>=8,\"Alta\",\"error\")))","v":"Baja"}]
["",null,null,null,null,null,null,null,null,null,null,null,null,null,null,null,null,null,null,null,null,null,null,null,null,{"$f":"IF((Tabla2[[#This Row],[Disponibilidad]]+Tabla2[[#This Row],[Integridad]]+Tabla2[[#This Row],[Confidencialidad ]]<=4),\"Baja\",IF(AND(Tabla2[[#This Row],[Disponibilidad]]+Tabla2[[#This Row],[Integridad]]+Tabla2[[#This Row],[Confidencialidad ]]>=5,Tabla2[[#This Row],[Disponibilidad]]+Tabla2[[#This Row],[Integridad]]+Tabla2[[#This Row],[Confidencialidad ]]<=7),\"Media\",IF(Tabla2[[#This Row],[Disponibilidad]]+Tabla2[[#This Row],[Integridad]]+Tabla2[[#This Row],[Confidencialidad ]]>=8,\"Alta\",\"error\")))","v":"Baja"}]
["",null,null,null,null,null,null,null,null,null,null,null,null,null,null,null,null,null,null,null,null,null,null,null,null,{"$f":"IF((Tabla2[[#This Row],[Disponibilidad]]+Tabla2[[#This Row],[Integridad]]+Tabla2[[#This Row],[Confidencialidad ]]<=4),\"Baja\",IF(AND(Tabla2[[#This Row],[Disponibilidad]]+Tabla2[[#This Row],[Integridad]]+Tabla2[[#This Row],[Confidencialidad ]]>=5,Tabla2[[#This Row],[Disponibilidad]]+Tabla2[[#This Row],[Integridad]]+Tabla2[[#This Row],[Confidencialidad ]]<=7),\"Media\",IF(Tabla2[[#This Row],[Disponibilidad]]+Tabla2[[#This Row],[Integridad]]+Tabla2[[#This Row],[Confidencialidad ]]>=8,\"Alta\",\"error\")))","v":"Baja"}]
[{"$f":"IF(C860<>\"\",1,\"\")","v":""},null,null,null,null,null,null,null,null,null,null,null,null,null,null,null,null,null,null,null,null,null,null,null,null,{"$f":"IF((Tabla2[[#This Row],[Disponibilidad]]+Tabla2[[#This Row],[Integridad]]+Tabla2[[#This Row],[Confidencialidad ]]<=4),\"Baja\",IF(AND(Tabla2[[#This Row],[Disponibilidad]]+Tabla2[[#This Row],[Integridad]]+Tabla2[[#This Row],[Confidencialidad ]]>=5,Tabla2[[#This Row],[Disponibilidad]]+Tabla2[[#This Row],[Integridad]]+Tabla2[[#This Row],[Confidencialidad ]]<=7),\"Media\",IF(Tabla2[[#This Row],[Disponibilidad]]+Tabla2[[#This Row],[Integridad]]+Tabla2[[#This Row],[Confidencialidad ]]>=8,\"Alta\",\"error\")))","v":"Baja"}]
["",null,null,null,null,null,null,null,null,null,null,null,null,null,null,null,null,null,null,null,null,null,null,null,null,{"$f":"IF((Tabla2[[#This Row],[Disponibilidad]]+Tabla2[[#This Row],[Integridad]]+Tabla2[[#This Row],[Confidencialidad ]]<=4),\"Baja\",IF(AND(Tabla2[[#This Row],[Disponibilidad]]+Tabla2[[#This Row],[Integridad]]+Tabla2[[#This Row],[Confidencialidad ]]>=5,Tabla2[[#This Row],[Disponibilidad]]+Tabla2[[#This Row],[Integridad]]+Tabla2[[#This Row],[Confidencialidad ]]<=7),\"Media\",IF(Tabla2[[#This Row],[Disponibilidad]]+Tabla2[[#This Row],[Integridad]]+Tabla2[[#This Row],[Confidencialidad ]]>=8,\"Alta\",\"error\")))","v":"Baja"}]
["",null,null,null,null,null,null,null,null,null,null,null,null,null,null,null,null,null,null,null,null,null,null,null,null,{"$f":"IF((Tabla2[[#This Row],[Disponibilidad]]+Tabla2[[#This Row],[Integridad]]+Tabla2[[#This Row],[Confidencialidad ]]<=4),\"Baja\",IF(AND(Tabla2[[#This Row],[Disponibilidad]]+Tabla2[[#This Row],[Integridad]]+Tabla2[[#This Row],[Confidencialidad ]]>=5,Tabla2[[#This Row],[Disponibilidad]]+Tabla2[[#This Row],[Integridad]]+Tabla2[[#This Row],[Confidencialidad ]]<=7),\"Media\",IF(Tabla2[[#This Row],[Disponibilidad]]+Tabla2[[#This Row],[Integridad]]+Tabla2[[#This Row],[Confidencialidad ]]>=8,\"Alta\",\"error\")))","v":"Baja"}]
["",null,null,null,null,null,null,null,null,null,null,null,null,null,null,null,null,null,null,null,null,null,null,null,null,{"$f":"IF((Tabla2[[#This Row],[Disponibilidad]]+Tabla2[[#This Row],[Integridad]]+Tabla2[[#This Row],[Confidencialidad ]]<=4),\"Baja\",IF(AND(Tabla2[[#This Row],[Disponibilidad]]+Tabla2[[#This Row],[Integridad]]+Tabla2[[#This Row],[Confidencialidad ]]>=5,Tabla2[[#This Row],[Disponibilidad]]+Tabla2[[#This Row],[Integridad]]+Tabla2[[#This Row],[Confidencialidad ]]<=7),\"Media\",IF(Tabla2[[#This Row],[Disponibilidad]]+Tabla2[[#This Row],[Integridad]]+Tabla2[[#This Row],[Confidencialidad ]]>=8,\"Alta\",\"error\")))","v":"Baja"}]
["",null,null,null,null,null,null,null,null,null,null,null,null,null,null,null,null,null,null,null,null,null,null,null,null,{"$f":"IF((Tabla2[[#This Row],[Disponibilidad]]+Tabla2[[#This Row],[Integridad]]+Tabla2[[#This Row],[Confidencialidad ]]<=4),\"Baja\",IF(AND(Tabla2[[#This Row],[Disponibilidad]]+Tabla2[[#This Row],[Integridad]]+Tabla2[[#This Row],[Confidencialidad ]]>=5,Tabla2[[#This Row],[Disponibilidad]]+Tabla2[[#This Row],[Integridad]]+Tabla2[[#This Row],[Confidencialidad ]]<=7),\"Media\",IF(Tabla2[[#This Row],[Disponibilidad]]+Tabla2[[#This Row],[Integridad]]+Tabla2[[#This Row],[Confidencialidad ]]>=8,\"Alta\",\"error\")))","v":"Baja"}]
["",null,null,null,null,null,null,null,null,null,null,null,null,null,null,null,null,null,null,null,null,null,null,null,null,{"$f":"IF((Tabla2[[#This Row],[Disponibilidad]]+Tabla2[[#This Row],[Integridad]]+Tabla2[[#This Row],[Confidencialidad ]]<=4),\"Baja\",IF(AND(Tabla2[[#This Row],[Disponibilidad]]+Tabla2[[#This Row],[Integridad]]+Tabla2[[#This Row],[Confidencialidad ]]>=5,Tabla2[[#This Row],[Disponibilidad]]+Tabla2[[#This Row],[Integridad]]+Tabla2[[#This Row],[Confidencialidad ]]<=7),\"Media\",IF(Tabla2[[#This Row],[Disponibilidad]]+Tabla2[[#This Row],[Integridad]]+Tabla2[[#This Row],[Confidencialidad ]]>=8,\"Alta\",\"error\")))","v":"Baja"}]
["",null,null,null,null,null,null,null,null,null,null,null,null,null,null,null,null,null,null,null,null,null,null,null,null,{"$f":"IF((Tabla2[[#This Row],[Disponibilidad]]+Tabla2[[#This Row],[Integridad]]+Tabla2[[#This Row],[Confidencialidad ]]<=4),\"Baja\",IF(AND(Tabla2[[#This Row],[Disponibilidad]]+Tabla2[[#This Row],[Integridad]]+Tabla2[[#This Row],[Confidencialidad ]]>=5,Tabla2[[#This Row],[Disponibilidad]]+Tabla2[[#This Row],[Integridad]]+Tabla2[[#This Row],[Confidencialidad ]]<=7),\"Media\",IF(Tabla2[[#This Row],[Disponibilidad]]+Tabla2[[#This Row],[Integridad]]+Tabla2[[#This Row],[Confidencialidad ]]>=8,\"Alta\",\"error\")))","v":"Baja"}]
["",null,null,null,null,null,null,null,null,null,null,null,null,null,null,null,null,null,null,null,null,null,null,null,null,{"$f":"IF((Tabla2[[#This Row],[Disponibilidad]]+Tabla2[[#This Row],[Integridad]]+Tabla2[[#This Row],[Confidencialidad ]]<=4),\"Baja\",IF(AND(Tabla2[[#This Row],[Disponibilidad]]+Tabla2[[#This Row],[Integridad]]+Tabla2[[#This Row],[Confidencialidad ]]>=5,Tabla2[[#This Row],[Disponibilidad]]+Tabla2[[#This Row],[Integridad]]+Tabla2[[#This Row],[Confidencialidad ]]<=7),\"Media\",IF(Tabla2[[#This Row],[Disponibilidad]]+Tabla2[[#This Row],[Integridad]]+Tabla2[[#This Row],[Confidencialidad ]]>=8,\"Alta\",\"error\")))","v":"Baja"}]
["",null,null,null,null,null,null,null,null,null,null,null,null,null,null,null,null,null,null,null,null,null,null,null,null,{"$f":"IF((Tabla2[[#This Row],[Disponibilidad]]+Tabla2[[#This Row],[Integridad]]+Tabla2[[#This Row],[Confidencialidad ]]<=4),\"Baja\",IF(AND(Tabla2[[#This Row],[Disponibilidad]]+Tabla2[[#This Row],[Integridad]]+Tabla2[[#This Row],[Confidencialidad ]]>=5,Tabla2[[#This Row],[Disponibilidad]]+Tabla2[[#This Row],[Integridad]]+Tabla2[[#This Row],[Confidencialidad ]]<=7),\"Media\",IF(Tabla2[[#This Row],[Disponibilidad]]+Tabla2[[#This Row],[Integridad]]+Tabla2[[#This Row],[Confidencialidad ]]>=8,\"Alta\",\"error\")))","v":"Baja"}]
["",null,null,null,null,null,null,null,null,null,null,null,null,null,null,null,null,null,null,null,null,null,null,null,null,{"$f":"IF((Tabla2[[#This Row],[Disponibilidad]]+Tabla2[[#This Row],[Integridad]]+Tabla2[[#This Row],[Confidencialidad ]]<=4),\"Baja\",IF(AND(Tabla2[[#This Row],[Disponibilidad]]+Tabla2[[#This Row],[Integridad]]+Tabla2[[#This Row],[Confidencialidad ]]>=5,Tabla2[[#This Row],[Disponibilidad]]+Tabla2[[#This Row],[Integridad]]+Tabla2[[#This Row],[Confidencialidad ]]<=7),\"Media\",IF(Tabla2[[#This Row],[Disponibilidad]]+Tabla2[[#This Row],[Integridad]]+Tabla2[[#This Row],[Confidencialidad ]]>=8,\"Alta\",\"error\")))","v":"Baja"}]
["",null,null,null,null,null,null,null,null,null,null,null,null,null,null,null,null,null,null,null,null,null,null,null,null,{"$f":"IF((Tabla2[[#This Row],[Disponibilidad]]+Tabla2[[#This Row],[Integridad]]+Tabla2[[#This Row],[Confidencialidad ]]<=4),\"Baja\",IF(AND(Tabla2[[#This Row],[Disponibilidad]]+Tabla2[[#This Row],[Integridad]]+Tabla2[[#This Row],[Confidencialidad ]]>=5,Tabla2[[#This Row],[Disponibilidad]]+Tabla2[[#This Row],[Integridad]]+Tabla2[[#This Row],[Confidencialidad ]]<=7),\"Media\",IF(Tabla2[[#This Row],[Disponibilidad]]+Tabla2[[#This Row],[Integridad]]+Tabla2[[#This Row],[Confidencialidad ]]>=8,\"Alta\",\"error\")))","v":"Baja"}]
[{"$f":"IF(C871<>\"\",1,\"\")","v":""},null,null,null,null,null,null,null,null,null,null,null,null,null,null,null,null,null,null,null,null,null,null,null,null,{"$f":"IF((Tabla2[[#This Row],[Disponibilidad]]+Tabla2[[#This Row],[Integridad]]+Tabla2[[#This Row],[Confidencialidad ]]<=4),\"Baja\",IF(AND(Tabla2[[#This Row],[Disponibilidad]]+Tabla2[[#This Row],[Integridad]]+Tabla2[[#This Row],[Confidencialidad ]]>=5,Tabla2[[#This Row],[Disponibilidad]]+Tabla2[[#This Row],[Integridad]]+Tabla2[[#This Row],[Confidencialidad ]]<=7),\"Media\",IF(Tabla2[[#This Row],[Disponibilidad]]+Tabla2[[#This Row],[Integridad]]+Tabla2[[#This Row],[Confidencialidad ]]>=8,\"Alta\",\"error\")))","v":"Baja"}]
["",null,null,null,null,null,null,null,null,null,null,null,null,null,null,null,null,null,null,null,null,null,null,null,null,{"$f":"IF((Tabla2[[#This Row],[Disponibilidad]]+Tabla2[[#This Row],[Integridad]]+Tabla2[[#This Row],[Confidencialidad ]]<=4),\"Baja\",IF(AND(Tabla2[[#This Row],[Disponibilidad]]+Tabla2[[#This Row],[Integridad]]+Tabla2[[#This Row],[Confidencialidad ]]>=5,Tabla2[[#This Row],[Disponibilidad]]+Tabla2[[#This Row],[Integridad]]+Tabla2[[#This Row],[Confidencialidad ]]<=7),\"Media\",IF(Tabla2[[#This Row],[Disponibilidad]]+Tabla2[[#This Row],[Integridad]]+Tabla2[[#This Row],[Confidencialidad ]]>=8,\"Alta\",\"error\")))","v":"Baja"}]
["",null,null,null,null,null,null,null,null,null,null,null,null,null,null,null,null,null,null,null,null,null,null,null,null,{"$f":"IF((Tabla2[[#This Row],[Disponibilidad]]+Tabla2[[#This Row],[Integridad]]+Tabla2[[#This Row],[Confidencialidad ]]<=4),\"Baja\",IF(AND(Tabla2[[#This Row],[Disponibilidad]]+Tabla2[[#This Row],[Integridad]]+Tabla2[[#This Row],[Confidencialidad ]]>=5,Tabla2[[#This Row],[Disponibilidad]]+Tabla2[[#This Row],[Integridad]]+Tabla2[[#This Row],[Confidencialidad ]]<=7),\"Media\",IF(Tabla2[[#This Row],[Disponibilidad]]+Tabla2[[#This Row],[Integridad]]+Tabla2[[#This Row],[Confidencialidad ]]>=8,\"Alta\",\"error\")))","v":"Baja"}]
["",null,null,null,null,null,null,null,null,null,null,null,null,null,null,null,null,null,null,null,null,null,null,null,null,{"$f":"IF((Tabla2[[#This Row],[Disponibilidad]]+Tabla2[[#This Row],[Integridad]]+Tabla2[[#This Row],[Confidencialidad ]]<=4),\"Baja\",IF(AND(Tabla2[[#This Row],[Disponibilidad]]+Tabla2[[#This Row],[Integridad]]+Tabla2[[#This Row],[Confidencialidad ]]>=5,Tabla2[[#This Row],[Disponibilidad]]+Tabla2[[#This Row],[Integridad]]+Tabla2[[#This Row],[Confidencialidad ]]<=7),\"Media\",IF(Tabla2[[#This Row],[Disponibilidad]]+Tabla2[[#This Row],[Integridad]]+Tabla2[[#This Row],[Confidencialidad ]]>=8,\"Alta\",\"error\")))","v":"Baja"}]
["",null,null,null,null,null,null,null,null,null,null,null,null,null,null,null,null,null,null,null,null,null,null,null,null,{"$f":"IF((Tabla2[[#This Row],[Disponibilidad]]+Tabla2[[#This Row],[Integridad]]+Tabla2[[#This Row],[Confidencialidad ]]<=4),\"Baja\",IF(AND(Tabla2[[#This Row],[Disponibilidad]]+Tabla2[[#This Row],[Integridad]]+Tabla2[[#This Row],[Confidencialidad ]]>=5,Tabla2[[#This Row],[Disponibilidad]]+Tabla2[[#This Row],[Integridad]]+Tabla2[[#This Row],[Confidencialidad ]]<=7),\"Media\",IF(Tabla2[[#This Row],[Disponibilidad]]+Tabla2[[#This Row],[Integridad]]+Tabla2[[#This Row],[Confidencialidad ]]>=8,\"Alta\",\"error\")))","v":"Baja"}]
["",null,null,null,null,null,null,null,null,null,null,null,null,null,null,null,null,null,null,null,null,null,null,null,null,{"$f":"IF((Tabla2[[#This Row],[Disponibilidad]]+Tabla2[[#This Row],[Integridad]]+Tabla2[[#This Row],[Confidencialidad ]]<=4),\"Baja\",IF(AND(Tabla2[[#This Row],[Disponibilidad]]+Tabla2[[#This Row],[Integridad]]+Tabla2[[#This Row],[Confidencialidad ]]>=5,Tabla2[[#This Row],[Disponibilidad]]+Tabla2[[#This Row],[Integridad]]+Tabla2[[#This Row],[Confidencialidad ]]<=7),\"Media\",IF(Tabla2[[#This Row],[Disponibilidad]]+Tabla2[[#This Row],[Integridad]]+Tabla2[[#This Row],[Confidencialidad ]]>=8,\"Alta\",\"error\")))","v":"Baja"}]
["",null,null,null,null,null,null,null,null,null,null,null,null,null,null,null,null,null,null,null,null,null,null,null,null,{"$f":"IF((Tabla2[[#This Row],[Disponibilidad]]+Tabla2[[#This Row],[Integridad]]+Tabla2[[#This Row],[Confidencialidad ]]<=4),\"Baja\",IF(AND(Tabla2[[#This Row],[Disponibilidad]]+Tabla2[[#This Row],[Integridad]]+Tabla2[[#This Row],[Confidencialidad ]]>=5,Tabla2[[#This Row],[Disponibilidad]]+Tabla2[[#This Row],[Integridad]]+Tabla2[[#This Row],[Confidencialidad ]]<=7),\"Media\",IF(Tabla2[[#This Row],[Disponibilidad]]+Tabla2[[#This Row],[Integridad]]+Tabla2[[#This Row],[Confidencialidad ]]>=8,\"Alta\",\"error\")))","v":"Baja"}]
["",null,null,null,null,null,null,null,null,null,null,null,null,null,null,null,null,null,null,null,null,null,null,null,null,{"$f":"IF((Tabla2[[#This Row],[Disponibilidad]]+Tabla2[[#This Row],[Integridad]]+Tabla2[[#This Row],[Confidencialidad ]]<=4),\"Baja\",IF(AND(Tabla2[[#This Row],[Disponibilidad]]+Tabla2[[#This Row],[Integridad]]+Tabla2[[#This Row],[Confidencialidad ]]>=5,Tabla2[[#This Row],[Disponibilidad]]+Tabla2[[#This Row],[Integridad]]+Tabla2[[#This Row],[Confidencialidad ]]<=7),\"Media\",IF(Tabla2[[#This Row],[Disponibilidad]]+Tabla2[[#This Row],[Integridad]]+Tabla2[[#This Row],[Confidencialidad ]]>=8,\"Alta\",\"error\")))","v":"Baja"}]
["",null,null,null,null,null,null,null,null,null,null,null,null,null,null,null,null,null,null,null,null,null,null,null,null,{"$f":"IF((Tabla2[[#This Row],[Disponibilidad]]+Tabla2[[#This Row],[Integridad]]+Tabla2[[#This Row],[Confidencialidad ]]<=4),\"Baja\",IF(AND(Tabla2[[#This Row],[Disponibilidad]]+Tabla2[[#This Row],[Integridad]]+Tabla2[[#This Row],[Confidencialidad ]]>=5,Tabla2[[#This Row],[Disponibilidad]]+Tabla2[[#This Row],[Integridad]]+Tabla2[[#This Row],[Confidencialidad ]]<=7),\"Media\",IF(Tabla2[[#This Row],[Disponibilidad]]+Tabla2[[#This Row],[Integridad]]+Tabla2[[#This Row],[Confidencialidad ]]>=8,\"Alta\",\"error\")))","v":"Baja"}]
["",null,null,null,null,null,null,null,null,null,null,null,null,null,null,null,null,null,null,null,null,null,null,null,null,{"$f":"IF((Tabla2[[#This Row],[Disponibilidad]]+Tabla2[[#This Row],[Integridad]]+Tabla2[[#This Row],[Confidencialidad ]]<=4),\"Baja\",IF(AND(Tabla2[[#This Row],[Disponibilidad]]+Tabla2[[#This Row],[Integridad]]+Tabla2[[#This Row],[Confidencialidad ]]>=5,Tabla2[[#This Row],[Disponibilidad]]+Tabla2[[#This Row],[Integridad]]+Tabla2[[#This Row],[Confidencialidad ]]<=7),\"Media\",IF(Tabla2[[#This Row],[Disponibilidad]]+Tabla2[[#This Row],[Integridad]]+Tabla2[[#This Row],[Confidencialidad ]]>=8,\"Alta\",\"error\")))","v":"Baja"}]
["",null,null,null,null,null,null,null,null,null,null,null,null,null,null,null,null,null,null,null,null,null,null,null,null,{"$f":"IF((Tabla2[[#This Row],[Disponibilidad]]+Tabla2[[#This Row],[Integridad]]+Tabla2[[#This Row],[Confidencialidad ]]<=4),\"Baja\",IF(AND(Tabla2[[#This Row],[Disponibilidad]]+Tabla2[[#This Row],[Integridad]]+Tabla2[[#This Row],[Confidencialidad ]]>=5,Tabla2[[#This Row],[Disponibilidad]]+Tabla2[[#This Row],[Integridad]]+Tabla2[[#This Row],[Confidencialidad ]]<=7),\"Media\",IF(Tabla2[[#This Row],[Disponibilidad]]+Tabla2[[#This Row],[Integridad]]+Tabla2[[#This Row],[Confidencialidad ]]>=8,\"Alta\",\"error\")))","v":"Baja"}]
["",null,null,null,null,null,null,null,null,null,null,null,null,null,null,null,null,null,null,null,null,null,null,null,null,{"$f":"IF((Tabla2[[#This Row],[Disponibilidad]]+Tabla2[[#This Row],[Integridad]]+Tabla2[[#This Row],[Confidencialidad ]]<=4),\"Baja\",IF(AND(Tabla2[[#This Row],[Disponibilidad]]+Tabla2[[#This Row],[Integridad]]+Tabla2[[#This Row],[Confidencialidad ]]>=5,Tabla2[[#This Row],[Disponibilidad]]+Tabla2[[#This Row],[Integridad]]+Tabla2[[#This Row],[Confidencialidad ]]<=7),\"Media\",IF(Tabla2[[#This Row],[Disponibilidad]]+Tabla2[[#This Row],[Integridad]]+Tabla2[[#This Row],[Confidencialidad ]]>=8,\"Alta\",\"error\")))","v":"Baja"}]
["",null,null,null,null,null,null,null,null,null,null,null,null,null,null,null,null,null,null,null,null,null,null,null,null,{"$f":"IF((Tabla2[[#This Row],[Disponibilidad]]+Tabla2[[#This Row],[Integridad]]+Tabla2[[#This Row],[Confidencialidad ]]<=4),\"Baja\",IF(AND(Tabla2[[#This Row],[Disponibilidad]]+Tabla2[[#This Row],[Integridad]]+Tabla2[[#This Row],[Confidencialidad ]]>=5,Tabla2[[#This Row],[Disponibilidad]]+Tabla2[[#This Row],[Integridad]]+Tabla2[[#This Row],[Confidencialidad ]]<=7),\"Media\",IF(Tabla2[[#This Row],[Disponibilidad]]+Tabla2[[#This Row],[Integridad]]+Tabla2[[#This Row],[Confidencialidad ]]>=8,\"Alta\",\"error\")))","v":"Baja"}]
["",null,null,null,null,null,null,null,null,null,null,null,null,null,null,null,null,null,null,null,null,null,null,null,null,{"$f":"IF((Tabla2[[#This Row],[Disponibilidad]]+Tabla2[[#This Row],[Integridad]]+Tabla2[[#This Row],[Confidencialidad ]]<=4),\"Baja\",IF(AND(Tabla2[[#This Row],[Disponibilidad]]+Tabla2[[#This Row],[Integridad]]+Tabla2[[#This Row],[Confidencialidad ]]>=5,Tabla2[[#This Row],[Disponibilidad]]+Tabla2[[#This Row],[Integridad]]+Tabla2[[#This Row],[Confidencialidad ]]<=7),\"Media\",IF(Tabla2[[#This Row],[Disponibilidad]]+Tabla2[[#This Row],[Integridad]]+Tabla2[[#This Row],[Confidencialidad ]]>=8,\"Alta\",\"error\")))","v":"Baja"}]
["",null,null,null,null,null,null,null,null,null,null,null,null,null,null,null,null,null,null,null,null,null,null,null,null,{"$f":"IF((Tabla2[[#This Row],[Disponibilidad]]+Tabla2[[#This Row],[Integridad]]+Tabla2[[#This Row],[Confidencialidad ]]<=4),\"Baja\",IF(AND(Tabla2[[#This Row],[Disponibilidad]]+Tabla2[[#This Row],[Integridad]]+Tabla2[[#This Row],[Confidencialidad ]]>=5,Tabla2[[#This Row],[Disponibilidad]]+Tabla2[[#This Row],[Integridad]]+Tabla2[[#This Row],[Confidencialidad ]]<=7),\"Media\",IF(Tabla2[[#This Row],[Disponibilidad]]+Tabla2[[#This Row],[Integridad]]+Tabla2[[#This Row],[Confidencialidad ]]>=8,\"Alta\",\"error\")))","v":"Baja"}]
["",null,null,null,null,null,null,null,null,null,null,null,null,null,null,null,null,null,null,null,null,null,null,null,null,{"$f":"IF((Tabla2[[#This Row],[Disponibilidad]]+Tabla2[[#This Row],[Integridad]]+Tabla2[[#This Row],[Confidencialidad ]]<=4),\"Baja\",IF(AND(Tabla2[[#This Row],[Disponibilidad]]+Tabla2[[#This Row],[Integridad]]+Tabla2[[#This Row],[Confidencialidad ]]>=5,Tabla2[[#This Row],[Disponibilidad]]+Tabla2[[#This Row],[Integridad]]+Tabla2[[#This Row],[Confidencialidad ]]<=7),\"Media\",IF(Tabla2[[#This Row],[Disponibilidad]]+Tabla2[[#This Row],[Integridad]]+Tabla2[[#This Row],[Confidencialidad ]]>=8,\"Alta\",\"error\")))","v":"Baja"}]
["",null,null,null,null,null,null,null,null,null,null,null,null,null,null,null,null,null,null,null,null,null,null,null,null,{"$f":"IF((Tabla2[[#This Row],[Disponibilidad]]+Tabla2[[#This Row],[Integridad]]+Tabla2[[#This Row],[Confidencialidad ]]<=4),\"Baja\",IF(AND(Tabla2[[#This Row],[Disponibilidad]]+Tabla2[[#This Row],[Integridad]]+Tabla2[[#This Row],[Confidencialidad ]]>=5,Tabla2[[#This Row],[Disponibilidad]]+Tabla2[[#This Row],[Integridad]]+Tabla2[[#This Row],[Confidencialidad ]]<=7),\"Media\",IF(Tabla2[[#This Row],[Disponibilidad]]+Tabla2[[#This Row],[Integridad]]+Tabla2[[#This Row],[Confidencialidad ]]>=8,\"Alta\",\"error\")))","v":"Baja"}]
["",null,null,null,null,null,null,null,null,null,null,null,null,null,null,null,null,null,null,null,null,null,null,null,null,{"$f":"IF((Tabla2[[#This Row],[Disponibilidad]]+Tabla2[[#This Row],[Integridad]]+Tabla2[[#This Row],[Confidencialidad ]]<=4),\"Baja\",IF(AND(Tabla2[[#This Row],[Disponibilidad]]+Tabla2[[#This Row],[Integridad]]+Tabla2[[#This Row],[Confidencialidad ]]>=5,Tabla2[[#This Row],[Disponibilidad]]+Tabla2[[#This Row],[Integridad]]+Tabla2[[#This Row],[Confidencialidad ]]<=7),\"Media\",IF(Tabla2[[#This Row],[Disponibilidad]]+Tabla2[[#This Row],[Integridad]]+Tabla2[[#This Row],[Confidencialidad ]]>=8,\"Alta\",\"error\")))","v":"Baja"}]
["",null,null,null,null,null,null,null,null,null,null,null,null,null,null,null,null,null,null,null,null,null,null,null,null,{"$f":"IF((Tabla2[[#This Row],[Disponibilidad]]+Tabla2[[#This Row],[Integridad]]+Tabla2[[#This Row],[Confidencialidad ]]<=4),\"Baja\",IF(AND(Tabla2[[#This Row],[Disponibilidad]]+Tabla2[[#This Row],[Integridad]]+Tabla2[[#This Row],[Confidencialidad ]]>=5,Tabla2[[#This Row],[Disponibilidad]]+Tabla2[[#This Row],[Integridad]]+Tabla2[[#This Row],[Confidencialidad ]]<=7),\"Media\",IF(Tabla2[[#This Row],[Disponibilidad]]+Tabla2[[#This Row],[Integridad]]+Tabla2[[#This Row],[Confidencialidad ]]>=8,\"Alta\",\"error\")))","v":"Baja"}]
["",null,null,null,null,null,null,null,null,null,null,null,null,null,null,null,null,null,null,null,null,null,null,null,null,{"$f":"IF((Tabla2[[#This Row],[Disponibilidad]]+Tabla2[[#This Row],[Integridad]]+Tabla2[[#This Row],[Confidencialidad ]]<=4),\"Baja\",IF(AND(Tabla2[[#This Row],[Disponibilidad]]+Tabla2[[#This Row],[Integridad]]+Tabla2[[#This Row],[Confidencialidad ]]>=5,Tabla2[[#This Row],[Disponibilidad]]+Tabla2[[#This Row],[Integridad]]+Tabla2[[#This Row],[Confidencialidad ]]<=7),\"Media\",IF(Tabla2[[#This Row],[Disponibilidad]]+Tabla2[[#This Row],[Integridad]]+Tabla2[[#This Row],[Confidencialidad ]]>=8,\"Alta\",\"error\")))","v":"Baja"}]
["",null,null,null,null,null,null,null,null,null,null,null,null,null,null,null,null,null,null,null,null,null,null,null,null,{"$f":"IF((Tabla2[[#This Row],[Disponibilidad]]+Tabla2[[#This Row],[Integridad]]+Tabla2[[#This Row],[Confidencialidad ]]<=4),\"Baja\",IF(AND(Tabla2[[#This Row],[Disponibilidad]]+Tabla2[[#This Row],[Integridad]]+Tabla2[[#This Row],[Confidencialidad ]]>=5,Tabla2[[#This Row],[Disponibilidad]]+Tabla2[[#This Row],[Integridad]]+Tabla2[[#This Row],[Confidencialidad ]]<=7),\"Media\",IF(Tabla2[[#This Row],[Disponibilidad]]+Tabla2[[#This Row],[Integridad]]+Tabla2[[#This Row],[Confidencialidad ]]>=8,\"Alta\",\"error\")))","v":"Baja"}]
["",null,null,null,null,null,null,null,null,null,null,null,null,null,null,null,null,null,null,null,null,null,null,null,null,{"$f":"IF((Tabla2[[#This Row],[Disponibilidad]]+Tabla2[[#This Row],[Integridad]]+Tabla2[[#This Row],[Confidencialidad ]]<=4),\"Baja\",IF(AND(Tabla2[[#This Row],[Disponibilidad]]+Tabla2[[#This Row],[Integridad]]+Tabla2[[#This Row],[Confidencialidad ]]>=5,Tabla2[[#This Row],[Disponibilidad]]+Tabla2[[#This Row],[Integridad]]+Tabla2[[#This Row],[Confidencialidad ]]<=7),\"Media\",IF(Tabla2[[#This Row],[Disponibilidad]]+Tabla2[[#This Row],[Integridad]]+Tabla2[[#This Row],[Confidencialidad ]]>=8,\"Alta\",\"error\")))","v":"Baja"}]
[{"$f":"IF(C893<>\"\",1,\"\")","v":""},null,null,null,null,null,null,null,null,null,null,null,null,null,null,null,null,null,null,null,null,null,null,null,null,{"$f":"IF((Tabla2[[#This Row],[Disponibilidad]]+Tabla2[[#This Row],[Integridad]]+Tabla2[[#This Row],[Confidencialidad ]]<=4),\"Baja\",IF(AND(Tabla2[[#This Row],[Disponibilidad]]+Tabla2[[#This Row],[Integridad]]+Tabla2[[#This Row],[Confidencialidad ]]>=5,Tabla2[[#This Row],[Disponibilidad]]+Tabla2[[#This Row],[Integridad]]+Tabla2[[#This Row],[Confidencialidad ]]<=7),\"Media\",IF(Tabla2[[#This Row],[Disponibilidad]]+Tabla2[[#This Row],[Integridad]]+Tabla2[[#This Row],[Confidencialidad ]]>=8,\"Alta\",\"error\")))","v":"Baja"}]
["",null,null,null,null,null,null,null,null,null,null,null,null,null,null,null,null,null,null,null,null,null,null,null,null,{"$f":"IF((Tabla2[[#This Row],[Disponibilidad]]+Tabla2[[#This Row],[Integridad]]+Tabla2[[#This Row],[Confidencialidad ]]<=4),\"Baja\",IF(AND(Tabla2[[#This Row],[Disponibilidad]]+Tabla2[[#This Row],[Integridad]]+Tabla2[[#This Row],[Confidencialidad ]]>=5,Tabla2[[#This Row],[Disponibilidad]]+Tabla2[[#This Row],[Integridad]]+Tabla2[[#This Row],[Confidencialidad ]]<=7),\"Media\",IF(Tabla2[[#This Row],[Disponibilidad]]+Tabla2[[#This Row],[Integridad]]+Tabla2[[#This Row],[Confidencialidad ]]>=8,\"Alta\",\"error\")))","v":"Baja"}]
["",null,null,null,null,null,null,null,null,null,null,null,null,null,null,null,null,null,null,null,null,null,null,null,null,{"$f":"IF((Tabla2[[#This Row],[Disponibilidad]]+Tabla2[[#This Row],[Integridad]]+Tabla2[[#This Row],[Confidencialidad ]]<=4),\"Baja\",IF(AND(Tabla2[[#This Row],[Disponibilidad]]+Tabla2[[#This Row],[Integridad]]+Tabla2[[#This Row],[Confidencialidad ]]>=5,Tabla2[[#This Row],[Disponibilidad]]+Tabla2[[#This Row],[Integridad]]+Tabla2[[#This Row],[Confidencialidad ]]<=7),\"Media\",IF(Tabla2[[#This Row],[Disponibilidad]]+Tabla2[[#This Row],[Integridad]]+Tabla2[[#This Row],[Confidencialidad ]]>=8,\"Alta\",\"error\")))","v":"Baja"}]
["",null,null,null,null,null,null,null,null,null,null,null,null,null,null,null,null,null,null,null,null,null,null,null,null,{"$f":"IF((Tabla2[[#This Row],[Disponibilidad]]+Tabla2[[#This Row],[Integridad]]+Tabla2[[#This Row],[Confidencialidad ]]<=4),\"Baja\",IF(AND(Tabla2[[#This Row],[Disponibilidad]]+Tabla2[[#This Row],[Integridad]]+Tabla2[[#This Row],[Confidencialidad ]]>=5,Tabla2[[#This Row],[Disponibilidad]]+Tabla2[[#This Row],[Integridad]]+Tabla2[[#This Row],[Confidencialidad ]]<=7),\"Media\",IF(Tabla2[[#This Row],[Disponibilidad]]+Tabla2[[#This Row],[Integridad]]+Tabla2[[#This Row],[Confidencialidad ]]>=8,\"Alta\",\"error\")))","v":"Baja"}]
["",null,null,null,null,null,null,null,null,null,null,null,null,null,null,null,null,null,null,null,null,null,null,null,null,{"$f":"IF((Tabla2[[#This Row],[Disponibilidad]]+Tabla2[[#This Row],[Integridad]]+Tabla2[[#This Row],[Confidencialidad ]]<=4),\"Baja\",IF(AND(Tabla2[[#This Row],[Disponibilidad]]+Tabla2[[#This Row],[Integridad]]+Tabla2[[#This Row],[Confidencialidad ]]>=5,Tabla2[[#This Row],[Disponibilidad]]+Tabla2[[#This Row],[Integridad]]+Tabla2[[#This Row],[Confidencialidad ]]<=7),\"Media\",IF(Tabla2[[#This Row],[Disponibilidad]]+Tabla2[[#This Row],[Integridad]]+Tabla2[[#This Row],[Confidencialidad ]]>=8,\"Alta\",\"error\")))","v":"Baja"}]
["",null,null,null,null,null,null,null,null,null,null,null,null,null,null,null,null,null,null,null,null,null,null,null,null,{"$f":"IF((Tabla2[[#This Row],[Disponibilidad]]+Tabla2[[#This Row],[Integridad]]+Tabla2[[#This Row],[Confidencialidad ]]<=4),\"Baja\",IF(AND(Tabla2[[#This Row],[Disponibilidad]]+Tabla2[[#This Row],[Integridad]]+Tabla2[[#This Row],[Confidencialidad ]]>=5,Tabla2[[#This Row],[Disponibilidad]]+Tabla2[[#This Row],[Integridad]]+Tabla2[[#This Row],[Confidencialidad ]]<=7),\"Media\",IF(Tabla2[[#This Row],[Disponibilidad]]+Tabla2[[#This Row],[Integridad]]+Tabla2[[#This Row],[Confidencialidad ]]>=8,\"Alta\",\"error\")))","v":"Baja"}]
["",null,null,null,null,null,null,null,null,null,null,null,null,null,null,null,null,null,null,null,null,null,null,null,null,{"$f":"IF((Tabla2[[#This Row],[Disponibilidad]]+Tabla2[[#This Row],[Integridad]]+Tabla2[[#This Row],[Confidencialidad ]]<=4),\"Baja\",IF(AND(Tabla2[[#This Row],[Disponibilidad]]+Tabla2[[#This Row],[Integridad]]+Tabla2[[#This Row],[Confidencialidad ]]>=5,Tabla2[[#This Row],[Disponibilidad]]+Tabla2[[#This Row],[Integridad]]+Tabla2[[#This Row],[Confidencialidad ]]<=7),\"Media\",IF(Tabla2[[#This Row],[Disponibilidad]]+Tabla2[[#This Row],[Integridad]]+Tabla2[[#This Row],[Confidencialidad ]]>=8,\"Alta\",\"error\")))","v":"Baja"}]
["",null,null,null,null,null,null,null,null,null,null,null,null,null,null,null,null,null,null,null,null,null,null,null,null,{"$f":"IF((Tabla2[[#This Row],[Disponibilidad]]+Tabla2[[#This Row],[Integridad]]+Tabla2[[#This Row],[Confidencialidad ]]<=4),\"Baja\",IF(AND(Tabla2[[#This Row],[Disponibilidad]]+Tabla2[[#This Row],[Integridad]]+Tabla2[[#This Row],[Confidencialidad ]]>=5,Tabla2[[#This Row],[Disponibilidad]]+Tabla2[[#This Row],[Integridad]]+Tabla2[[#This Row],[Confidencialidad ]]<=7),\"Media\",IF(Tabla2[[#This Row],[Disponibilidad]]+Tabla2[[#This Row],[Integridad]]+Tabla2[[#This Row],[Confidencialidad ]]>=8,\"Alta\",\"error\")))","v":"Baja"}]
["",null,null,null,null,null,null,null,null,null,null,null,null,null,null,null,null,null,null,null,null,null,null,null,null,{"$f":"IF((Tabla2[[#This Row],[Disponibilidad]]+Tabla2[[#This Row],[Integridad]]+Tabla2[[#This Row],[Confidencialidad ]]<=4),\"Baja\",IF(AND(Tabla2[[#This Row],[Disponibilidad]]+Tabla2[[#This Row],[Integridad]]+Tabla2[[#This Row],[Confidencialidad ]]>=5,Tabla2[[#This Row],[Disponibilidad]]+Tabla2[[#This Row],[Integridad]]+Tabla2[[#This Row],[Confidencialidad ]]<=7),\"Media\",IF(Tabla2[[#This Row],[Disponibilidad]]+Tabla2[[#This Row],[Integridad]]+Tabla2[[#This Row],[Confidencialidad ]]>=8,\"Alta\",\"error\")))","v":"Baja"}]
["",null,null,null,null,null,null,null,null,null,null,null,null,null,null,null,null,null,null,null,null,null,null,null,null,{"$f":"IF((Tabla2[[#This Row],[Disponibilidad]]+Tabla2[[#This Row],[Integridad]]+Tabla2[[#This Row],[Confidencialidad ]]<=4),\"Baja\",IF(AND(Tabla2[[#This Row],[Disponibilidad]]+Tabla2[[#This Row],[Integridad]]+Tabla2[[#This Row],[Confidencialidad ]]>=5,Tabla2[[#This Row],[Disponibilidad]]+Tabla2[[#This Row],[Integridad]]+Tabla2[[#This Row],[Confidencialidad ]]<=7),\"Media\",IF(Tabla2[[#This Row],[Disponibilidad]]+Tabla2[[#This Row],[Integridad]]+Tabla2[[#This Row],[Confidencialidad ]]>=8,\"Alta\",\"error\")))","v":"Baja"}]
["",null,null,null,null,null,null,null,null,null,null,null,null,null,null,null,null,null,null,null,null,null,null,null,null,{"$f":"IF((Tabla2[[#This Row],[Disponibilidad]]+Tabla2[[#This Row],[Integridad]]+Tabla2[[#This Row],[Confidencialidad ]]<=4),\"Baja\",IF(AND(Tabla2[[#This Row],[Disponibilidad]]+Tabla2[[#This Row],[Integridad]]+Tabla2[[#This Row],[Confidencialidad ]]>=5,Tabla2[[#This Row],[Disponibilidad]]+Tabla2[[#This Row],[Integridad]]+Tabla2[[#This Row],[Confidencialidad ]]<=7),\"Media\",IF(Tabla2[[#This Row],[Disponibilidad]]+Tabla2[[#This Row],[Integridad]]+Tabla2[[#This Row],[Confidencialidad ]]>=8,\"Alta\",\"error\")))","v":"Baja"}]
["",null,null,null,null,null,null,null,null,null,null,null,null,null,null,null,null,null,null,null,null,null,null,null,null,{"$f":"IF((Tabla2[[#This Row],[Disponibilidad]]+Tabla2[[#This Row],[Integridad]]+Tabla2[[#This Row],[Confidencialidad ]]<=4),\"Baja\",IF(AND(Tabla2[[#This Row],[Disponibilidad]]+Tabla2[[#This Row],[Integridad]]+Tabla2[[#This Row],[Confidencialidad ]]>=5,Tabla2[[#This Row],[Disponibilidad]]+Tabla2[[#This Row],[Integridad]]+Tabla2[[#This Row],[Confidencialidad ]]<=7),\"Media\",IF(Tabla2[[#This Row],[Disponibilidad]]+Tabla2[[#This Row],[Integridad]]+Tabla2[[#This Row],[Confidencialidad ]]>=8,\"Alta\",\"error\")))","v":"Baja"}]
["",null,null,null,null,null,null,null,null,null,null,null,null,null,null,null,null,null,null,null,null,null,null,null,null,{"$f":"IF((Tabla2[[#This Row],[Disponibilidad]]+Tabla2[[#This Row],[Integridad]]+Tabla2[[#This Row],[Confidencialidad ]]<=4),\"Baja\",IF(AND(Tabla2[[#This Row],[Disponibilidad]]+Tabla2[[#This Row],[Integridad]]+Tabla2[[#This Row],[Confidencialidad ]]>=5,Tabla2[[#This Row],[Disponibilidad]]+Tabla2[[#This Row],[Integridad]]+Tabla2[[#This Row],[Confidencialidad ]]<=7),\"Media\",IF(Tabla2[[#This Row],[Disponibilidad]]+Tabla2[[#This Row],[Integridad]]+Tabla2[[#This Row],[Confidencialidad ]]>=8,\"Alta\",\"error\")))","v":"Baja"}]
["",null,null,null,null,null,null,null,null,null,null,null,null,null,null,null,null,null,null,null,null,null,null,null,null,{"$f":"IF((Tabla2[[#This Row],[Disponibilidad]]+Tabla2[[#This Row],[Integridad]]+Tabla2[[#This Row],[Confidencialidad ]]<=4),\"Baja\",IF(AND(Tabla2[[#This Row],[Disponibilidad]]+Tabla2[[#This Row],[Integridad]]+Tabla2[[#This Row],[Confidencialidad ]]>=5,Tabla2[[#This Row],[Disponibilidad]]+Tabla2[[#This Row],[Integridad]]+Tabla2[[#This Row],[Confidencialidad ]]<=7),\"Media\",IF(Tabla2[[#This Row],[Disponibilidad]]+Tabla2[[#This Row],[Integridad]]+Tabla2[[#This Row],[Confidencialidad ]]>=8,\"Alta\",\"error\")))","v":"Baja"}]
["",null,null,null,null,null,null,null,null,null,null,null,null,null,null,null,null,null,null,null,null,null,null,null,null,{"$f":"IF((Tabla2[[#This Row],[Disponibilidad]]+Tabla2[[#This Row],[Integridad]]+Tabla2[[#This Row],[Confidencialidad ]]<=4),\"Baja\",IF(AND(Tabla2[[#This Row],[Disponibilidad]]+Tabla2[[#This Row],[Integridad]]+Tabla2[[#This Row],[Confidencialidad ]]>=5,Tabla2[[#This Row],[Disponibilidad]]+Tabla2[[#This Row],[Integridad]]+Tabla2[[#This Row],[Confidencialidad ]]<=7),\"Media\",IF(Tabla2[[#This Row],[Disponibilidad]]+Tabla2[[#This Row],[Integridad]]+Tabla2[[#This Row],[Confidencialidad ]]>=8,\"Alta\",\"error\")))","v":"Baja"}]
["",null,null,null,null,null,null,null,null,null,null,null,null,null,null,null,null,null,null,null,null,null,null,null,null,{"$f":"IF((Tabla2[[#This Row],[Disponibilidad]]+Tabla2[[#This Row],[Integridad]]+Tabla2[[#This Row],[Confidencialidad ]]<=4),\"Baja\",IF(AND(Tabla2[[#This Row],[Disponibilidad]]+Tabla2[[#This Row],[Integridad]]+Tabla2[[#This Row],[Confidencialidad ]]>=5,Tabla2[[#This Row],[Disponibilidad]]+Tabla2[[#This Row],[Integridad]]+Tabla2[[#This Row],[Confidencialidad ]]<=7),\"Media\",IF(Tabla2[[#This Row],[Disponibilidad]]+Tabla2[[#This Row],[Integridad]]+Tabla2[[#This Row],[Confidencialidad ]]>=8,\"Alta\",\"error\")))","v":"Baja"}]
["",null,null,null,null,null,null,null,null,null,null,null,null,null,null,null,null,null,null,null,null,null,null,null,null,{"$f":"IF((Tabla2[[#This Row],[Disponibilidad]]+Tabla2[[#This Row],[Integridad]]+Tabla2[[#This Row],[Confidencialidad ]]<=4),\"Baja\",IF(AND(Tabla2[[#This Row],[Disponibilidad]]+Tabla2[[#This Row],[Integridad]]+Tabla2[[#This Row],[Confidencialidad ]]>=5,Tabla2[[#This Row],[Disponibilidad]]+Tabla2[[#This Row],[Integridad]]+Tabla2[[#This Row],[Confidencialidad ]]<=7),\"Media\",IF(Tabla2[[#This Row],[Disponibilidad]]+Tabla2[[#This Row],[Integridad]]+Tabla2[[#This Row],[Confidencialidad ]]>=8,\"Alta\",\"error\")))","v":"Baja"}]
["",null,null,null,null,null,null,null,null,null,null,null,null,null,null,null,null,null,null,null,null,null,null,null,null,{"$f":"IF((Tabla2[[#This Row],[Disponibilidad]]+Tabla2[[#This Row],[Integridad]]+Tabla2[[#This Row],[Confidencialidad ]]<=4),\"Baja\",IF(AND(Tabla2[[#This Row],[Disponibilidad]]+Tabla2[[#This Row],[Integridad]]+Tabla2[[#This Row],[Confidencialidad ]]>=5,Tabla2[[#This Row],[Disponibilidad]]+Tabla2[[#This Row],[Integridad]]+Tabla2[[#This Row],[Confidencialidad ]]<=7),\"Media\",IF(Tabla2[[#This Row],[Disponibilidad]]+Tabla2[[#This Row],[Integridad]]+Tabla2[[#This Row],[Confidencialidad ]]>=8,\"Alta\",\"error\")))","v":"Baja"}]
["",null,null,null,null,null,null,null,null,null,null,null,null,null,null,null,null,null,null,null,null,null,null,null,null,{"$f":"IF((Tabla2[[#This Row],[Disponibilidad]]+Tabla2[[#This Row],[Integridad]]+Tabla2[[#This Row],[Confidencialidad ]]<=4),\"Baja\",IF(AND(Tabla2[[#This Row],[Disponibilidad]]+Tabla2[[#This Row],[Integridad]]+Tabla2[[#This Row],[Confidencialidad ]]>=5,Tabla2[[#This Row],[Disponibilidad]]+Tabla2[[#This Row],[Integridad]]+Tabla2[[#This Row],[Confidencialidad ]]<=7),\"Media\",IF(Tabla2[[#This Row],[Disponibilidad]]+Tabla2[[#This Row],[Integridad]]+Tabla2[[#This Row],[Confidencialidad ]]>=8,\"Alta\",\"error\")))","v":"Baja"}]
["",null,null,null,null,null,null,null,null,null,null,null,null,null,null,null,null,null,null,null,null,null,null,null,null,{"$f":"IF((Tabla2[[#This Row],[Disponibilidad]]+Tabla2[[#This Row],[Integridad]]+Tabla2[[#This Row],[Confidencialidad ]]<=4),\"Baja\",IF(AND(Tabla2[[#This Row],[Disponibilidad]]+Tabla2[[#This Row],[Integridad]]+Tabla2[[#This Row],[Confidencialidad ]]>=5,Tabla2[[#This Row],[Disponibilidad]]+Tabla2[[#This Row],[Integridad]]+Tabla2[[#This Row],[Confidencialidad ]]<=7),\"Media\",IF(Tabla2[[#This Row],[Disponibilidad]]+Tabla2[[#This Row],[Integridad]]+Tabla2[[#This Row],[Confidencialidad ]]>=8,\"Alta\",\"error\")))","v":"Baja"}]
["",null,null,null,null,null,null,null,null,null,null,null,null,null,null,null,null,null,null,null,null,null,null,null,null,{"$f":"IF((Tabla2[[#This Row],[Disponibilidad]]+Tabla2[[#This Row],[Integridad]]+Tabla2[[#This Row],[Confidencialidad ]]<=4),\"Baja\",IF(AND(Tabla2[[#This Row],[Disponibilidad]]+Tabla2[[#This Row],[Integridad]]+Tabla2[[#This Row],[Confidencialidad ]]>=5,Tabla2[[#This Row],[Disponibilidad]]+Tabla2[[#This Row],[Integridad]]+Tabla2[[#This Row],[Confidencialidad ]]<=7),\"Media\",IF(Tabla2[[#This Row],[Disponibilidad]]+Tabla2[[#This Row],[Integridad]]+Tabla2[[#This Row],[Confidencialidad ]]>=8,\"Alta\",\"error\")))","v":"Baja"}]
["",null,null,null,null,null,null,null,null,null,null,null,null,null,null,null,null,null,null,null,null,null,null,null,null,{"$f":"IF((Tabla2[[#This Row],[Disponibilidad]]+Tabla2[[#This Row],[Integridad]]+Tabla2[[#This Row],[Confidencialidad ]]<=4),\"Baja\",IF(AND(Tabla2[[#This Row],[Disponibilidad]]+Tabla2[[#This Row],[Integridad]]+Tabla2[[#This Row],[Confidencialidad ]]>=5,Tabla2[[#This Row],[Disponibilidad]]+Tabla2[[#This Row],[Integridad]]+Tabla2[[#This Row],[Confidencialidad ]]<=7),\"Media\",IF(Tabla2[[#This Row],[Disponibilidad]]+Tabla2[[#This Row],[Integridad]]+Tabla2[[#This Row],[Confidencialidad ]]>=8,\"Alta\",\"error\")))","v":"Baja"}]
[{"$f":"IF(C915<>\"\",1,\"\")","v":""},null,null,null,null,null,null,null,null,null,null,null,null,null,null,null,null,null,null,null,null,null,null,null,null,{"$f":"IF((Tabla2[[#This Row],[Disponibilidad]]+Tabla2[[#This Row],[Integridad]]+Tabla2[[#This Row],[Confidencialidad ]]<=4),\"Baja\",IF(AND(Tabla2[[#This Row],[Disponibilidad]]+Tabla2[[#This Row],[Integridad]]+Tabla2[[#This Row],[Confidencialidad ]]>=5,Tabla2[[#This Row],[Disponibilidad]]+Tabla2[[#This Row],[Integridad]]+Tabla2[[#This Row],[Confidencialidad ]]<=7),\"Media\",IF(Tabla2[[#This Row],[Disponibilidad]]+Tabla2[[#This Row],[Integridad]]+Tabla2[[#This Row],[Confidencialidad ]]>=8,\"Alta\",\"error\")))","v":"Baja"}]
["",null,null,null,null,null,null,null,null,null,null,null,null,null,null,null,null,null,null,null,null,null,null,null,null,{"$f":"IF((Tabla2[[#This Row],[Disponibilidad]]+Tabla2[[#This Row],[Integridad]]+Tabla2[[#This Row],[Confidencialidad ]]<=4),\"Baja\",IF(AND(Tabla2[[#This Row],[Disponibilidad]]+Tabla2[[#This Row],[Integridad]]+Tabla2[[#This Row],[Confidencialidad ]]>=5,Tabla2[[#This Row],[Disponibilidad]]+Tabla2[[#This Row],[Integridad]]+Tabla2[[#This Row],[Confidencialidad ]]<=7),\"Media\",IF(Tabla2[[#This Row],[Disponibilidad]]+Tabla2[[#This Row],[Integridad]]+Tabla2[[#This Row],[Confidencialidad ]]>=8,\"Alta\",\"error\")))","v":"Baja"}]
["",null,null,null,null,null,null,null,null,null,null,null,null,null,null,null,null,null,null,null,null,null,null,null,null,{"$f":"IF((Tabla2[[#This Row],[Disponibilidad]]+Tabla2[[#This Row],[Integridad]]+Tabla2[[#This Row],[Confidencialidad ]]<=4),\"Baja\",IF(AND(Tabla2[[#This Row],[Disponibilidad]]+Tabla2[[#This Row],[Integridad]]+Tabla2[[#This Row],[Confidencialidad ]]>=5,Tabla2[[#This Row],[Disponibilidad]]+Tabla2[[#This Row],[Integridad]]+Tabla2[[#This Row],[Confidencialidad ]]<=7),\"Media\",IF(Tabla2[[#This Row],[Disponibilidad]]+Tabla2[[#This Row],[Integridad]]+Tabla2[[#This Row],[Confidencialidad ]]>=8,\"Alta\",\"error\")))","v":"Baja"}]
["",null,null,null,null,null,null,null,null,null,null,null,null,null,null,null,null,null,null,null,null,null,null,null,null,{"$f":"IF((Tabla2[[#This Row],[Disponibilidad]]+Tabla2[[#This Row],[Integridad]]+Tabla2[[#This Row],[Confidencialidad ]]<=4),\"Baja\",IF(AND(Tabla2[[#This Row],[Disponibilidad]]+Tabla2[[#This Row],[Integridad]]+Tabla2[[#This Row],[Confidencialidad ]]>=5,Tabla2[[#This Row],[Disponibilidad]]+Tabla2[[#This Row],[Integridad]]+Tabla2[[#This Row],[Confidencialidad ]]<=7),\"Media\",IF(Tabla2[[#This Row],[Disponibilidad]]+Tabla2[[#This Row],[Integridad]]+Tabla2[[#This Row],[Confidencialidad ]]>=8,\"Alta\",\"error\")))","v":"Baja"}]
["",null,null,null,null,null,null,null,null,null,null,null,null,null,null,null,null,null,null,null,null,null,null,null,null,{"$f":"IF((Tabla2[[#This Row],[Disponibilidad]]+Tabla2[[#This Row],[Integridad]]+Tabla2[[#This Row],[Confidencialidad ]]<=4),\"Baja\",IF(AND(Tabla2[[#This Row],[Disponibilidad]]+Tabla2[[#This Row],[Integridad]]+Tabla2[[#This Row],[Confidencialidad ]]>=5,Tabla2[[#This Row],[Disponibilidad]]+Tabla2[[#This Row],[Integridad]]+Tabla2[[#This Row],[Confidencialidad ]]<=7),\"Media\",IF(Tabla2[[#This Row],[Disponibilidad]]+Tabla2[[#This Row],[Integridad]]+Tabla2[[#This Row],[Confidencialidad ]]>=8,\"Alta\",\"error\")))","v":"Baja"}]
["",null,null,null,null,null,null,null,null,null,null,null,null,null,null,null,null,null,null,null,null,null,null,null,null,{"$f":"IF((Tabla2[[#This Row],[Disponibilidad]]+Tabla2[[#This Row],[Integridad]]+Tabla2[[#This Row],[Confidencialidad ]]<=4),\"Baja\",IF(AND(Tabla2[[#This Row],[Disponibilidad]]+Tabla2[[#This Row],[Integridad]]+Tabla2[[#This Row],[Confidencialidad ]]>=5,Tabla2[[#This Row],[Disponibilidad]]+Tabla2[[#This Row],[Integridad]]+Tabla2[[#This Row],[Confidencialidad ]]<=7),\"Media\",IF(Tabla2[[#This Row],[Disponibilidad]]+Tabla2[[#This Row],[Integridad]]+Tabla2[[#This Row],[Confidencialidad ]]>=8,\"Alta\",\"error\")))","v":"Baja"}]
["",null,null,null,null,null,null,null,null,null,null,null,null,null,null,null,null,null,null,null,null,null,null,null,null,{"$f":"IF((Tabla2[[#This Row],[Disponibilidad]]+Tabla2[[#This Row],[Integridad]]+Tabla2[[#This Row],[Confidencialidad ]]<=4),\"Baja\",IF(AND(Tabla2[[#This Row],[Disponibilidad]]+Tabla2[[#This Row],[Integridad]]+Tabla2[[#This Row],[Confidencialidad ]]>=5,Tabla2[[#This Row],[Disponibilidad]]+Tabla2[[#This Row],[Integridad]]+Tabla2[[#This Row],[Confidencialidad ]]<=7),\"Media\",IF(Tabla2[[#This Row],[Disponibilidad]]+Tabla2[[#This Row],[Integridad]]+Tabla2[[#This Row],[Confidencialidad ]]>=8,\"Alta\",\"error\")))","v":"Baja"}]
["",null,null,null,null,null,null,null,null,null,null,null,null,null,null,null,null,null,null,null,null,null,null,null,null,{"$f":"IF((Tabla2[[#This Row],[Disponibilidad]]+Tabla2[[#This Row],[Integridad]]+Tabla2[[#This Row],[Confidencialidad ]]<=4),\"Baja\",IF(AND(Tabla2[[#This Row],[Disponibilidad]]+Tabla2[[#This Row],[Integridad]]+Tabla2[[#This Row],[Confidencialidad ]]>=5,Tabla2[[#This Row],[Disponibilidad]]+Tabla2[[#This Row],[Integridad]]+Tabla2[[#This Row],[Confidencialidad ]]<=7),\"Media\",IF(Tabla2[[#This Row],[Disponibilidad]]+Tabla2[[#This Row],[Integridad]]+Tabla2[[#This Row],[Confidencialidad ]]>=8,\"Alta\",\"error\")))","v":"Baja"}]
["",null,null,null,null,null,null,null,null,null,null,null,null,null,null,null,null,null,null,null,null,null,null,null,null,{"$f":"IF((Tabla2[[#This Row],[Disponibilidad]]+Tabla2[[#This Row],[Integridad]]+Tabla2[[#This Row],[Confidencialidad ]]<=4),\"Baja\",IF(AND(Tabla2[[#This Row],[Disponibilidad]]+Tabla2[[#This Row],[Integridad]]+Tabla2[[#This Row],[Confidencialidad ]]>=5,Tabla2[[#This Row],[Disponibilidad]]+Tabla2[[#This Row],[Integridad]]+Tabla2[[#This Row],[Confidencialidad ]]<=7),\"Media\",IF(Tabla2[[#This Row],[Disponibilidad]]+Tabla2[[#This Row],[Integridad]]+Tabla2[[#This Row],[Confidencialidad ]]>=8,\"Alta\",\"error\")))","v":"Baja"}]
["",null,null,null,null,null,null,null,null,null,null,null,null,null,null,null,null,null,null,null,null,null,null,null,null,{"$f":"IF((Tabla2[[#This Row],[Disponibilidad]]+Tabla2[[#This Row],[Integridad]]+Tabla2[[#This Row],[Confidencialidad ]]<=4),\"Baja\",IF(AND(Tabla2[[#This Row],[Disponibilidad]]+Tabla2[[#This Row],[Integridad]]+Tabla2[[#This Row],[Confidencialidad ]]>=5,Tabla2[[#This Row],[Disponibilidad]]+Tabla2[[#This Row],[Integridad]]+Tabla2[[#This Row],[Confidencialidad ]]<=7),\"Media\",IF(Tabla2[[#This Row],[Disponibilidad]]+Tabla2[[#This Row],[Integridad]]+Tabla2[[#This Row],[Confidencialidad ]]>=8,\"Alta\",\"error\")))","v":"Baja"}]
["",null,null,null,null,null,null,null,null,null,null,null,null,null,null,null,null,null,null,null,null,null,null,null,null,{"$f":"IF((Tabla2[[#This Row],[Disponibilidad]]+Tabla2[[#This Row],[Integridad]]+Tabla2[[#This Row],[Confidencialidad ]]<=4),\"Baja\",IF(AND(Tabla2[[#This Row],[Disponibilidad]]+Tabla2[[#This Row],[Integridad]]+Tabla2[[#This Row],[Confidencialidad ]]>=5,Tabla2[[#This Row],[Disponibilidad]]+Tabla2[[#This Row],[Integridad]]+Tabla2[[#This Row],[Confidencialidad ]]<=7),\"Media\",IF(Tabla2[[#This Row],[Disponibilidad]]+Tabla2[[#This Row],[Integridad]]+Tabla2[[#This Row],[Confidencialidad ]]>=8,\"Alta\",\"error\")))","v":"Baja"}]
["",null,null,null,null,null,null,null,null,null,null,null,null,null,null,null,null,null,null,null,null,null,null,null,null,{"$f":"IF((Tabla2[[#This Row],[Disponibilidad]]+Tabla2[[#This Row],[Integridad]]+Tabla2[[#This Row],[Confidencialidad ]]<=4),\"Baja\",IF(AND(Tabla2[[#This Row],[Disponibilidad]]+Tabla2[[#This Row],[Integridad]]+Tabla2[[#This Row],[Confidencialidad ]]>=5,Tabla2[[#This Row],[Disponibilidad]]+Tabla2[[#This Row],[Integridad]]+Tabla2[[#This Row],[Confidencialidad ]]<=7),\"Media\",IF(Tabla2[[#This Row],[Disponibilidad]]+Tabla2[[#This Row],[Integridad]]+Tabla2[[#This Row],[Confidencialidad ]]>=8,\"Alta\",\"error\")))","v":"Baja"}]
["",null,null,null,null,null,null,null,null,null,null,null,null,null,null,null,null,null,null,null,null,null,null,null,null,{"$f":"IF((Tabla2[[#This Row],[Disponibilidad]]+Tabla2[[#This Row],[Integridad]]+Tabla2[[#This Row],[Confidencialidad ]]<=4),\"Baja\",IF(AND(Tabla2[[#This Row],[Disponibilidad]]+Tabla2[[#This Row],[Integridad]]+Tabla2[[#This Row],[Confidencialidad ]]>=5,Tabla2[[#This Row],[Disponibilidad]]+Tabla2[[#This Row],[Integridad]]+Tabla2[[#This Row],[Confidencialidad ]]<=7),\"Media\",IF(Tabla2[[#This Row],[Disponibilidad]]+Tabla2[[#This Row],[Integridad]]+Tabla2[[#This Row],[Confidencialidad ]]>=8,\"Alta\",\"error\")))","v":"Baja"}]
["",null,null,null,null,null,null,null,null,null,null,null,null,null,null,null,null,null,null,null,null,null,null,null,null,{"$f":"IF((Tabla2[[#This Row],[Disponibilidad]]+Tabla2[[#This Row],[Integridad]]+Tabla2[[#This Row],[Confidencialidad ]]<=4),\"Baja\",IF(AND(Tabla2[[#This Row],[Disponibilidad]]+Tabla2[[#This Row],[Integridad]]+Tabla2[[#This Row],[Confidencialidad ]]>=5,Tabla2[[#This Row],[Disponibilidad]]+Tabla2[[#This Row],[Integridad]]+Tabla2[[#This Row],[Confidencialidad ]]<=7),\"Media\",IF(Tabla2[[#This Row],[Disponibilidad]]+Tabla2[[#This Row],[Integridad]]+Tabla2[[#This Row],[Confidencialidad ]]>=8,\"Alta\",\"error\")))","v":"Baja"}]
["",null,null,null,null,null,null,null,null,null,null,null,null,null,null,null,null,null,null,null,null,null,null,null,null,{"$f":"IF((Tabla2[[#This Row],[Disponibilidad]]+Tabla2[[#This Row],[Integridad]]+Tabla2[[#This Row],[Confidencialidad ]]<=4),\"Baja\",IF(AND(Tabla2[[#This Row],[Disponibilidad]]+Tabla2[[#This Row],[Integridad]]+Tabla2[[#This Row],[Confidencialidad ]]>=5,Tabla2[[#This Row],[Disponibilidad]]+Tabla2[[#This Row],[Integridad]]+Tabla2[[#This Row],[Confidencialidad ]]<=7),\"Media\",IF(Tabla2[[#This Row],[Disponibilidad]]+Tabla2[[#This Row],[Integridad]]+Tabla2[[#This Row],[Confidencialidad ]]>=8,\"Alta\",\"error\")))","v":"Baja"}]
["",null,null,null,null,null,null,null,null,null,null,null,null,null,null,null,null,null,null,null,null,null,null,null,null,{"$f":"IF((Tabla2[[#This Row],[Disponibilidad]]+Tabla2[[#This Row],[Integridad]]+Tabla2[[#This Row],[Confidencialidad ]]<=4),\"Baja\",IF(AND(Tabla2[[#This Row],[Disponibilidad]]+Tabla2[[#This Row],[Integridad]]+Tabla2[[#This Row],[Confidencialidad ]]>=5,Tabla2[[#This Row],[Disponibilidad]]+Tabla2[[#This Row],[Integridad]]+Tabla2[[#This Row],[Confidencialidad ]]<=7),\"Media\",IF(Tabla2[[#This Row],[Disponibilidad]]+Tabla2[[#This Row],[Integridad]]+Tabla2[[#This Row],[Confidencialidad ]]>=8,\"Alta\",\"error\")))","v":"Baja"}]
["",null,null,null,null,null,null,null,null,null,null,null,null,null,null,null,null,null,null,null,null,null,null,null,null,{"$f":"IF((Tabla2[[#This Row],[Disponibilidad]]+Tabla2[[#This Row],[Integridad]]+Tabla2[[#This Row],[Confidencialidad ]]<=4),\"Baja\",IF(AND(Tabla2[[#This Row],[Disponibilidad]]+Tabla2[[#This Row],[Integridad]]+Tabla2[[#This Row],[Confidencialidad ]]>=5,Tabla2[[#This Row],[Disponibilidad]]+Tabla2[[#This Row],[Integridad]]+Tabla2[[#This Row],[Confidencialidad ]]<=7),\"Media\",IF(Tabla2[[#This Row],[Disponibilidad]]+Tabla2[[#This Row],[Integridad]]+Tabla2[[#This Row],[Confidencialidad ]]>=8,\"Alta\",\"error\")))","v":"Baja"}]
["",null,null,null,null,null,null,null,null,null,null,null,null,null,null,null,null,null,null,null,null,null,null,null,null,{"$f":"IF((Tabla2[[#This Row],[Disponibilidad]]+Tabla2[[#This Row],[Integridad]]+Tabla2[[#This Row],[Confidencialidad ]]<=4),\"Baja\",IF(AND(Tabla2[[#This Row],[Disponibilidad]]+Tabla2[[#This Row],[Integridad]]+Tabla2[[#This Row],[Confidencialidad ]]>=5,Tabla2[[#This Row],[Disponibilidad]]+Tabla2[[#This Row],[Integridad]]+Tabla2[[#This Row],[Confidencialidad ]]<=7),\"Media\",IF(Tabla2[[#This Row],[Disponibilidad]]+Tabla2[[#This Row],[Integridad]]+Tabla2[[#This Row],[Confidencialidad ]]>=8,\"Alta\",\"error\")))","v":"Baja"}]
["",null,null,null,null,null,null,null,null,null,null,null,null,null,null,null,null,null,null,null,null,null,null,null,null,{"$f":"IF((Tabla2[[#This Row],[Disponibilidad]]+Tabla2[[#This Row],[Integridad]]+Tabla2[[#This Row],[Confidencialidad ]]<=4),\"Baja\",IF(AND(Tabla2[[#This Row],[Disponibilidad]]+Tabla2[[#This Row],[Integridad]]+Tabla2[[#This Row],[Confidencialidad ]]>=5,Tabla2[[#This Row],[Disponibilidad]]+Tabla2[[#This Row],[Integridad]]+Tabla2[[#This Row],[Confidencialidad ]]<=7),\"Media\",IF(Tabla2[[#This Row],[Disponibilidad]]+Tabla2[[#This Row],[Integridad]]+Tabla2[[#This Row],[Confidencialidad ]]>=8,\"Alta\",\"error\")))","v":"Baja"}]
["",null,null,null,null,null,null,null,null,null,null,null,null,null,null,null,null,null,null,null,null,null,null,null,null,{"$f":"IF((Tabla2[[#This Row],[Disponibilidad]]+Tabla2[[#This Row],[Integridad]]+Tabla2[[#This Row],[Confidencialidad ]]<=4),\"Baja\",IF(AND(Tabla2[[#This Row],[Disponibilidad]]+Tabla2[[#This Row],[Integridad]]+Tabla2[[#This Row],[Confidencialidad ]]>=5,Tabla2[[#This Row],[Disponibilidad]]+Tabla2[[#This Row],[Integridad]]+Tabla2[[#This Row],[Confidencialidad ]]<=7),\"Media\",IF(Tabla2[[#This Row],[Disponibilidad]]+Tabla2[[#This Row],[Integridad]]+Tabla2[[#This Row],[Confidencialidad ]]>=8,\"Alta\",\"error\")))","v":"Baja"}]
["",null,null,null,null,null,null,null,null,null,null,null,null,null,null,null,null,null,null,null,null,null,null,null,null,{"$f":"IF((Tabla2[[#This Row],[Disponibilidad]]+Tabla2[[#This Row],[Integridad]]+Tabla2[[#This Row],[Confidencialidad ]]<=4),\"Baja\",IF(AND(Tabla2[[#This Row],[Disponibilidad]]+Tabla2[[#This Row],[Integridad]]+Tabla2[[#This Row],[Confidencialidad ]]>=5,Tabla2[[#This Row],[Disponibilidad]]+Tabla2[[#This Row],[Integridad]]+Tabla2[[#This Row],[Confidencialidad ]]<=7),\"Media\",IF(Tabla2[[#This Row],[Disponibilidad]]+Tabla2[[#This Row],[Integridad]]+Tabla2[[#This Row],[Confidencialidad ]]>=8,\"Alta\",\"error\")))","v":"Baja"}]
["",null,null,null,null,null,null,null,null,null,null,null,null,null,null,null,null,null,null,null,null,null,null,null,null,{"$f":"IF((Tabla2[[#This Row],[Disponibilidad]]+Tabla2[[#This Row],[Integridad]]+Tabla2[[#This Row],[Confidencialidad ]]<=4),\"Baja\",IF(AND(Tabla2[[#This Row],[Disponibilidad]]+Tabla2[[#This Row],[Integridad]]+Tabla2[[#This Row],[Confidencialidad ]]>=5,Tabla2[[#This Row],[Disponibilidad]]+Tabla2[[#This Row],[Integridad]]+Tabla2[[#This Row],[Confidencialidad ]]<=7),\"Media\",IF(Tabla2[[#This Row],[Disponibilidad]]+Tabla2[[#This Row],[Integridad]]+Tabla2[[#This Row],[Confidencialidad ]]>=8,\"Alta\",\"error\")))","v":"Baja"}]
[{"$f":"IF(C937<>\"\",1,\"\")","v":""},null,null,null,null,null,null,null,null,null,null,null,null,null,null,null,null,null,null,null,null,null,null,null,null,{"$f":"IF((Tabla2[[#This Row],[Disponibilidad]]+Tabla2[[#This Row],[Integridad]]+Tabla2[[#This Row],[Confidencialidad ]]<=4),\"Baja\",IF(AND(Tabla2[[#This Row],[Disponibilidad]]+Tabla2[[#This Row],[Integridad]]+Tabla2[[#This Row],[Confidencialidad ]]>=5,Tabla2[[#This Row],[Disponibilidad]]+Tabla2[[#This Row],[Integridad]]+Tabla2[[#This Row],[Confidencialidad ]]<=7),\"Media\",IF(Tabla2[[#This Row],[Disponibilidad]]+Tabla2[[#This Row],[Integridad]]+Tabla2[[#This Row],[Confidencialidad ]]>=8,\"Alta\",\"error\")))","v":"Baja"}]
["",null,null,null,null,null,null,null,null,null,null,null,null,null,null,null,null,null,null,null,null,null,null,null,null,{"$f":"IF((Tabla2[[#This Row],[Disponibilidad]]+Tabla2[[#This Row],[Integridad]]+Tabla2[[#This Row],[Confidencialidad ]]<=4),\"Baja\",IF(AND(Tabla2[[#This Row],[Disponibilidad]]+Tabla2[[#This Row],[Integridad]]+Tabla2[[#This Row],[Confidencialidad ]]>=5,Tabla2[[#This Row],[Disponibilidad]]+Tabla2[[#This Row],[Integridad]]+Tabla2[[#This Row],[Confidencialidad ]]<=7),\"Media\",IF(Tabla2[[#This Row],[Disponibilidad]]+Tabla2[[#This Row],[Integridad]]+Tabla2[[#This Row],[Confidencialidad ]]>=8,\"Alta\",\"error\")))","v":"Baja"}]
["",null,null,null,null,null,null,null,null,null,null,null,null,null,null,null,null,null,null,null,null,null,null,null,null,{"$f":"IF((Tabla2[[#This Row],[Disponibilidad]]+Tabla2[[#This Row],[Integridad]]+Tabla2[[#This Row],[Confidencialidad ]]<=4),\"Baja\",IF(AND(Tabla2[[#This Row],[Disponibilidad]]+Tabla2[[#This Row],[Integridad]]+Tabla2[[#This Row],[Confidencialidad ]]>=5,Tabla2[[#This Row],[Disponibilidad]]+Tabla2[[#This Row],[Integridad]]+Tabla2[[#This Row],[Confidencialidad ]]<=7),\"Media\",IF(Tabla2[[#This Row],[Disponibilidad]]+Tabla2[[#This Row],[Integridad]]+Tabla2[[#This Row],[Confidencialidad ]]>=8,\"Alta\",\"error\")))","v":"Baja"}]
["",null,null,null,null,null,null,null,null,null,null,null,null,null,null,null,null,null,null,null,null,null,null,null,null,{"$f":"IF((Tabla2[[#This Row],[Disponibilidad]]+Tabla2[[#This Row],[Integridad]]+Tabla2[[#This Row],[Confidencialidad ]]<=4),\"Baja\",IF(AND(Tabla2[[#This Row],[Disponibilidad]]+Tabla2[[#This Row],[Integridad]]+Tabla2[[#This Row],[Confidencialidad ]]>=5,Tabla2[[#This Row],[Disponibilidad]]+Tabla2[[#This Row],[Integridad]]+Tabla2[[#This Row],[Confidencialidad ]]<=7),\"Media\",IF(Tabla2[[#This Row],[Disponibilidad]]+Tabla2[[#This Row],[Integridad]]+Tabla2[[#This Row],[Confidencialidad ]]>=8,\"Alta\",\"error\")))","v":"Baja"}]
["",null,null,null,null,null,null,null,null,null,null,null,null,null,null,null,null,null,null,null,null,null,null,null,null,{"$f":"IF((Tabla2[[#This Row],[Disponibilidad]]+Tabla2[[#This Row],[Integridad]]+Tabla2[[#This Row],[Confidencialidad ]]<=4),\"Baja\",IF(AND(Tabla2[[#This Row],[Disponibilidad]]+Tabla2[[#This Row],[Integridad]]+Tabla2[[#This Row],[Confidencialidad ]]>=5,Tabla2[[#This Row],[Disponibilidad]]+Tabla2[[#This Row],[Integridad]]+Tabla2[[#This Row],[Confidencialidad ]]<=7),\"Media\",IF(Tabla2[[#This Row],[Disponibilidad]]+Tabla2[[#This Row],[Integridad]]+Tabla2[[#This Row],[Confidencialidad ]]>=8,\"Alta\",\"error\")))","v":"Baja"}]
["",null,null,null,null,null,null,null,null,null,null,null,null,null,null,null,null,null,null,null,null,null,null,null,null,{"$f":"IF((Tabla2[[#This Row],[Disponibilidad]]+Tabla2[[#This Row],[Integridad]]+Tabla2[[#This Row],[Confidencialidad ]]<=4),\"Baja\",IF(AND(Tabla2[[#This Row],[Disponibilidad]]+Tabla2[[#This Row],[Integridad]]+Tabla2[[#This Row],[Confidencialidad ]]>=5,Tabla2[[#This Row],[Disponibilidad]]+Tabla2[[#This Row],[Integridad]]+Tabla2[[#This Row],[Confidencialidad ]]<=7),\"Media\",IF(Tabla2[[#This Row],[Disponibilidad]]+Tabla2[[#This Row],[Integridad]]+Tabla2[[#This Row],[Confidencialidad ]]>=8,\"Alta\",\"error\")))","v":"Baja"}]
["",null,null,null,null,null,null,null,null,null,null,null,null,null,null,null,null,null,null,null,null,null,null,null,null,{"$f":"IF((Tabla2[[#This Row],[Disponibilidad]]+Tabla2[[#This Row],[Integridad]]+Tabla2[[#This Row],[Confidencialidad ]]<=4),\"Baja\",IF(AND(Tabla2[[#This Row],[Disponibilidad]]+Tabla2[[#This Row],[Integridad]]+Tabla2[[#This Row],[Confidencialidad ]]>=5,Tabla2[[#This Row],[Disponibilidad]]+Tabla2[[#This Row],[Integridad]]+Tabla2[[#This Row],[Confidencialidad ]]<=7),\"Media\",IF(Tabla2[[#This Row],[Disponibilidad]]+Tabla2[[#This Row],[Integridad]]+Tabla2[[#This Row],[Confidencialidad ]]>=8,\"Alta\",\"error\")))","v":"Baja"}]
["",null,null,null,null,null,null,null,null,null,null,null,null,null,null,null,null,null,null,null,null,null,null,null,null,{"$f":"IF((Tabla2[[#This Row],[Disponibilidad]]+Tabla2[[#This Row],[Integridad]]+Tabla2[[#This Row],[Confidencialidad ]]<=4),\"Baja\",IF(AND(Tabla2[[#This Row],[Disponibilidad]]+Tabla2[[#This Row],[Integridad]]+Tabla2[[#This Row],[Confidencialidad ]]>=5,Tabla2[[#This Row],[Disponibilidad]]+Tabla2[[#This Row],[Integridad]]+Tabla2[[#This Row],[Confidencialidad ]]<=7),\"Media\",IF(Tabla2[[#This Row],[Disponibilidad]]+Tabla2[[#This Row],[Integridad]]+Tabla2[[#This Row],[Confidencialidad ]]>=8,\"Alta\",\"error\")))","v":"Baja"}]
["",null,null,null,null,null,null,null,null,null,null,null,null,null,null,null,null,null,null,null,null,null,null,null,null,{"$f":"IF((Tabla2[[#This Row],[Disponibilidad]]+Tabla2[[#This Row],[Integridad]]+Tabla2[[#This Row],[Confidencialidad ]]<=4),\"Baja\",IF(AND(Tabla2[[#This Row],[Disponibilidad]]+Tabla2[[#This Row],[Integridad]]+Tabla2[[#This Row],[Confidencialidad ]]>=5,Tabla2[[#This Row],[Disponibilidad]]+Tabla2[[#This Row],[Integridad]]+Tabla2[[#This Row],[Confidencialidad ]]<=7),\"Media\",IF(Tabla2[[#This Row],[Disponibilidad]]+Tabla2[[#This Row],[Integridad]]+Tabla2[[#This Row],[Confidencialidad ]]>=8,\"Alta\",\"error\")))","v":"Baja"}]
["",null,null,null,null,null,null,null,null,null,null,null,null,null,null,null,null,null,null,null,null,null,null,null,null,{"$f":"IF((Tabla2[[#This Row],[Disponibilidad]]+Tabla2[[#This Row],[Integridad]]+Tabla2[[#This Row],[Confidencialidad ]]<=4),\"Baja\",IF(AND(Tabla2[[#This Row],[Disponibilidad]]+Tabla2[[#This Row],[Integridad]]+Tabla2[[#This Row],[Confidencialidad ]]>=5,Tabla2[[#This Row],[Disponibilidad]]+Tabla2[[#This Row],[Integridad]]+Tabla2[[#This Row],[Confidencialidad ]]<=7),\"Media\",IF(Tabla2[[#This Row],[Disponibilidad]]+Tabla2[[#This Row],[Integridad]]+Tabla2[[#This Row],[Confidencialidad ]]>=8,\"Alta\",\"error\")))","v":"Baja"}]
["",null,null,null,null,null,null,null,null,null,null,null,null,null,null,null,null,null,null,null,null,null,null,null,null,{"$f":"IF((Tabla2[[#This Row],[Disponibilidad]]+Tabla2[[#This Row],[Integridad]]+Tabla2[[#This Row],[Confidencialidad ]]<=4),\"Baja\",IF(AND(Tabla2[[#This Row],[Disponibilidad]]+Tabla2[[#This Row],[Integridad]]+Tabla2[[#This Row],[Confidencialidad ]]>=5,Tabla2[[#This Row],[Disponibilidad]]+Tabla2[[#This Row],[Integridad]]+Tabla2[[#This Row],[Confidencialidad ]]<=7),\"Media\",IF(Tabla2[[#This Row],[Disponibilidad]]+Tabla2[[#This Row],[Integridad]]+Tabla2[[#This Row],[Confidencialidad ]]>=8,\"Alta\",\"error\")))","v":"Baja"}]
["",null,null,null,null,null,null,null,null,null,null,null,null,null,null,null,null,null,null,null,null,null,null,null,null,{"$f":"IF((Tabla2[[#This Row],[Disponibilidad]]+Tabla2[[#This Row],[Integridad]]+Tabla2[[#This Row],[Confidencialidad ]]<=4),\"Baja\",IF(AND(Tabla2[[#This Row],[Disponibilidad]]+Tabla2[[#This Row],[Integridad]]+Tabla2[[#This Row],[Confidencialidad ]]>=5,Tabla2[[#This Row],[Disponibilidad]]+Tabla2[[#This Row],[Integridad]]+Tabla2[[#This Row],[Confidencialidad ]]<=7),\"Media\",IF(Tabla2[[#This Row],[Disponibilidad]]+Tabla2[[#This Row],[Integridad]]+Tabla2[[#This Row],[Confidencialidad ]]>=8,\"Alta\",\"error\")))","v":"Baja"}]
["",null,null,null,null,null,null,null,null,null,null,null,null,null,null,null,null,null,null,null,null,null,null,null,null,{"$f":"IF((Tabla2[[#This Row],[Disponibilidad]]+Tabla2[[#This Row],[Integridad]]+Tabla2[[#This Row],[Confidencialidad ]]<=4),\"Baja\",IF(AND(Tabla2[[#This Row],[Disponibilidad]]+Tabla2[[#This Row],[Integridad]]+Tabla2[[#This Row],[Confidencialidad ]]>=5,Tabla2[[#This Row],[Disponibilidad]]+Tabla2[[#This Row],[Integridad]]+Tabla2[[#This Row],[Confidencialidad ]]<=7),\"Media\",IF(Tabla2[[#This Row],[Disponibilidad]]+Tabla2[[#This Row],[Integridad]]+Tabla2[[#This Row],[Confidencialidad ]]>=8,\"Alta\",\"error\")))","v":"Baja"}]
["",null,null,null,null,null,null,null,null,null,null,null,null,null,null,null,null,null,null,null,null,null,null,null,null,{"$f":"IF((Tabla2[[#This Row],[Disponibilidad]]+Tabla2[[#This Row],[Integridad]]+Tabla2[[#This Row],[Confidencialidad ]]<=4),\"Baja\",IF(AND(Tabla2[[#This Row],[Disponibilidad]]+Tabla2[[#This Row],[Integridad]]+Tabla2[[#This Row],[Confidencialidad ]]>=5,Tabla2[[#This Row],[Disponibilidad]]+Tabla2[[#This Row],[Integridad]]+Tabla2[[#This Row],[Confidencialidad ]]<=7),\"Media\",IF(Tabla2[[#This Row],[Disponibilidad]]+Tabla2[[#This Row],[Integridad]]+Tabla2[[#This Row],[Confidencialidad ]]>=8,\"Alta\",\"error\")))","v":"Baja"}]
["",null,null,null,null,null,null,null,null,null,null,null,null,null,null,null,null,null,null,null,null,null,null,null,null,{"$f":"IF((Tabla2[[#This Row],[Disponibilidad]]+Tabla2[[#This Row],[Integridad]]+Tabla2[[#This Row],[Confidencialidad ]]<=4),\"Baja\",IF(AND(Tabla2[[#This Row],[Disponibilidad]]+Tabla2[[#This Row],[Integridad]]+Tabla2[[#This Row],[Confidencialidad ]]>=5,Tabla2[[#This Row],[Disponibilidad]]+Tabla2[[#This Row],[Integridad]]+Tabla2[[#This Row],[Confidencialidad ]]<=7),\"Media\",IF(Tabla2[[#This Row],[Disponibilidad]]+Tabla2[[#This Row],[Integridad]]+Tabla2[[#This Row],[Confidencialidad ]]>=8,\"Alta\",\"error\")))","v":"Baja"}]
["",null,null,null,null,null,null,null,null,null,null,null,null,null,null,null,null,null,null,null,null,null,null,null,null,{"$f":"IF((Tabla2[[#This Row],[Disponibilidad]]+Tabla2[[#This Row],[Integridad]]+Tabla2[[#This Row],[Confidencialidad ]]<=4),\"Baja\",IF(AND(Tabla2[[#This Row],[Disponibilidad]]+Tabla2[[#This Row],[Integridad]]+Tabla2[[#This Row],[Confidencialidad ]]>=5,Tabla2[[#This Row],[Disponibilidad]]+Tabla2[[#This Row],[Integridad]]+Tabla2[[#This Row],[Confidencialidad ]]<=7),\"Media\",IF(Tabla2[[#This Row],[Disponibilidad]]+Tabla2[[#This Row],[Integridad]]+Tabla2[[#This Row],[Confidencialidad ]]>=8,\"Alta\",\"error\")))","v":"Baja"}]
["",null,null,null,null,null,null,null,null,null,null,null,null,null,null,null,null,null,null,null,null,null,null,null,null,{"$f":"IF((Tabla2[[#This Row],[Disponibilidad]]+Tabla2[[#This Row],[Integridad]]+Tabla2[[#This Row],[Confidencialidad ]]<=4),\"Baja\",IF(AND(Tabla2[[#This Row],[Disponibilidad]]+Tabla2[[#This Row],[Integridad]]+Tabla2[[#This Row],[Confidencialidad ]]>=5,Tabla2[[#This Row],[Disponibilidad]]+Tabla2[[#This Row],[Integridad]]+Tabla2[[#This Row],[Confidencialidad ]]<=7),\"Media\",IF(Tabla2[[#This Row],[Disponibilidad]]+Tabla2[[#This Row],[Integridad]]+Tabla2[[#This Row],[Confidencialidad ]]>=8,\"Alta\",\"error\")))","v":"Baja"}]
["",null,null,null,null,null,null,null,null,null,null,null,null,null,null,null,null,null,null,null,null,null,null,null,null,{"$f":"IF((Tabla2[[#This Row],[Disponibilidad]]+Tabla2[[#This Row],[Integridad]]+Tabla2[[#This Row],[Confidencialidad ]]<=4),\"Baja\",IF(AND(Tabla2[[#This Row],[Disponibilidad]]+Tabla2[[#This Row],[Integridad]]+Tabla2[[#This Row],[Confidencialidad ]]>=5,Tabla2[[#This Row],[Disponibilidad]]+Tabla2[[#This Row],[Integridad]]+Tabla2[[#This Row],[Confidencialidad ]]<=7),\"Media\",IF(Tabla2[[#This Row],[Disponibilidad]]+Tabla2[[#This Row],[Integridad]]+Tabla2[[#This Row],[Confidencialidad ]]>=8,\"Alta\",\"error\")))","v":"Baja"}]
["",null,null,null,null,null,null,null,null,null,null,null,null,null,null,null,null,null,null,null,null,null,null,null,null,{"$f":"IF((Tabla2[[#This Row],[Disponibilidad]]+Tabla2[[#This Row],[Integridad]]+Tabla2[[#This Row],[Confidencialidad ]]<=4),\"Baja\",IF(AND(Tabla2[[#This Row],[Disponibilidad]]+Tabla2[[#This Row],[Integridad]]+Tabla2[[#This Row],[Confidencialidad ]]>=5,Tabla2[[#This Row],[Disponibilidad]]+Tabla2[[#This Row],[Integridad]]+Tabla2[[#This Row],[Confidencialidad ]]<=7),\"Media\",IF(Tabla2[[#This Row],[Disponibilidad]]+Tabla2[[#This Row],[Integridad]]+Tabla2[[#This Row],[Confidencialidad ]]>=8,\"Alta\",\"error\")))","v":"Baja"}]
["",null,null,null,null,null,null,null,null,null,null,null,null,null,null,null,null,null,null,null,null,null,null,null,null,{"$f":"IF((Tabla2[[#This Row],[Disponibilidad]]+Tabla2[[#This Row],[Integridad]]+Tabla2[[#This Row],[Confidencialidad ]]<=4),\"Baja\",IF(AND(Tabla2[[#This Row],[Disponibilidad]]+Tabla2[[#This Row],[Integridad]]+Tabla2[[#This Row],[Confidencialidad ]]>=5,Tabla2[[#This Row],[Disponibilidad]]+Tabla2[[#This Row],[Integridad]]+Tabla2[[#This Row],[Confidencialidad ]]<=7),\"Media\",IF(Tabla2[[#This Row],[Disponibilidad]]+Tabla2[[#This Row],[Integridad]]+Tabla2[[#This Row],[Confidencialidad ]]>=8,\"Alta\",\"error\")))","v":"Baja"}]
["",null,null,null,null,null,null,null,null,null,null,null,null,null,null,null,null,null,null,null,null,null,null,null,null,{"$f":"IF((Tabla2[[#This Row],[Disponibilidad]]+Tabla2[[#This Row],[Integridad]]+Tabla2[[#This Row],[Confidencialidad ]]<=4),\"Baja\",IF(AND(Tabla2[[#This Row],[Disponibilidad]]+Tabla2[[#This Row],[Integridad]]+Tabla2[[#This Row],[Confidencialidad ]]>=5,Tabla2[[#This Row],[Disponibilidad]]+Tabla2[[#This Row],[Integridad]]+Tabla2[[#This Row],[Confidencialidad ]]<=7),\"Media\",IF(Tabla2[[#This Row],[Disponibilidad]]+Tabla2[[#This Row],[Integridad]]+Tabla2[[#This Row],[Confidencialidad ]]>=8,\"Alta\",\"error\")))","v":"Baja"}]
["",null,null,null,null,null,null,null,null,null,null,null,null,null,null,null,null,null,null,null,null,null,null,null,null,{"$f":"IF((Tabla2[[#This Row],[Disponibilidad]]+Tabla2[[#This Row],[Integridad]]+Tabla2[[#This Row],[Confidencialidad ]]<=4),\"Baja\",IF(AND(Tabla2[[#This Row],[Disponibilidad]]+Tabla2[[#This Row],[Integridad]]+Tabla2[[#This Row],[Confidencialidad ]]>=5,Tabla2[[#This Row],[Disponibilidad]]+Tabla2[[#This Row],[Integridad]]+Tabla2[[#This Row],[Confidencialidad ]]<=7),\"Media\",IF(Tabla2[[#This Row],[Disponibilidad]]+Tabla2[[#This Row],[Integridad]]+Tabla2[[#This Row],[Confidencialidad ]]>=8,\"Alta\",\"error\")))","v":"Baja"}]
["",null,null,null,null,null,null,null,null,null,null,null,null,null,null,null,null,null,null,null,null,null,null,null,null,{"$f":"IF((Tabla2[[#This Row],[Disponibilidad]]+Tabla2[[#This Row],[Integridad]]+Tabla2[[#This Row],[Confidencialidad ]]<=4),\"Baja\",IF(AND(Tabla2[[#This Row],[Disponibilidad]]+Tabla2[[#This Row],[Integridad]]+Tabla2[[#This Row],[Confidencialidad ]]>=5,Tabla2[[#This Row],[Disponibilidad]]+Tabla2[[#This Row],[Integridad]]+Tabla2[[#This Row],[Confidencialidad ]]<=7),\"Media\",IF(Tabla2[[#This Row],[Disponibilidad]]+Tabla2[[#This Row],[Integridad]]+Tabla2[[#This Row],[Confidencialidad ]]>=8,\"Alta\",\"error\")))","v":"Baja"}]
["",null,null,null,null,null,null,null,null,null,null,null,null,null,null,null,null,null,null,null,null,null,null,null,null,{"$f":"IF((Tabla2[[#This Row],[Disponibilidad]]+Tabla2[[#This Row],[Integridad]]+Tabla2[[#This Row],[Confidencialidad ]]<=4),\"Baja\",IF(AND(Tabla2[[#This Row],[Disponibilidad]]+Tabla2[[#This Row],[Integridad]]+Tabla2[[#This Row],[Confidencialidad ]]>=5,Tabla2[[#This Row],[Disponibilidad]]+Tabla2[[#This Row],[Integridad]]+Tabla2[[#This Row],[Confidencialidad ]]<=7),\"Media\",IF(Tabla2[[#This Row],[Disponibilidad]]+Tabla2[[#This Row],[Integridad]]+Tabla2[[#This Row],[Confidencialidad ]]>=8,\"Alta\",\"error\")))","v":"Baja"}]
["",null,null,null,null,null,null,null,null,null,null,null,null,null,null,null,null,null,null,null,null,null,null,null,null,{"$f":"IF((Tabla2[[#This Row],[Disponibilidad]]+Tabla2[[#This Row],[Integridad]]+Tabla2[[#This Row],[Confidencialidad ]]<=4),\"Baja\",IF(AND(Tabla2[[#This Row],[Disponibilidad]]+Tabla2[[#This Row],[Integridad]]+Tabla2[[#This Row],[Confidencialidad ]]>=5,Tabla2[[#This Row],[Disponibilidad]]+Tabla2[[#This Row],[Integridad]]+Tabla2[[#This Row],[Confidencialidad ]]<=7),\"Media\",IF(Tabla2[[#This Row],[Disponibilidad]]+Tabla2[[#This Row],[Integridad]]+Tabla2[[#This Row],[Confidencialidad ]]>=8,\"Alta\",\"error\")))","v":"Baja"}]
["",null,null,null,null,null,null,null,null,null,null,null,null,null,null,null,null,null,null,null,null,null,null,null,null,{"$f":"IF((Tabla2[[#This Row],[Disponibilidad]]+Tabla2[[#This Row],[Integridad]]+Tabla2[[#This Row],[Confidencialidad ]]<=4),\"Baja\",IF(AND(Tabla2[[#This Row],[Disponibilidad]]+Tabla2[[#This Row],[Integridad]]+Tabla2[[#This Row],[Confidencialidad ]]>=5,Tabla2[[#This Row],[Disponibilidad]]+Tabla2[[#This Row],[Integridad]]+Tabla2[[#This Row],[Confidencialidad ]]<=7),\"Media\",IF(Tabla2[[#This Row],[Disponibilidad]]+Tabla2[[#This Row],[Integridad]]+Tabla2[[#This Row],[Confidencialidad ]]>=8,\"Alta\",\"error\")))","v":"Baja"}]
["",null,null,null,null,null,null,null,null,null,null,null,null,null,null,null,null,null,null,null,null,null,null,null,null,{"$f":"IF((Tabla2[[#This Row],[Disponibilidad]]+Tabla2[[#This Row],[Integridad]]+Tabla2[[#This Row],[Confidencialidad ]]<=4),\"Baja\",IF(AND(Tabla2[[#This Row],[Disponibilidad]]+Tabla2[[#This Row],[Integridad]]+Tabla2[[#This Row],[Confidencialidad ]]>=5,Tabla2[[#This Row],[Disponibilidad]]+Tabla2[[#This Row],[Integridad]]+Tabla2[[#This Row],[Confidencialidad ]]<=7),\"Media\",IF(Tabla2[[#This Row],[Disponibilidad]]+Tabla2[[#This Row],[Integridad]]+Tabla2[[#This Row],[Confidencialidad ]]>=8,\"Alta\",\"error\")))","v":"Baja"}]
["",null,null,null,null,null,null,null,null,null,null,null,null,null,null,null,null,null,null,null,null,null,null,null,null,{"$f":"IF((Tabla2[[#This Row],[Disponibilidad]]+Tabla2[[#This Row],[Integridad]]+Tabla2[[#This Row],[Confidencialidad ]]<=4),\"Baja\",IF(AND(Tabla2[[#This Row],[Disponibilidad]]+Tabla2[[#This Row],[Integridad]]+Tabla2[[#This Row],[Confidencialidad ]]>=5,Tabla2[[#This Row],[Disponibilidad]]+Tabla2[[#This Row],[Integridad]]+Tabla2[[#This Row],[Confidencialidad ]]<=7),\"Media\",IF(Tabla2[[#This Row],[Disponibilidad]]+Tabla2[[#This Row],[Integridad]]+Tabla2[[#This Row],[Confidencialidad ]]>=8,\"Alta\",\"error\")))","v":"Baja"}]
[{"$f":"IF(C965<>\"\",1,\"\")","v":""},null,null,null,null,null,null,null,null,null,null,null,null,null,null,null,null,null,null,null,null,null,null,null,null,{"$f":"IF((Tabla2[[#This Row],[Disponibilidad]]+Tabla2[[#This Row],[Integridad]]+Tabla2[[#This Row],[Confidencialidad ]]<=4),\"Baja\",IF(AND(Tabla2[[#This Row],[Disponibilidad]]+Tabla2[[#This Row],[Integridad]]+Tabla2[[#This Row],[Confidencialidad ]]>=5,Tabla2[[#This Row],[Disponibilidad]]+Tabla2[[#This Row],[Integridad]]+Tabla2[[#This Row],[Confidencialidad ]]<=7),\"Media\",IF(Tabla2[[#This Row],[Disponibilidad]]+Tabla2[[#This Row],[Integridad]]+Tabla2[[#This Row],[Confidencialidad ]]>=8,\"Alta\",\"error\")))","v":"Baja"}]
[{"$f":"IF(C966<>\"\",1,\"\")","v":""},null,null,null,null,null,null,null,null,null,null,null,null,null,null,null,null,null,null,null,null,null,null,null,null,{"$f":"IF((Tabla2[[#This Row],[Disponibilidad]]+Tabla2[[#This Row],[Integridad]]+Tabla2[[#This Row],[Confidencialidad ]]<=4),\"Baja\",IF(AND(Tabla2[[#This Row],[Disponibilidad]]+Tabla2[[#This Row],[Integridad]]+Tabla2[[#This Row],[Confidencialidad ]]>=5,Tabla2[[#This Row],[Disponibilidad]]+Tabla2[[#This Row],[Integridad]]+Tabla2[[#This Row],[Confidencialidad ]]<=7),\"Media\",IF(Tabla2[[#This Row],[Disponibilidad]]+Tabla2[[#This Row],[Integridad]]+Tabla2[[#This Row],[Confidencialidad ]]>=8,\"Alta\",\"error\")))","v":"Baja"}]
["",null,null,null,null,null,null,null,null,null,null,null,null,null,null,null,null,null,null,null,null,null,null,null,null,{"$f":"IF((Tabla2[[#This Row],[Disponibilidad]]+Tabla2[[#This Row],[Integridad]]+Tabla2[[#This Row],[Confidencialidad ]]<=4),\"Baja\",IF(AND(Tabla2[[#This Row],[Disponibilidad]]+Tabla2[[#This Row],[Integridad]]+Tabla2[[#This Row],[Confidencialidad ]]>=5,Tabla2[[#This Row],[Disponibilidad]]+Tabla2[[#This Row],[Integridad]]+Tabla2[[#This Row],[Confidencialidad ]]<=7),\"Media\",IF(Tabla2[[#This Row],[Disponibilidad]]+Tabla2[[#This Row],[Integridad]]+Tabla2[[#This Row],[Confidencialidad ]]>=8,\"Alta\",\"error\")))","v":"Baja"}]
["",null,null,null,null,null,null,null,null,null,null,null,null,null,null,null,null,null,null,null,null,null,null,null,null,{"$f":"IF((Tabla2[[#This Row],[Disponibilidad]]+Tabla2[[#This Row],[Integridad]]+Tabla2[[#This Row],[Confidencialidad ]]<=4),\"Baja\",IF(AND(Tabla2[[#This Row],[Disponibilidad]]+Tabla2[[#This Row],[Integridad]]+Tabla2[[#This Row],[Confidencialidad ]]>=5,Tabla2[[#This Row],[Disponibilidad]]+Tabla2[[#This Row],[Integridad]]+Tabla2[[#This Row],[Confidencialidad ]]<=7),\"Media\",IF(Tabla2[[#This Row],[Disponibilidad]]+Tabla2[[#This Row],[Integridad]]+Tabla2[[#This Row],[Confidencialidad ]]>=8,\"Alta\",\"error\")))","v":"Baja"}]
["",null,null,null,null,null,null,null,null,null,null,null,null,null,null,null,null,null,null,null,null,null,null,null,null,{"$f":"IF((Tabla2[[#This Row],[Disponibilidad]]+Tabla2[[#This Row],[Integridad]]+Tabla2[[#This Row],[Confidencialidad ]]<=4),\"Baja\",IF(AND(Tabla2[[#This Row],[Disponibilidad]]+Tabla2[[#This Row],[Integridad]]+Tabla2[[#This Row],[Confidencialidad ]]>=5,Tabla2[[#This Row],[Disponibilidad]]+Tabla2[[#This Row],[Integridad]]+Tabla2[[#This Row],[Confidencialidad ]]<=7),\"Media\",IF(Tabla2[[#This Row],[Disponibilidad]]+Tabla2[[#This Row],[Integridad]]+Tabla2[[#This Row],[Confidencialidad ]]>=8,\"Alta\",\"error\")))","v":"Baja"}]
["",null,null,null,null,null,null,null,null,null,null,null,null,null,null,null,null,null,null,null,null,null,null,null,null,{"$f":"IF((Tabla2[[#This Row],[Disponibilidad]]+Tabla2[[#This Row],[Integridad]]+Tabla2[[#This Row],[Confidencialidad ]]<=4),\"Baja\",IF(AND(Tabla2[[#This Row],[Disponibilidad]]+Tabla2[[#This Row],[Integridad]]+Tabla2[[#This Row],[Confidencialidad ]]>=5,Tabla2[[#This Row],[Disponibilidad]]+Tabla2[[#This Row],[Integridad]]+Tabla2[[#This Row],[Confidencialidad ]]<=7),\"Media\",IF(Tabla2[[#This Row],[Disponibilidad]]+Tabla2[[#This Row],[Integridad]]+Tabla2[[#This Row],[Confidencialidad ]]>=8,\"Alta\",\"error\")))","v":"Baja"}]
["",null,null,null,null,null,null,null,null,null,null,null,null,null,null,null,null,null,null,null,null,null,null,null,null,{"$f":"IF((Tabla2[[#This Row],[Disponibilidad]]+Tabla2[[#This Row],[Integridad]]+Tabla2[[#This Row],[Confidencialidad ]]<=4),\"Baja\",IF(AND(Tabla2[[#This Row],[Disponibilidad]]+Tabla2[[#This Row],[Integridad]]+Tabla2[[#This Row],[Confidencialidad ]]>=5,Tabla2[[#This Row],[Disponibilidad]]+Tabla2[[#This Row],[Integridad]]+Tabla2[[#This Row],[Confidencialidad ]]<=7),\"Media\",IF(Tabla2[[#This Row],[Disponibilidad]]+Tabla2[[#This Row],[Integridad]]+Tabla2[[#This Row],[Confidencialidad ]]>=8,\"Alta\",\"error\")))","v":"Baja"}]
["",null,null,null,null,null,null,null,null,null,null,null,null,null,null,null,null,null,null,null,null,null,null,null,null,{"$f":"IF((Tabla2[[#This Row],[Disponibilidad]]+Tabla2[[#This Row],[Integridad]]+Tabla2[[#This Row],[Confidencialidad ]]<=4),\"Baja\",IF(AND(Tabla2[[#This Row],[Disponibilidad]]+Tabla2[[#This Row],[Integridad]]+Tabla2[[#This Row],[Confidencialidad ]]>=5,Tabla2[[#This Row],[Disponibilidad]]+Tabla2[[#This Row],[Integridad]]+Tabla2[[#This Row],[Confidencialidad ]]<=7),\"Media\",IF(Tabla2[[#This Row],[Disponibilidad]]+Tabla2[[#This Row],[Integridad]]+Tabla2[[#This Row],[Confidencialidad ]]>=8,\"Alta\",\"error\")))","v":"Baja"}]
["",null,null,null,null,null,null,null,null,null,null,null,null,null,null,null,null,null,null,null,null,null,null,null,null,{"$f":"IF((Tabla2[[#This Row],[Disponibilidad]]+Tabla2[[#This Row],[Integridad]]+Tabla2[[#This Row],[Confidencialidad ]]<=4),\"Baja\",IF(AND(Tabla2[[#This Row],[Disponibilidad]]+Tabla2[[#This Row],[Integridad]]+Tabla2[[#This Row],[Confidencialidad ]]>=5,Tabla2[[#This Row],[Disponibilidad]]+Tabla2[[#This Row],[Integridad]]+Tabla2[[#This Row],[Confidencialidad ]]<=7),\"Media\",IF(Tabla2[[#This Row],[Disponibilidad]]+Tabla2[[#This Row],[Integridad]]+Tabla2[[#This Row],[Confidencialidad ]]>=8,\"Alta\",\"error\")))","v":"Baja"}]
[{"$f":"IF(C974<>\"\",1,\"\")","v":""},null,null,null,null,null,null,null,null,null,null,null,null,null,null,null,null,null,null,null,null,null,null,null,null,{"$f":"IF((Tabla2[[#This Row],[Disponibilidad]]+Tabla2[[#This Row],[Integridad]]+Tabla2[[#This Row],[Confidencialidad ]]<=4),\"Baja\",IF(AND(Tabla2[[#This Row],[Disponibilidad]]+Tabla2[[#This Row],[Integridad]]+Tabla2[[#This Row],[Confidencialidad ]]>=5,Tabla2[[#This Row],[Disponibilidad]]+Tabla2[[#This Row],[Integridad]]+Tabla2[[#This Row],[Confidencialidad ]]<=7),\"Media\",IF(Tabla2[[#This Row],[Disponibilidad]]+Tabla2[[#This Row],[Integridad]]+Tabla2[[#This Row],[Confidencialidad ]]>=8,\"Alta\",\"error\")))","v":"Baja"}]
["",null,null,null,null,null,null,null,null,null,null,null,null,null,null,null,null,null,null,null,null,null,null,null,null,{"$f":"IF((Tabla2[[#This Row],[Disponibilidad]]+Tabla2[[#This Row],[Integridad]]+Tabla2[[#This Row],[Confidencialidad ]]<=4),\"Baja\",IF(AND(Tabla2[[#This Row],[Disponibilidad]]+Tabla2[[#This Row],[Integridad]]+Tabla2[[#This Row],[Confidencialidad ]]>=5,Tabla2[[#This Row],[Disponibilidad]]+Tabla2[[#This Row],[Integridad]]+Tabla2[[#This Row],[Confidencialidad ]]<=7),\"Media\",IF(Tabla2[[#This Row],[Disponibilidad]]+Tabla2[[#This Row],[Integridad]]+Tabla2[[#This Row],[Confidencialidad ]]>=8,\"Alta\",\"error\")))","v":"Baja"}]
["",null,null,null,null,null,null,null,null,null,null,null,null,null,null,null,null,null,null,null,null,null,null,null,null,{"$f":"IF((Tabla2[[#This Row],[Disponibilidad]]+Tabla2[[#This Row],[Integridad]]+Tabla2[[#This Row],[Confidencialidad ]]<=4),\"Baja\",IF(AND(Tabla2[[#This Row],[Disponibilidad]]+Tabla2[[#This Row],[Integridad]]+Tabla2[[#This Row],[Confidencialidad ]]>=5,Tabla2[[#This Row],[Disponibilidad]]+Tabla2[[#This Row],[Integridad]]+Tabla2[[#This Row],[Confidencialidad ]]<=7),\"Media\",IF(Tabla2[[#This Row],[Disponibilidad]]+Tabla2[[#This Row],[Integridad]]+Tabla2[[#This Row],[Confidencialidad ]]>=8,\"Alta\",\"error\")))","v":"Baja"}]
["",null,null,null,null,null,null,null,null,null,null,null,null,null,null,null,null,null,null,null,null,null,null,null,null,{"$f":"IF((Tabla2[[#This Row],[Disponibilidad]]+Tabla2[[#This Row],[Integridad]]+Tabla2[[#This Row],[Confidencialidad ]]<=4),\"Baja\",IF(AND(Tabla2[[#This Row],[Disponibilidad]]+Tabla2[[#This Row],[Integridad]]+Tabla2[[#This Row],[Confidencialidad ]]>=5,Tabla2[[#This Row],[Disponibilidad]]+Tabla2[[#This Row],[Integridad]]+Tabla2[[#This Row],[Confidencialidad ]]<=7),\"Media\",IF(Tabla2[[#This Row],[Disponibilidad]]+Tabla2[[#This Row],[Integridad]]+Tabla2[[#This Row],[Confidencialidad ]]>=8,\"Alta\",\"error\")))","v":"Baja"}]
["",null,null,null,null,null,null,null,null,null,null,null,null,null,null,null,null,null,null,null,null,null,null,null,null,{"$f":"IF((Tabla2[[#This Row],[Disponibilidad]]+Tabla2[[#This Row],[Integridad]]+Tabla2[[#This Row],[Confidencialidad ]]<=4),\"Baja\",IF(AND(Tabla2[[#This Row],[Disponibilidad]]+Tabla2[[#This Row],[Integridad]]+Tabla2[[#This Row],[Confidencialidad ]]>=5,Tabla2[[#This Row],[Disponibilidad]]+Tabla2[[#This Row],[Integridad]]+Tabla2[[#This Row],[Confidencialidad ]]<=7),\"Media\",IF(Tabla2[[#This Row],[Disponibilidad]]+Tabla2[[#This Row],[Integridad]]+Tabla2[[#This Row],[Confidencialidad ]]>=8,\"Alta\",\"error\")))","v":"Baja"}]
[{"$f":"IFERROR(IF(B979<>\"\",#REF!+1,\"\"),\"\")","v":""},null,null,null,null,null,null,null,null,null,null,null,null,null,null,null,null,null,null,null,null,null,null,null,null,{"$f":"IF((Tabla2[[#This Row],[Disponibilidad]]+Tabla2[[#This Row],[Integridad]]+Tabla2[[#This Row],[Confidencialidad ]]<=4),\"Baja\",IF(AND(Tabla2[[#This Row],[Disponibilidad]]+Tabla2[[#This Row],[Integridad]]+Tabla2[[#This Row],[Confidencialidad ]]>=5,Tabla2[[#This Row],[Disponibilidad]]+Tabla2[[#This Row],[Integridad]]+Tabla2[[#This Row],[Confidencialidad ]]<=7),\"Media\",IF(Tabla2[[#This Row],[Disponibilidad]]+Tabla2[[#This Row],[Integridad]]+Tabla2[[#This Row],[Confidencialidad ]]>=8,\"Alta\",\"error\")))","v":"Baja"}]
[{"$f":"IFERROR(IF(B980<>\"\",A979+1,\"\"),\"\")","v":""},null,null,null,null,null,null,null,null,null,null,null,null,null,null,null,null,null,null,null,null,null,null,null,null,{"$f":"IF((Tabla2[[#This Row],[Disponibilidad]]+Tabla2[[#This Row],[Integridad]]+Tabla2[[#This Row],[Confidencialidad ]]<=4),\"Baja\",IF(AND(Tabla2[[#This Row],[Disponibilidad]]+Tabla2[[#This Row],[Integridad]]+Tabla2[[#This Row],[Confidencialidad ]]>=5,Tabla2[[#This Row],[Disponibilidad]]+Tabla2[[#This Row],[Integridad]]+Tabla2[[#This Row],[Confidencialidad ]]<=7),\"Media\",IF(Tabla2[[#This Row],[Disponibilidad]]+Tabla2[[#This Row],[Integridad]]+Tabla2[[#This Row],[Confidencialidad ]]>=8,\"Alta\",\"error\")))","v":"Baja"}]
["",null,null,null,null,null,null,null,null,null,null,null,null,null,null,null,null,null,null,null,null,null,null,null,null,{"$f":"IF((Tabla2[[#This Row],[Disponibilidad]]+Tabla2[[#This Row],[Integridad]]+Tabla2[[#This Row],[Confidencialidad ]]<=4),\"Baja\",IF(AND(Tabla2[[#This Row],[Disponibilidad]]+Tabla2[[#This Row],[Integridad]]+Tabla2[[#This Row],[Confidencialidad ]]>=5,Tabla2[[#This Row],[Disponibilidad]]+Tabla2[[#This Row],[Integridad]]+Tabla2[[#This Row],[Confidencialidad ]]<=7),\"Media\",IF(Tabla2[[#This Row],[Disponibilidad]]+Tabla2[[#This Row],[Integridad]]+Tabla2[[#This Row],[Confidencialidad ]]>=8,\"Alta\",\"error\")))","v":"Baja"}]
["",null,null,null,null,null,null,null,null,null,null,null,null,null,null,null,null,null,null,null,null,null,null,null,null,{"$f":"IF((Tabla2[[#This Row],[Disponibilidad]]+Tabla2[[#This Row],[Integridad]]+Tabla2[[#This Row],[Confidencialidad ]]<=4),\"Baja\",IF(AND(Tabla2[[#This Row],[Disponibilidad]]+Tabla2[[#This Row],[Integridad]]+Tabla2[[#This Row],[Confidencialidad ]]>=5,Tabla2[[#This Row],[Disponibilidad]]+Tabla2[[#This Row],[Integridad]]+Tabla2[[#This Row],[Confidencialidad ]]<=7),\"Media\",IF(Tabla2[[#This Row],[Disponibilidad]]+Tabla2[[#This Row],[Integridad]]+Tabla2[[#This Row],[Confidencialidad ]]>=8,\"Alta\",\"error\")))","v":"Baja"}]
["",null,null,null,null,null,null,null,null,null,null,null,null,null,null,null,null,null,null,null,null,null,null,null,null,{"$f":"IF((Tabla2[[#This Row],[Disponibilidad]]+Tabla2[[#This Row],[Integridad]]+Tabla2[[#This Row],[Confidencialidad ]]<=4),\"Baja\",IF(AND(Tabla2[[#This Row],[Disponibilidad]]+Tabla2[[#This Row],[Integridad]]+Tabla2[[#This Row],[Confidencialidad ]]>=5,Tabla2[[#This Row],[Disponibilidad]]+Tabla2[[#This Row],[Integridad]]+Tabla2[[#This Row],[Confidencialidad ]]<=7),\"Media\",IF(Tabla2[[#This Row],[Disponibilidad]]+Tabla2[[#This Row],[Integridad]]+Tabla2[[#This Row],[Confidencialidad ]]>=8,\"Alta\",\"error\")))","v":"Baja"}]
["",null,null,null,null,null,null,null,null,null,null,null,null,null,null,null,null,null,null,null,null,null,null,null,null,{"$f":"IF((Tabla2[[#This Row],[Disponibilidad]]+Tabla2[[#This Row],[Integridad]]+Tabla2[[#This Row],[Confidencialidad ]]<=4),\"Baja\",IF(AND(Tabla2[[#This Row],[Disponibilidad]]+Tabla2[[#This Row],[Integridad]]+Tabla2[[#This Row],[Confidencialidad ]]>=5,Tabla2[[#This Row],[Disponibilidad]]+Tabla2[[#This Row],[Integridad]]+Tabla2[[#This Row],[Confidencialidad ]]<=7),\"Media\",IF(Tabla2[[#This Row],[Disponibilidad]]+Tabla2[[#This Row],[Integridad]]+Tabla2[[#This Row],[Confidencialidad ]]>=8,\"Alta\",\"error\")))","v":"Baja"}]
["",null,null,null,null,null,null,null,null,null,null,null,null,null,null,null,null,null,null,null,null,null,null,null,null,{"$f":"IF((Tabla2[[#This Row],[Disponibilidad]]+Tabla2[[#This Row],[Integridad]]+Tabla2[[#This Row],[Confidencialidad ]]<=4),\"Baja\",IF(AND(Tabla2[[#This Row],[Disponibilidad]]+Tabla2[[#This Row],[Integridad]]+Tabla2[[#This Row],[Confidencialidad ]]>=5,Tabla2[[#This Row],[Disponibilidad]]+Tabla2[[#This Row],[Integridad]]+Tabla2[[#This Row],[Confidencialidad ]]<=7),\"Media\",IF(Tabla2[[#This Row],[Disponibilidad]]+Tabla2[[#This Row],[Integridad]]+Tabla2[[#This Row],[Confidencialidad ]]>=8,\"Alta\",\"error\")))","v":"Baja"}]
["",null,null,null,null,null,null,null,null,null,null,null,null,null,null,null,null,null,null,null,null,null,null,null,null,{"$f":"IF((Tabla2[[#This Row],[Disponibilidad]]+Tabla2[[#This Row],[Integridad]]+Tabla2[[#This Row],[Confidencialidad ]]<=4),\"Baja\",IF(AND(Tabla2[[#This Row],[Disponibilidad]]+Tabla2[[#This Row],[Integridad]]+Tabla2[[#This Row],[Confidencialidad ]]>=5,Tabla2[[#This Row],[Disponibilidad]]+Tabla2[[#This Row],[Integridad]]+Tabla2[[#This Row],[Confidencialidad ]]<=7),\"Media\",IF(Tabla2[[#This Row],[Disponibilidad]]+Tabla2[[#This Row],[Integridad]]+Tabla2[[#This Row],[Confidencialidad ]]>=8,\"Alta\",\"error\")))","v":"Baja"}]
["Antes de imprimir este documento… piense en el medio ambiente!  \nCualquier copia impresa de este documento se considera como COPIA NO CONTROLADA."]

{"sheet":"DATOS","index":2,"n_rows":113,"n_cols":9,"rows_kept":113,"cut":false,"hidden":true,"merged":[]}
["NOMBRE DEL PROCESO","TIPO DEPENDENCIA","DEPENDENCIA SDG","DEPENDENCIA REGIONALES","FÍSICA","ELECTRÓNICA",null,"CONTROLES DE ACCESO ","CONTROLES MONITOREO"]
["Adquisición de Bienes y Servicios","SEDE DE LA DIRECCIÓN GENERAL","Dirección Administrativa","Centro Zonal","Archivo de Apoyo","Cloud",null,"Acceso biométrico, Aviso solo personal autorizado y Bitácora de acceso","Cámaras de vigilancia"]
["Comunicación Estratégica","CENTRO COMERCIAL METRÓPOLIS","Dirección de Abastecimiento ","Dirección Regional","Archivo de Gestión","Equipos de Computo",null,"Acceso biométrico, Aviso solo personal autorizado, cámara de seguridad y Bitácora de acceso","Cámaras de vigilancia y Sensor de Humedad"]
["Coordinación y Articulación del SNBF y Agentes","Sede Regional","Dirección de Contratación","Grupo Administrativo","Bodega Central","File Server",null,"Aviso solo personal autorizado ","Cámaras de vigilancia y Sensor de Humo"]
["Direccionamiento Estratégico","Centro Zonal","Dirección de Familias, Comunidades y Pueblos","Grupo Adminstrativo y de Talento Humano","DataCenter","Medio Extraible - USB",null,"Bitácora de acceso","Cámaras de vigilancia y Sensor de Temperatura"]
["Evaluación Independiente","CAIVAS","Dirección de Infancias y Adolescencias","Grupo Contratación","Centro de Cableado","One Drive",null,"Bitácora de acceso y Aviso solo personal autorizado","Cámaras de vigilancia, Sensor de Humo, Sensor de Temperatura y Sensor de Humedad"]
["Gestión de la Tecnología e Información","CESPA","Dirección de Nutrición","Grupo Financiero","Centro Zonal","Portal WEB",null,"Clave digital y Bitácora de acceso","Cámaras de vigilancia, Sensor de Intrusión, Sensor de Humo, Sensor de Temperatura y Sensor de Humedad"]
["Gestión del Talento Humano","CAVIF","Dirección de Planeación y Control de Gestión","Grupo Gestión de Apoyo","Oficinas","SharePoint",null,"Clave digital, Aviso solo personal autorizado y Bitácora de acceso","No se cuenta con control de monitoreo"]
["Gestión Financiera","SRPA","Dirección de Primera Infancia","Grupo Gestión Misional","Puesto de trabajo","Sistema de Información",null,"Clave digital, Aviso solo personal autorizado, cámara de seguridad y Bitácora de acceso","Sensor de Humedad"]
["Gestión Jurídica","Unidades Locales","Dirección de Protección Especial","Grupo Jurídico","Areas Seguras","Servidor",null,"Llave para ingreso","Sensor de Humo"]
["Inspección Vigilancia y Control","Unidades Móviles ","Dirección de Relación con la Ciudadanía","Grupo Jurídico y Contractual","No Aplica","Intranet",null,"Llave para ingreso y Aviso solo personal autorizado ","Sensor de Humo y Sensor de Humedad"]
["Mejora e Innovación",null,"Dirección de Talento Humano","Grupo Planeación y Tecnología",null,"Correo Electrónico",null,"Llave para ingreso y Bitácora de acceso","Sensor de Humo y Sensor de Temperatura"]
["Monitoreo y Seguimiento a la Gestión",null,"Dirección de Tecnologías de la Información","Grupo Prevención",null,"Medios Tecnológicos",null,"Llave para ingreso, Aviso solo personal autorizado  y Bitácora de acceso","Sensor de Intrusión"]
["Promoción y Prevención","TIPO DE ACTIVO","Dirección Financiera","Grupo Protección Especial y Autoridades Administrativas","TIPO DE DOCUMENTO","DEVOPS",null,"Llave para ingreso, Aviso solo personal autorizado, cámara de seguridad y Bitácora de acceso","Sensor de Temperatura"]
["Protección","INFORMACIÓN","Dirección General","Grupo Recaudo","FÍSICO","No Aplica",null,"No se cuenta con control de acceso","Sensor de Temperatura y Sensor de Humedad"]
["Relación con el Ciudadano","FÍSICO","Dirección Sistema Nacional de Bienestar Familiar ","Grupo Responsabilidad Penal","ELECTRÓNICO",null,null,"Tarjeta de acceso y Bitácora de acceso","El control no se encuentra en esta lista, éste se registra en Observaciones"]
["Servicios Administrativos","ELECTRÓNICO","Oficina Asesora de Comunicaciones","Grupo Talento Humano","FÍSICO-ELECTRÓNICO",null,null,"Tarjeta de acceso, Aviso solo personal autorizado y Bitácora de acceso"]
[null,"FÍSICO-ELECTRÓNICO","Oficina de Control Disciplinario Interno",null,"NO APLICA",null,null,"Tarjeta de acceso, Aviso solo personal autorizado, cámara de seguridad y Bitácora de acceso"]
[null,"SOFTWARE","Oficina de Control Interno",null,null,null,null,"Tarjeta de proximidad, Aviso solo personal autorizado, cámara de seguridad y Bitácora de acceso"]
[null,"HARDWARE","Oficina de Cooperación",null,"TIPO DE ACTIVO",null,null,"El control no se encuentra en esta lista, éste se registra en Observaciones"]
["REGIONALES","SOPORTE","Oficina de Gestión Regional",null,"INFORMACIÓN"]
["AMAZONAS","RECURSO HUMANO -P","Oficina de Inspección, Vigilancia y Control y Calidad de Servicios",null,"HARDWARE"]
["ANTIOQUIA","RECURSO HUMANO -C","Oficina Jurídica",null,"SOFTWARE"]
["ARAUCA","SERVICIO","Secretaría General",null,"SERVICIO"]
["ATLÁNTICO","INTANGIBLE","Subdirección de Adopciones",null,"RECURSO HUMANO"]
["BOGOTÁ","RECURSO HUMANO","Subdirección de Articulación Nacional del SNBF",null,"INSTALACIONES"]
["BOLÍVAR","EQUIPOS","Subdirección de Articulación Territorial del SNBF",null,"INFRAESTRUCTURA"]
["BOYACÁ","DOCUMENTAL","Subdirección de Atención en Alimentación y Nutrición ",null,"INTANGIBLE"]
["CALDAS","HERRAMIENTAS PARA LA OPERACIÓN (S1)","Subdirección de Atención Integral a Niños, Niñas y Adolescentes"]
["CAQUETÁ","ALMACENAMIENTO","Subdirección de Atención Integral Familiar Comunitaria"]
["CASANARE","INFRAESTRUCTURA","Subdirección de Atención Integral Interinstitucional"]
["CAUCA","INSTALACIONES","Subdirección de Atención Integral Propia e Intercultural"]
["CESAR","DOCUMENTAL-S1","Subdirección de Autoridades Adminstrativas"]
["CHOCÓ","NO APLICA","Subdirección de Familias y  Comunidades"]
["CÓRDOBA",null,"Subdirección de Gestión Estratégica para el Derecho Humano a la alimentación "]
["CUNDINAMARCA",null,"Subdirección de Mejoramiento Organizacional "]
["GUAINÍA","SÍ NO NO APLICA","Subdirección de Monitoreo y Evaluación "]
["GUAVIARE","SÍ","Subdirección de Prevención de Vulneraciones a Niños, Niñas y Adolescentes"]
["HUILA","NO","Subdirección de Programación "]
["LA GUAJIRA","NO APLICA","Subdirección de Pueblos étnicos y Campesinos"]
["MAGDALENA",null,"Subdirección de Restablecimiento de Derechos"]
["META","CLASIFICACIÓN DATOS PERSONALES","Subdirección de Restablecimiento Penal"]
["NARIÑO","PÚBLICO","Subdirección General"]
["NORTE DE SANTANDER","PRIVADO"]
["PUTUMAYO","SEMIPRIVADO"]
["QUINDÍO","SENSIBLE"]
["RISARALDA","RESERVADO","IDIOMA"]
["SAN ANDRÉS","CLASIFICADO","ESPAÑOL"]
["SANTANDER","TODO APLICA","INGLÉS"]
["SEDE DE LA DIRECCIÓN GENERAL","NO APLICA","WAYUUNAIKI"]
["SUCRE",null,"TODO APLICA"]
["TOLIMA","FORMATO","NO APLICA"]
["VALLE","HOJA DE CÁLCULO"]
["VAUPÉS","IMAGEN"]
["VICHADA","AUDIO","PROPIETARIO DEL ACTIVO","CUSTODIO DEL ACTIVO"]
[null,"VIDEO","Coordinador(a) Centro Zonal","Coordinador(a) Centro Zonal"]
[null,"DOCUMENTO DE TEXTO","Coordinador(a) Grupo Administrativo","Coordinador(a) Grupo Administrativo"]
[null,"BASE DE DATOS","Coordinador(a) Grupo Administrativo y de Talento Humano","Coordinador(a) Grupo Administrativo y de Talento Humano"]
[null,"SOFTWARE","Coordinador(a) Grupo Contratación","Coordinador(a) Grupo Contratación"]
[null,"WEB","Coordinador(a) Grupo Financiero","Coordinador(a) Grupo Financiero"]
[null,"NO APLICA","Coordinador(a) Grupo Gestión de Apoyo","Coordinador(a) Grupo Gestión de Apoyo"]
[null,"TODO APLICA","Coordinador(a) Grupo Gestión Misional","Coordinador(a) Grupo Gestión Misional"]
[null,null,"Coordinador(a) Grupo Jurídico","Coordinador(a) Grupo Jurídico"]
[null,"CLASIFICACIÓN ICBF","Coordinador(a) Grupo Jurídico y Contractual","Coordinador(a) Grupo Jurídico y Contractual"]
[null,"Pública","Coordinador(a) Grupo Planeación y Tecnología","Coordinador(a) Grupo Planeación y Tecnología"]
[null,"Clasificada","Coordinador(a) Grupo Prevención","Coordinador(a) Grupo Prevención"]
[null,"Reservada","Coordinador(a) Grupo Protección Especial y Autoridades Administrativas","Coordinador(a) Grupo Protección Especial y Autoridades Administrativas"]
[null,"Todo Aplica","Coordinador(a) Grupo Recaudo","Coordinador(a) Grupo Recaudo"]
[null,"No Aplica","Coordinador(a) Grupo Responsabilidad Penal","Coordinador(a) Grupo Responsabilidad Penal"]
[null,null,"Coordinador(a) Grupo Talento Humano","Coordinador(a) Grupo Talento Humano"]
[null,null,"Director(a) Administrativa","Director(a) Administrativa"]
[null,null,"Director(a) de Abastecimiento ","Director(a) de Abastecimiento "]
[null,null,"Director(a) de Contratación","Director(a) de Contratación"]
[null,null,"Director(a) de Familias, Comunidades y Pueblos","Director(a) de Familias, Comunidades y Pueblos"]
[null,null,"Director(a) de Infancias y Adolescencias","Director(a) de Infancias y Adolescencias"]
[null,null,"Director(a) de Nutrición","Director(a) de Nutrición"]
[null,null,"Director(a) de Planeación y Control de Gestión","Director(a) de Planeación y Control de Gestión"]
[null,null,"Director(a) de Primera Infancia","Director(a) de Primera Infancia"]
[null,null,"Director(a) de Protección Especial","Director(a) de Protección Especial"]
[null,null,"Director(a) de Relación con la Ciudadanía","Director(a) de Relación con la Ciudadanía"]
[null,null,"Director(a) de Talento Humano","Director(a) de Talento Humano"]
[null,null,"Director(a) de Tecnologías de la Información","Director(a) de Tecnologías de la Información"]
[null,null,"Director(a) Financiera","Director(a) Financiera"]
[null,null,"Director(a) General","Director(a) General"]
[null,null,"Director(a) Regional","Director(a) Regional"]
[null,null,"Director(a) Sistema Nacional de Bienestar Familiar ","Director(a) Sistema Nacional de Bienestar Familiar "]
[null,null,"Jefe Oficina Asesora de Comunicaciones","Jefe Oficina Asesora de Comunicaciones"]
[null,null,"Jefe Oficina de Control Disciplinario Interno","Jefe Oficina de Control Disciplinario Interno"]
[null,null,"Jefe Oficina de Control Interno","Jefe Oficina de Control Interno"]
[null,null,"Jefe Oficina de Cooperación","Jefe Oficina de Cooperación"]
[null,null,"Jefe Oficina de Gestión Regional","Jefe Oficina de Gestión Regional"]
[null,null,"Jefe Oficina de Inspección, Vigilancia y Control y Calidad de Servicios","Jefe Oficina de Inspección, Vigilancia y Control y Calidad de Servicios"]
[null,null,"Jefe Oficina Jurídica","Jefe Oficina Jurídica"]
[null,null,"Secretarío(a) General","Secretarío(a) General"]
[null,null,"Subdirector(a) de Adopciones","Subdirector(a) de Adopciones"]
[null,null,"Subdirector(a) de Articulación Nacional del SNBF","Subdirector(a) de Articulación Nacional del SNBF"]
[null,null,"Subdirector(a) de Articulación Territorial del SNBF","Subdirector(a) de Articulación Territorial del SNBF"]
[null,null,"Subdirector(a) de Atención en Alimentación y Nutrición ","Subdirector(a) de Atención en Alimentación y Nutrición "]
[null,null,"Subdirector(a) de Atención Integral a Niños, Niñas y Adolescentes","Subdirector(a) de Atención Integral a Niños, Niñas y Adolescentes"]
[null,null,"Subdirector(a) de Atención Integral Familiar Comunitaria","Subdirector(a) de Atención Integral Familiar Comunitaria"]
[null,null,"Subdirector(a) de Atención Integral Interinstitucional","Subdirector(a) de Atención Integral Interinstitucional"]
[null,null,"Subdirector(a) de Atención Integral Propia e Intercultural","Subdirector(a) de Atención Integral Propia e Intercultural"]
[null,null,"Subdirector(a) de Autoridades Administrativas","Subdirector(a) de Autoridades Administrativas"]
[null,null,"Subdirector(a) de Familias y  Comunidades","Subdirector(a) de Familias y  Comunidades"]
[null,null,"Subdirector(a) de Gestión Estratégica para el Derecho Humano a la alimentación ","Subdirector(a) de Gestión Estratégica para el Derecho Humano a la alimentación "]
[null,null,"Subdirector(a) de Mejoramiento Organizacional","Subdirector(a) de Mejoramiento Organizacional"]
[null,null,"Subdirector(a) de Monitoreo y Evaluación ","Subdirector(a) de Monitoreo y Evaluación "]
[null,null,"Subdirector(a) de Prevención de Vulneraciones a Niños, Niñas y Adolescentes","Subdirector(a) de Prevención de Vulneraciones a Niños, Niñas y Adolescentes"]
[null,null,"Subdirector(a) de Programación","Subdirector(a) de Programación"]
[null,null,"Subdirector(a) de Pueblos étnicos y Campesinos","Subdirector(a) de Pueblos étnicos y Campesinos"]
[null,null,"Subdirector(a) de Restablecimiento de Derechos","Subdirector(a) de Restablecimiento de Derechos"]
[null,null,"Subdirector(a) de Restablecimiento Penal","Subdirector(a) de Restablecimiento Penal"]
[null,null,"Subdirector(a) General","Subdirector(a) General"]