{"text_format":"1","workbook":"xlsx","n_sheets":5,"sheets":["Instructivo","Formato","Matriz solicitudes","Listas","Datos"],"not_rendered":{"charts":0,"images":4,"macros":1,"external_links":0,"defined_names":104,"comments":0,"pivot_tables":0},"unopened":[],"bounds":{"document_bytes":16777216,"sheet_cells":100000,"rows_first":2000,"rows_last":500,"rows_between":2000,"halvings":0,"cell_chars":16384,"cell_head_chars":4096},"cells_cut":0,"cells_raw":0,"read":"whole","date_system":"1900"}

{"sheet":"Instructivo","index":0,"n_rows":25,"n_cols":5,"rows_kept":25,"cut":false,"hidden":false,"merged":[[21,2,21,4],[22,2,22,4],[24,1,24,4],[1,1,3,1],[1,2,3,2],[3,3,3,4],[8,2,9,3],[14,1,14,4],[15,2,15,4],[16,2,16,4],[17,1,17,4],[18,2,18,4],[19,2,19,4],[20,2,20,4]]}
[]
[null,null,"PROCESO\nGESTIÓN DE TECNOLOGÍAS E INFORMACIÓN \n\nFORMATO DE SOLICITUD DE SERVICIOS DE TECNOLOGÍA","F1.P2.GTI","2026-05-07"]
[null,null,null,"Versión 18","Página 1 de 3"]
[null,null,null,"Clasificación de la información: \nClasificada"]
[]
[]
[]
[]
[null,null,"Señor usuario si le aparece este cuadro de advertencia por favor haga clic en la opción \"Habilitar contenido\""]
[]
[]
[]
[]
[]
[null,"Instructivo para diligenciar el Formato"]
[null,"Sección","Definición"]
[null,"Generalidad:","\nPara iniciar con el diligenciamiento del formato debe seleccionar la opción que va a tramitar \nen \"ELIJA AQUÍ EL TIPO DE SOLICITUD\" posteriormente diligencie los campos resaltados.\n                            \n\n                                                                                                                                               Al ingresar en la opción servicios adicionales saldrán más servicios.\n\n\n\n\n\n\n"]
[null,"Diligenciamiento de algunos campos para tener en cuenta"]
[null,"Proceso en cuentas de red:\n\nCreación cuenta de red y correo\nActivación de cuentas por renovación de contrato\nActivación de cuentas por vacaciones / licencias\nDesactivación de cuentas por finalización de contrato\nDesactivación de cuentas por vacaciones / licencias","\n\nPara el proceso de solicitud en cuentas de red es necesario ingresar los datos del usuario en cada una de las opciones que se seleccione (creación, activación, desactivación), las cuales automáticamente aparecerán sombreados, esos son los campos obligatorios y con los cuales se brindará trámite a la solicitud."]
[null,"Proceso de Listas de distribución:\n\nCrear listas de distribución\nActualizar listas de distribución\nPermiso de envío a listas\nActualizar información","\nEn los casos de listas de distribución se deben diligenciar los campos de información del usuario obligatoriamente los cuales se pondrán sombreados para identificarlos.\n\n-Crear lista de distribución ingresar datos sombreados (Escriba el nombre de la lista, escriba el correo del administrador de la lista) \n-Actualizar listas de distribución (Escriba el nombre de la Lista, en caso de requerir modificar el administrador, indique el nuevo administrador)\n-Permisos sobre envío a listas, debe ingresar los datos sombreados (Escriba el Nombre de la Lista) \n-Actualizar información, ingresar datos del usuario."]
{"$rows_left_out":6}
{"sheet":"Formato","index":1,"n_rows":120,"n_cols":39,"rows_kept":120,"cut":false,"hidden":false,"merged":[[8,1,8,12],[16,4,16,12],[17,1,17,12],[119,1,119,12],[10,1,10,3],[10,4,10,12],[12,1,12,3],[12,4,12,12],[14,1,14,3],[14,4,14,12],[16,1,16,3],[4,4,4,12],[5,1,5,3],[5,4,5,6],[5,7,5,9],[6,1,6,3],[6,4,6,6],[6,7,6,9],[0,1,0,12],[1,1,3,2],[1,3,3,19],[1,21,1,22],[2,21,2,22],[3,20,3,22]]}
[]
[null,null,null,"PROCESO\nGESTIÓN DE TECNOLOGÍAS E INFORMACIÓN \n\nFORMATO DE SOLICITUD DE SERVICIOS DE TECNOLOGÍA",null,null,null,null,null,null,null,null,null,null,null,null,null,null,null,null,"F1.P2.GTI","2026-05-07"]
[null,null,null,null,null,null,null,null,null,null,null,null,null,null,null,null,null,null,null,null,"Versión 18","Página 2  de 3"]
[null,null,null,null,null,null,null,null,null,null,null,null,null,null,null,null,null,null,null,null,"Clasificación de la información: \nClasificada"]
[]
[null,"ELIJA AQUÍ EL TIPO DE SOLICITUD",null,null,{"$f":"IFERROR(IF($B$7=\"Servicios adicionales\",\"ELIJA EL SERVICIO REQUERIDO\",IF($B$7=\"Actualizar listas de distribución\",\"ELIJA EL SERVICIO REQUERIDO\",\" \")),\"\")","v":" "},null,null,{"$f":"IFERROR(IF($E$7=\"Extensión telefónica (VoIP)\",\"ELIJA UNA OPCIÓN\",IF($E$7=\"Cambio de nombre (VoIP)\",\"ELIJA UNA OPCIÓN\",IF($E$7=\"VPN\",\"ELIJA UNA OPCIÓN\",IF($E$7=\"Permisos internet\",\"ELIJA UNA OPCIÓN\",IF($E$7=\"Copia de información (Backup)\",\"ELIJA UNA OPCIÓN\",IF($E$7=\"Borrado de información\",\"ELIJA UNA OPCIÓN\",IF($E$7=\"Cuenta genérica\",\"ELIJA UNA OPCIÓN\",\" \"))))))),\" \")","v":" "}]
[null,null,null,null,null,null,null,null,null,null,null,null,null,null,null,null,null,null,null,null,null,null,null,null,null,null,null,null,null,null,null,null,null,null,null,null,{"$f":"IFERROR(VLOOKUP(B7,Listas!AB1:AD26,2,0),\"\")","v":""},{"$f":"IFERROR(VLOOKUP(E7,Listas!Y2:AA20,2,0),\"\")","v":""}]
[]
[]
[]
[null,{"$f":"IFERROR(IF($B$7=\"Permisos SharePoint o (NAS/Fileserver)\",\"Justificación:\",IF($E$7=\"Permisos sobre buzón\",\"Justificación\",IF($B$7=\"Actualizar listas de distribución\",\"Nombre de la Lista\",IF($B$7=\"Permiso de envío a listas\",\"Nombre de la Lista\",IF($E$7=\"VPN\",\"Justificación\",IF($E$7=\"Cuenta genérica\",\"Nombre de la Cuenta Genérica\",IF($E$7=\"Unidad externa / periféricos\",\"Justificación\",IF($E$7=\"Información almacenada en el equipo\",\"Justificación\",IF($E$7=\"Información almacenada en el equipo y correo\",\"Justificación\",IF($E$7=\"Cuenta convocatoria pública\",\"Justificación\",IF($E$7=\"Buzón compartido\",\"Nombre del Buzón\",IF($E$7=\"Cambio de Licencia Office\",\"Justificación:\",\"\")))))))))))),\"\")","v":""}]
[]
[null,{"$f":"IFERROR(IF($B$7=\"Crear listas de distribución\",\"Escriba el correo del administrador de la lista de Distribución:\",IF($B$7=\"Actualizar listas de distribución\",\"En caso de requerir modificar el administrador, indique el nuevo administrador\",IF($B$7=\"Creación de carpeta NAS / fileserver\",\"Escriba el nombre de la carpeta\",IF($B$7=\"Permisos sobre carpeta NAS / fileserver\",\"Escriba el nombre de la carpeta\",IF($B$7=\"Eliminación de carpeta NAS / fileserver\",\"Escriba el nombre de la carpeta\",IF($E$7=\"Cuenta genérica\",\"Correo del responsable a cargo de la cuenta\",IF($E$7=\"Buzón compartido\",\"Responsable del buzón\",IF($E$7=\"Permisos sobre buzón\",\"Responsable actual del buzón\",IF($E$7=\"Cuenta convocatoria pública\",\"Nombre del proceso\",IF($E$7=\"Instalación software\",\"Justificación\",IF($E$7=\"Información almacenada en el equipo\",\"Observaciones y/o información adicional\",IF($E$7=\"Información almacenada en el equipo y correo\",\"Observaciones y/o información adicional\",IF($H$7=\"Permitir acceso\",\"Justificación\",IF($H$7=\"Restringir acceso\",\"Justificación\",IF($E$7=\"Revision Requisitos guia BYOD\",\"Justificación\",IF($B$7=\"Permisos SharePoint o (NAS/Fileserver)\",\"Nuevo administrador (Solo si aplica):\",\" \")))))))))))))))),\"\")","v":" "}]
[]
[null,{"$f":"IFERROR(IF($B$7=\"Creación de carpeta NAS / fileserver\",\"Escriba el nombre del administrador de la carpeta\",IF($E$7=\"Cuenta convocatoria pública\",\"Fecha de caducidad del buzón\",IF($E$7=\"Cuenta genérica\",\"Justificación de la solicitud\",IF($E$7=\"Permisos sobre buzón\",\"Nuevo responsable del buzón (Solo si Aplica)\",IF($H$7=\"Permitir acceso\",\"Indique el tiempo requerido para el servicio solicitado\",\" \"))))),\" \")","v":" "}]
[]
[null,{"$f":"IFERROR(IF($E$7=\"Cuenta convocatoria pública\",\"Nombre del responsable del buzón\",IF($E$7=\"Cuenta genérica\",\"Fecha de caducidad de la cuenta Genérica\",\" \")),\" \")","v":" "}]
[null,{"$f":"IFERROR(IF($B$7=\"Crear listas de distribución\",\"Diligencie los integrantes de la lista\",IF($E$7=\"Buzón compartido\",\"Diligencie los datos de los Integrantes que tendrán acceso a buzón\",IF($E$7=\"Permisos sobre buzón\",\"Diligencie los datos de los integrantes que tendrán acceso a buzón\",IF($E$7=\"Cuenta convocatoria pública\",\"Diligencie los usuarios que tendrán acceso a la cuenta\",IF($E$7=\"Cuenta genérica\",\"\",IF($E$7=\"Permisos internet\",\"Diligencie en las celdas sombreadas los datos de las personas que requieren el servicio\",IF($E$7=\"VPN\",\"Diligencie los datos sombreados y los datos de las personas que requieren el servicio\",IF($B$7=\"Creación de carpeta NAS / fileserver\",\"Diligencie en las celdas sombreadas los datos de las personas que tendrán acceso a la carpeta\",IF($B$7=\"Permisos sobre carpeta NAS / fileserver\",\"Diligencie en las celdas sombreadas los datos de las personas que tendrán permisos a la carpeta\",IF($B$7=\"Permiso de envío a listas\",\"Diligencie en las celdas sombreadas los datos de las personas que tendrán permisos de envío\",IF($B$7=\"Eliminación SharePoint o (NAS/Fileserver)\",\"Diligencie las celdas sombreadas (Ver hasta columna W)\",\"Diligencie las celdas sombreadas (Ver hasta columna W)\"))))))))))),\" \")","v":"Diligencie las celdas sombreadas (Ver hasta columna W)"}]
[null,"Documento de Identidad",{"$f":"IF($B$7=\"Creación SharePoint o (NAS/Fileserver)\",\"Nombre Administrador\",\"Nombres\")","v":"Nombres"},{"$f":"IF($B$7=\"Creación SharePoint o (NAS/Fileserver)\",\"Apellidos Administrador\",\"Apellidos\")","v":"Apellidos"},{"$f":"IF($B$7=\"Permisos SharePoint o (NAS/Fileserver)\",\"Tipo de permiso (Lectura - Escritura - Modificación)\",IF($B$7=\"Creación SharePoint o (NAS/Fileserver)\",\"Nombre del sitio\",IF($B$7=\"Eliminación SharePoint o (NAS/Fileserver)\",\"Nombre del sitio a eliminar\",IF($B$7=\"Creación cuenta de red y correo\",\"Extensión\",\"Usuario de Dominio\"))))","v":"Usuario de Dominio"},{"$f":"IFERROR(IF($E$7=\"Actualizar extensión en tarjeta de contacto\",\"\",_xludf._xlfn.IFS($B$7=\"Actualizar listas de distribución\",\"Tipo Actualización\",$B$7=\"Creación de carpeta NAS / fileserver\",\"Tipo de Permiso (Lectura, Escritura o Modificación)\",$B$7=\"Permisos sobre carpeta NAS / fileserver\",\"Tipo de Permiso (Lectura, Escritura o Modificación)\",$B$7=\"Otros Servicios\",\"Observaciones\")),\"\")&IF($B$7=\"Crear listas de distribución\",\"Nombre de Lista de Distribución\",IF($B$7=\"Desactivación de cuentas por vacaciones / licencias\",\"Fecha de desactivación\",IF($B$7=\"Permisos SharePoint o (NAS/Fileserver)\",\"Ruta de SharePoint o (NAS/FileServer)\",IF($E$7=\"Buzón compartido\",\"Agregar / Retirar del Buzón\",IF($B$7=\"Actualizar listas de distribución\",\"Agregar / Retirar de Lista\",IF($B$7=\"Creación cuenta de red y correo\",\"Fecha inicio de vinculación\",\"Extensión\"))))))","v":"Extensión"},"Vinculación","Tipo Vinculación / Entidad","Cargo",{"$f":"IFERROR(IF($B$7=\"Copia de información (Backup)\",\"Fecha Requerida Backup\",IF($B$7=\"Desactivación de cuentas por vacaciones / licencias\",\"Fecha de desactivación\",IF($B$7=\"Desactivación de cuentas por finalización de contrato\",\"Fecha de desactivación\",\"Fecha Fin Contrato\"))),\"\")","v":"Fecha Fin Contrato"},"Dirección General o Regional","Dirección General o Regional, Subdirección General o Secretaría General","Dirección, Oficina, Centro Zonal, o Grupo a nivel de Regional ","Tipo de Elemento","Serial de Equipo","Placa (Seven)","Observaciones","Genero","Computador","VPN","Extension Telefónica","Clave Telefónica","Permisos de Internet",null,null,null,null,null,null,null,null,null,null,null,null,null,null,"Regional_DA"]
[null,null,null,null,null,null,null,null,null,null,null,null,null,null,null,null,null,null,null,null,null,null,null,null,{"$f":"IFERROR(VLOOKUP(G20,Listas!$L$2:$M$42,2,0),\"\")","v":""},null,null,null,null,null,null,null,null,null,null,null,{"$f":"IFERROR(VLOOKUP(G20,Listas!#REF!,2,0),\"\")","v":""},{"$f":"IFERROR(VLOOKUP(#REF!,Listas!$H$2:$I$35,2,0),\"\")","v":""},{"$f":"IFERROR(VLOOKUP(AK20,Listas!$L$2:$M$42,2,0),\"\")","v":""}]
{"$rows_left_out":101}
{"sheet":"Matriz solicitudes","index":2,"n_rows":44,"n_cols":5,"rows_kept":44,"cut":false,"hidden":false,"merged":[[31,1,31,4],[27,4,28,4],[29,4,30,4],[26,1,26,4],[27,2,27,3],[28,2,28,3],[29,2,29,3],[30,2,30,3],[17,2,17,3],[18,2,18,3],[20,1,20,4],[21,2,21,3],[17,4,19,4],[21,4,25,4],[22,2,22,3],[23,2,23,3],[24,2,24,3],[25,2,25,3],[19,2,19,3],[12,1,12,4],[13,2,13,3],[15,2,15,3],[16,1,16,4],[13,4,15,4],[14,2,14,3],[7,2,7,3],[8,2,8,3],[9,2,9,3],[10,2,10,3],[0,1,2,1],[0,2,2,2],[2,3,2,4],[4,2,4,3],[5,1,5,4],[6,2,6,3],[6,4,11,4],[11,2,11,3],[43,1,43,12],[32,2,32,3],[33,2,33,3],[34,2,34,3],[36,2,36,3],[35,2,35,3],[40,2,40,3],[37,2,37,3],[38,2,38,3],[39,2,39,3],[41,2,41,3]]}
[null,null,"PROCESO\n GESTIÓN DE TECNOLOGÍAS E INFORMACIÓN \n\nFORMATO DE SOLICITUD DE SERVICIOS DE TECNOLOGÍA","F1.P2.GTI","2026-05-07"]
[null,null,null,"Versión 18","Página 3 de 3"]
[null,null,null,"Clasificación de la información: \nClasificada"]
[]
[null,"Solicitudes","Descripción ",null,"Quien puede realizar la solicitud"]
[null,"Cuentas de Red"]
[null,"Creación cuenta de red y correo","Cuando el usuario es nuevo, ingresa a laborar en el ICBF.",null,"Solicitud debe ser realizada por el G58, Director(a), Subdirector(a) o Jefe de Oficina o Coordinador(a). "]
[null,"Actualizar información","Actualizar información de funcionarios (área, ubicación, cargo etc.)."]
[null,"Activación de cuentas por renovación de contrato","Los contratistas de ICBF cuentan con fecha fin de contrato, la cuenta se desactiva por tanto si renuevan contrato se solicita activación de la cuenta."]
[null,"Activación de cuentas por vacaciones / licencias","Los funcionarios al tomar su periodo de vacaciones o tener una licencia, la cuenta se desactiva por solicitud del área de Gestión Humana, por tanto al volver se debe solicitar activación."]
[null,"Desactivación de cuentas por finalización de contrato","Cuando se finaliza contrato de funcionario ICBF se solicita desactivar cuenta de red por parte de G58."]
[null,"Desactivación de cuentas por vacaciones / licencias","Los funcionarios al tomar su periodo de vacaciones o tener una licencia, se solicita desactivar por parte del área de Gestión Humana."]
[null,"Listas de distribución"]
[null,"Crear listas de distribución","Se solicita para envío masivo de correos a lista de funcionarios específicos. Se crean listas con mínimo 30 colaboradores.",null,"Solicitud debe ser realizada por el G58, Director(a), Subdirector(a), Jefe de Oficina,  por el Ingeniero Regional o Coordinador(a) ."]
[null,"Actualizar listas de distribución","En el momento que se necesita retirar o agregar un funcionario a la lista."]
[null,"Permisos listas de distribución","Permiso para el envío de correo a una lista especifica."]
[null,"Carpetas SharePoint"]
[null,"Creación de sitio SharePoint","Se solicita creación de sitio cuando se tiene la necesidad de almacenar y compartir la información con otros funcionarios de ICBF.",null," Solicitud debe ser realizada por el Director(a), Subdirector(a), Jefe de Oficina,  por el ingeniero regional o o Coordinador(a)."]
[null,"Eliminación de sitio SharePoint","En caso de no utilizar o ya no ser necesaria la carpeta se solicita eliminar."]
[null,"Consulta NAS / FileServer","Consultar repositorio Antiguo NAS/FileServer"]
{"$rows_left_out":25}
{"sheet":"Listas","index":3,"n_rows":495,"n_cols":32,"rows_kept":495,"cut":false,"hidden":true,"merged":[]}
["StateID","OfficeID","GroupID","Regional","Area","Largo","Regional","Sedes","Regional",null,null,null,null,"Cargos","Planta",null,null,null,"Servicio","Carpeta","Equipo de Computo","Genero","Cambio de nombre (VoIP)",null,null,null,"Extensión Telefónica (VoIP)","Servicios adicionales","Otros_Servicios","VPN",null,"Tipo de elemento"]
[1,10000,0,"Sede de la Direccion General","Consejo Directivo",{"$f":"LEN(E2)","v":17},"Sede_de_la_Direccion_General","Sede de la Direccion General","Sede_de_la_Direccion_General","Planta ",null,"Planta","Planta_cargo","Asesor","Contratista","Contratista","Contratista",null,"Creación cuenta de red y correo","SI","Requiere asignación","Femenino","Es mi extensión personal",null,"Extensión telefónica (VoIP)","Extensión","Usuario ya posee teléfono","Servicios adicionales","Otros_Servicios","Extensión telefónica (VoIP)",null,"Celular"]
[1,10100,0,"Sede de la Direccion General","Direccion General",17,"Regional_Amazonas","Regional Amazonas","Regional_Amazonas","Contrato",null,"Planta","Planta_cargo","Auxiliar Administrativo","Tercero","Contratista","Contratista",null,"Actualizar información","NO","Ya tiene asignado","Masculino","Deseo que me contacten allí",null,"Extensión telefónica (VoIP)","Extensión","Usuario ya posee diadema","Servicios adicionales","Otros_Servicios","Clave telefónica (VoIP)",null,"CPU"]
[1,10101,0,"Sede de la Direccion General","Oficina de Control Interno",26,"Regional_Antioquia","Regional Antioquia","Regional_Antioquia",null,null,"Planta","Planta_cargo","Conductor Mecanico","Operación_Directa","Planta","Planta","Planta","Activación de cuentas por renovación de contrato",null,null,"Binario",null,null,"Extensión telefónica (VoIP)","Extensión","No tiene teléfono o diadema","Servicios adicionales","Otros_Servicios","Cambio de nombre (VoIP)",null,"Portátil"]
[1,10102,0,"Sede de la Direccion General","Oficina de Cooperacion y Convenios",34,"Regional_Arauca","Regional Arauca","Regional_Arauca",null,null,"Planta","Planta_cargo","Defensor de Familia",null,"Planta","Planta","Supernumerario","Activación de cuentas por vacaciones / licencias",null,null,"Queer",null,null,"Permisos internet","PermisoInt","Permitir acceso","Servicios adicionales","Otros_Servicios","Actualizar extensión en tarjeta de contacto",null,"Tablet"]
[1,10200,0,"Sede de la Direccion General","Oficina de Aseguramiento a la Calidad",37,"Regional_Atlantico","Regional Atlantico","Regional_Atlantico",null,null,"Planta","Planta_cargo","Director General",null,"Planta","Planta","Practicante ","Desactivación de cuentas por finalización de contrato",null,null,"Trans",null,null,"Permisos internet","PermisoInt","Restringir acceso","Servicios adicionales","Otros_Servicios","Permisos internet",null,"Todo en uno (AiO)"]
[1,10300,0,"Sede de la Direccion General","Oficina Asesora Juridica",24,"Regional_Bogota","Regional Bogota","Regional_Bogota",null,null,"Planta","Planta_cargo","Director Regional",null,"Planta","Planta",null,"Desactivación de cuentas por vacaciones / licencias",null,null,"Otro",null,null,"VPN","CuentaVPN","Crear","Servicios adicionales","Otros_Servicios","Configuración de perfil en equipo institucional"]
[1,10301,0,"Sede de la Direccion General","Oficina Asesora de Comunicaciones",33,"Regional_Bolivar","Regional Bolivar","Regional_Bolivar",null,null,"Planta","Planta_cargo","Jefe de Oficina",null,"Planta","Planta",null,"Crear listas de distribución",null,null,"No Desea Responder",null,null,"VPN","CuentaVPN","Modificar","Servicios adicionales","Otros_Servicios","Cuenta genérica"]
[1,10302,0,"Sede de la Direccion General","Oficina de Gestion Regional",27,"Regional_Boyaca","Regional Boyaca","Regional_Boyaca",null,null,"Planta","Planta_cargo","Jefe De Oficina Asesora",null,"Estudiante","Estudiante","Judicante","Actualizar listas de distribución",null,null,null,null,null,"VPN","CuentaVPN","Eliminar","Servicios adicionales","Otros_Servicios","Buzón compartido"]
[1,10303,0,"Sede de la Direccion General","Subdireccion General",20,"Regional_Caldas","Regional Caldas","Regional_Caldas",null,null,"Planta","Planta_cargo","Madre Comunitaria",null,"Estudiante","Estudiante",null,"Permiso de envío a listas",null,null,null,null,null,"VPN","CuentaVPN","Activar","Servicios adicionales","Otros_Servicios","Permisos sobre buzón"]
[1,10304,0,"Sede de la Direccion General","Secretaria General",18,"Regional_Caqueta","Regional Caqueta","Regional_Caqueta",null,null,"Planta","Planta_cargo","Profesional Especializado",null,"Tercero","Tercero",null,"Copia de información (Backup)",null,null,null,null,null,"VPN","CuentaVPN","Desactivar","Servicios adicionales","Otros_Servicios","Cuenta convocatoria pública"]
[1,10400,0,"Sede de la Direccion General","Direccion de Gestion Humana",27,"Regional_Casanare","Regional Casanare","Regional_Casanare",null,null,"Planta","Planta_cargo","Profesional Universitario",null,"Tercero","Tercero",null,"Creación SharePoint",null,null,null,null,null,"Cuenta genérica","CuentaG","Crear","Servicios adicionales","Otros_Servicios","Instalación software"]
[1,10401,0,"Sede de la Direccion General","Direccion Administrativa",24,"Regional_Cauca","Regional Cauca","Regional_Cauca",null,null,"Planta","Planta_cargo","Secretario",null,"Tercero","Tercero",null,"Eliminación SharePoint",null,null,null,null,null,"Cuenta genérica","CuentaG","Activar","Servicios adicionales","Otros_Servicios","Borrado de información"]
[1,10402,0,"Sede de la Direccion General","Direccion Financiera",20,"Regional_Cesar","Regional Cesar","Regional_Cesar",null,null,"Planta","Planta_cargo","Secretario Ejecutivo",null,"Tercero","Tercero",null,"Servicios adicionales",null,null,null,null,null,"Cuenta genérica","CuentaG","Desactivar","Servicios adicionales","Otros_Servicios","Impresora"]
[1,10403,0,"Sede de la Direccion General","Direccion de Contratacion",25,"Regional_Choco","Regional Choco","Regional_Choco",null,null,"Planta","Planta_cargo","Secretario General",null,"Tercero","Tercero",null,null,null,null,null,null,null,"Cambio de nombre (VoIP)","Cambionombre","Es mi extensión personal","Servicios adicionales","Otros_Servicios","Asignación de equipo institucional"]
[1,10404,0,"Sede de la Direccion General","Direccion de Servicios y Atencion",33,"Regional_Cordoba","Regional Cordoba","Regional_Cordoba",null,null,"Planta","Planta_cargo","Subdirector General",null,"Tercero","Tercero",null,null,null,null,null,null,null,"Cambio de nombre (VoIP)","Cambionombre","Deseo que me contacten allí","Servicios adicionales","Otros_Servicios","Scanner"]
[1,10405,0,"Sede de la Direccion General","Direccion de Logistica y Abastecimiento",39,"Regional_Cundinamarca","Regional Cundinamarca","Regional_Cundinamarca",null,null,"Planta","Planta_cargo","Subdirector Tecnico",null,"Tercero","Tercero",null,null,null,null,null,null,null,"Borrado de información","Borra_Info","Borrado seguro","Servicios adicionales","Otros_Servicios","Monitor"]
[null,null,null,"Sede de la Direccion General","Oficina de Control Interno Disciplinario",40,"Regional_Guainia","Regional Guainia","Regional_Guainia",null,null,"Planta","Planta_cargo","Tecnico Administrativo",null,"Ente_de_Control","Ente_de_Control","Procuraduría",null,null,null,null,null,null,"Borrado de información","Borra_Info","Formateo de equipo","Servicios adicionales","Otros_Servicios","Agregar perfil de navegación"]
[1,10500,0,"Sede de la Direccion General","Direccion de Planeacion y Control de Gestión",44,"Regional_Guajira","Regional Guajira","Regional_Guajira",null,null,"Planta","Planta_cargo",null,null,"Ente_de_Control","Ente_de_Control","Carrera Administrativa",null,null,null,null,null,null,"Requisitos BYOD","Revision Requisitos","Configurar acceso a servicios tecnologicos ICBF","Servicios adicionales","Otros_Servicios","Modificar perfil de navegación"]
[1,10501,0,"Sede de la Direccion General","Subdireccion de Programacion",28,"Regional_Guaviare","Regional Guaviare","Regional_Guaviare",null,null,"Planta","Planta_cargo",null,null,"Operación_Directa","Operación_Directa",null,null,null,null,null,null,null,"Borrado de información","Borra_Info","Borrado de perfiles","Servicios adicionales","Otros_Servicios","Eliminar perfil de navegación"]
{"$rows_left_out":476}
{"sheet":"Datos","index":4,"n_rows":265,"n_cols":4,"rows_kept":265,"cut":false,"hidden":true,"merged":[]}
[]
[null,"Sede la Dirección General o Regional","Dirección General, Subdirección General o Secretaría General","Dirección, Oficina, Centrz Zonal, o Grupo a nivel de Regional "]
[null,"Sede de la Direccion General","Direccion General","Dirección General"]
[null,"Regional Amazonas","Secretaria General","Oficina de Control Interno"]
[null,"Regional Antioquia","Subdireccion General","Oficina de Control Disciplinario Interno OCDI"]
[null,"Regional Arauca","Direccion Regional Amazonas","Oficina Asesora de Comunicaciones"]
[null,"Regional Atlantico","Direccion Regional Antioquia","Oficina de Cooperación "]
[null,"Regional Bogota","Direccion Regional Arauca","Oficina Jurídica"]
[null,"Regional Bolivar","Direccion Regional Atlantico","Oficina de Inspección, Vigilancia y Control, y Calidad de Servicios "]
[null,"Regional Boyaca","Direccion Regional Bogota","Oficina de Gestión Regional"]
[null,"Regional Caldas","Direccion Regional Bolivar","Dirección de Tecnologías de la Información"]
[null,"Regional Caqueta","Direccion Regional Boyaca","Direcciones Regionales"]
[null,"Regional Casanare","Direccion Regional Caldas","Dirección Sistema Nacional de Bienestar Familiar"]
[null,"Regional Cauca","Direccion Regional Caqueta","Subdirección de Articulación Nacional del SNBF"]
[null,"Regional Cesar","Direccion Regional Casanare","Subdirección de Articulación Territorial del SNBF"]
[null,"Regional Choco","Direccion Regional Cauca","Subdirección de Autoridades Administrativas"]
[null,"Regional Cordoba","Direccion Regional Cesar","Dirección de Planeación y Control de Gestión"]
[null,"Regional Cundinamarca","Direccion Regional Choco","Subdirección de Programación"]
[null,"Regional Guainia","Direccion Regional Cordoba","Subdirección de Mejoramiento Organizacional"]
[null,"Regional Guajira","Direccion Regional Cundinamarca","Subdirección de Monitoreo y Evaluación"]
{"$rows_left_out":245}