{"text_format":"1","workbook":"xlsx","n_sheets":8,"sheets":["INSTRUCCIONES","LISTA_ACT_ASP_IMP","LISTA_NORMAS","ASP E IMP","REP ASPEC IMPAC","DATOS ASP","REQUISITOS LEGALES","REP REQ LEG"],"not_rendered":{"charts":6,"images":31,"macros":1,"external_links":2,"defined_names":75,"comments":5,"pivot_tables":4},"unopened":[],"bounds":{"document_bytes":16777216,"sheet_cells":100000,"rows_first":2000,"rows_last":500,"rows_between":2000,"halvings":0,"cell_chars":16384,"cell_head_chars":4096},"cells_cut":0,"cells_raw":0,"read":"whole","date_system":"1900"}

{"sheet":"INSTRUCCIONES","index":0,"n_rows":55,"n_cols":9,"rows_kept":55,"cut":false,"hidden":false,"merged":[[13,2,13,8],[15,2,15,8],[37,2,38,2],[37,4,37,8],[38,4,38,8],[24,2,24,8],[5,7,5,8],[3,1,5,2],[3,3,5,6],[18,2,18,8],[23,2,23,8],[8,2,8,8],[9,2,9,8],[12,2,12,8],[10,2,10,8],[20,1,22,1],[20,2,22,8],[11,2,11,8],[14,2,14,8],[16,2,16,8],[19,2,19,8],[17,2,17,8],[54,2,54,8],[42,2,44,2],[42,3,44,3],[42,4,42,8],[43,4,43,8],[44,4,44,8],[45,2,45,8],[47,2,47,8],[49,2,49,8],[53,2,53,8],[48,2,48,8],[46,2,46,8],[50,2,50,8],[51,2,51,8],[52,2,52,8],[25,1,44,1],[25,2,25,8],[26,4,26,8],[27,2,34,2],[35,2,36,2],[35,3,36,3],[39,2,41,2],[39,3,41,3],[39,4,39,8],[40,4,40,8],[41,4,41,8],[35,4,35,8],[36,4,36,8]]}
[]
[]
[]
[null,null,null,"PROCESO \nSERVICIOS ADMINISTRATIVOS\n\nMATRIZ DE IDENTIFICACION DE ASPECTOS Y VALORACION DE IMPACTOS, REQUISITOS LEGALES Y OTROS REQUISITOS AMBIENTALES",null,null,null,"F1.P22.SA ",46112]
[null,null,null,null,null,null,null,"Versión 6","Página 1 de 1"]
[null,null,null,null,null,null,null,"CLASIFICACIÓN DE LA INFORMACIÓN:\n PÚBLICA"]
[]
[]
[null,"No.","INSTRUCCIÓN"]
[null,1,"Una vez descargado este archivo, proceda a guardarlo en el repositorio en la ruta \\\\172.16.9.31\\ArchivosICBF\\SharePoint\\Mejoramiento Continuo\\Eje Ambiental\\\"NOMBRE DE LA REGIONAL\"\\\"AÑO DE APLICACIÓN\"\\5. MATRICES ASP-IMP Y REQ LEG y asigne de la siguiente manera el nombre al archivo, EJEMPLO \"REG BOGOTA_MATRIZ DE ASP_IMP_REQ_LEG\""]
[null,2,"NOTA ACLARATORIA: Las siguientes son las columnas son  las que se encuentran formuladas y se recomienda precaución al momento de eliminar la información ya que esto puede alterar el contenido de la matriz.\n\nPESTAÑA ASP E IMP\n\nSECCION:\nTipo de sede\nRegional / Centro Zonal / Unidad Local\nProceso\tDependencia\nActividad\n\nIDENTIFICACION DE ASPECTO Y VALORACIÓN DE IMPACTOS - Todas las colunmas exceptuando \"Ubicación del Impacto\"\n\nSITUACIONES DE EMERGENCIA - Todas las colunmas exceptuando \"Controles para la Emergencia Ambiental\"  \n\nPESTAÑA REQUISITOS LEGALES\n\nSECCION:\nAspecto Ambiental\nNorma y título\nCUMPLE SI/NO\n\n\n"]
[null,3,"Antes de iniciar el diligenciamiento de la matriz, se debe realizar la verificación y actualización de la siguiente información de las pestañas: \n\n1. LISTA_ACT_ASP_IMP, en la cual se debe incluir, si se considera actividades, aspectos e impactos ambientales y emergencias ambientales nuevas o no identificadas.\n\n2. LISTA_NORMAS, en la cual se debe incluir, la normatividad no identificada y la aplicable a nivel regional "]
[null,4,"Ingrese a la hoja de cálculo datos en el siguiente orden:\n- Alcance, hace referencia a la espacialidad en el cual hará referencia la matriz de aspectos e impactos ambietales, es decir Sede de la Dirección General o Regional.\n\nSi selecciona Regional, en la casilla siguiente se muestra el listado de las regionales.\nSi seleccciona Sede de la Dirección General, en la casilla siguiente aparecerá nuevamente Sede de la Direccion General.\n"]
[null,4,"Ingrese a la hoja de cálculo los siguientes datos, teniendo en cuenta las siguientes responsabilidades\n\n\n\n\n\n\n\n\n\n\n\n                                                                                                                                                                                                                                                                                                    "]
[null,5,"Inicie el diligencimiento de la Matriz de Identificación y Valoración de Aspectos e Impactos Ambientales seleccionando el TIPO DE SEDE, el cual especifica la naturaleza del establecimiento.\n- Regional\n- Centro Zonal - Cz\n- Unidad Local - Aplicas para las regionales que tengan unidades locales\n- Unidad Administrativa: Hace referencia a los establecimientos como bodegas de inservibles, archivos y almacen,\nque no hagan parte de la infraestructura de la Regional y/o Centro Zonal.\n\n\n\nNota: El diligenciamiento de la matriz para las Regionales y Centros Zonales se debe efectuar de la siguiente manera:\n- Se debe diligenciar toda la información relacionada con la regional, luego \n- Se debe diligenciar la información relacionada con los centros zonales, es decir, centro zonal por centro zonal\n\n\n\n"]
{"$rows_left_out":41}
{"sheet":"LISTA_ACT_ASP_IMP","index":1,"n_rows":114,"n_cols":8,"rows_kept":114,"cut":false,"hidden":false,"merged":[[0,0,2,0],[2,6,2,7],[0,1,2,5]]}
[null,"PROCESO \nSERVICIOS ADMINISTRATIVOS\n\nMATRIZ DE IDENTIFICACION DE ASPECTOS Y VALORACION DE IMPACTOS, REQUISITOS LEGALES Y OTROS REQUISITOS AMBIENTALES",null,null,null,null,"F1.P22.SA ",46112]
[null,null,null,null,null,null,"Versión 6","Página 1 de 1"]
[null,null,null,null,null,null,"CLASIFICACIÓN DE LA INFORMACIÓN:\n PÚBLICA"]
[]
[]
[]
[]
[]
["ACTIVIDADES",null,"ASPECTOS AMBIENTALES",null,"IMPACTOS AMBIENTALES",null,"EMERGENCIAS AMBIENTALES"]
["Actividades pedagógicas, campañas educativas, sensibilización y capacitación.",null,null,null,"Aprovechamiento de energías alternativas - Paneles solares",null,"Derrame de materiales peligrosos producto de condiciones inadecuadas en la manipulación y almacenamiento de sustancias químicas de aseo y mantenimiento."]
["Almacenamiento de AAVN",null,"Acumulación de residuos especiales (Llantas, escombros, textiles, otros)",null,"Absorción y disminución de Dióxido de carbono - Siembra de arboles",null,"Derrame de materiales peligrosos producto de condiciones inadecuadas en la manipulación y almacenamiento de hidrocarburos."]
["Almacenamiento de alimentos y/o materias primas",null,"Acumulación de residuos sólidos ",null,"Afectación a la comunidad",null,"Derrame de materiales peligrosos producto de condiciones inadecuadas en la manipulación y almacenamiento de residuos peligrosos."]
["Almacenamiento de bienes con características de peligrosidad",null,"Acumulación de RESPEL",null,"Afectación al paisaje",null,"Colapso en el cuarto de almacenamiento de residuos aprovechables, que al no tener las condiciones adecuadas puede generar acumulación excesiva, incendios y proliferación de roedores."]
["Almacenamiento de donaciones ",null,"Acumulación por RAEE'S - Electrodomésticos y eléctricos",null,"Agotamiento de la biodiversidad",null,"Colapso en los cuartos de almacenamiento de residuos especiales y peligrosos, que al no tener las condiciones adecuadas puede generar acumulación excesiva, incendios, proliferación de roedores, derrame de sustancias peligrosas, acumulación de gases y explosión."]
["Almacenamiento de residuos aprovechables",null,"Acumulación por RAEE'S - Periféricos",null,"Agotamiento de los recursos naturales",null,"Colapso en el cuarto de almacenamiento de residuos ordinarios, que al no tener las condiciones adecuadas puede generar acumulación excesiva, derrame de lixiviados, proliferación de roedores, acumulación de gases, exploción e incendios."]
{"$rows_left_out":100}
{"sheet":"LISTA_NORMAS","index":2,"n_rows":40,"n_cols":5,"rows_kept":40,"cut":false,"hidden":false,"merged":[[10,0,10,4],[5,0,5,4],[6,0,6,4],[7,0,7,4],[8,0,8,4],[9,0,9,4],[13,0,13,4],[38,0,38,4],[39,0,39,4],[40,0,40,4],[0,0,2,0],[0,1,2,2],[2,3,2,4],[12,0,12,4],[20,0,20,4],[21,0,21,4],[22,0,22,4],[23,0,23,4],[25,0,25,4],[11,0,11,4],[3,0,3,4],[4,0,4,4],[34,0,34,4],[35,0,35,4],[36,0,36,4],[37,0,37,4],[32,0,32,4],[33,0,33,4],[14,0,14,4],[15,0,15,4],[16,0,16,4],[17,0,17,4],[18,0,18,4],[26,0,26,4],[24,0,24,4],[19,0,19,4],[31,0,31,4],[27,0,27,4],[28,0,28,4],[29,0,29,4],[30,0,30,4]]}
[null,"PROCESO \nSERVICIOS ADMINISTRATIVOS\n\nMATRIZ DE IDENTIFICACION DE ASPECTOS Y VALORACION DE IMPACTOS, REQUISITOS LEGALES Y OTROS REQUISITOS AMBIENTALES",null,"F1.P22.SA ",46112]
[null,null,null,"Versión 6","Página 1 de 1"]
[null,null,null,"CLASIFICACIÓN DE LA INFORMACIÓN:\n PÚBLICA"]
["NORMA"]
["Resolucion  472 de 2017 Por la cual se reglamenta la gestión integral de los residuos generados en las actividades de Construcción y Demolición (RCD) y se dictan otras disposiciones."]
["Decreto 1073 de 2015 Por medio del cual se expide el Decreto Único Reglamentario del Sector Minas y Energia"]
["Decreto 1076 de 2015 Por medio del cual se expide el Decreto Único Reglamentario del Sector Ambiente y Desarrollo Sostenible"]
["Decreto 1077 de 2015 Por medio del cual se expide el decreto Unico Reglamentario del Sector Vivienda, Ciudad y Territorio"]
["Decreto 1079 de 2015 Por medio del cual se expide el Decreto Único Reglamentario del Sector Transporte"]
["Directiva presidencia 06 de 2014  Plan de austeridad en el gasto"]
["Resolución 5771 de 2014 por la cual se modifica el artículo 4o de la Resolución 3959 de 2012', publicada en el Diario Oficial No. 49.306 de 16 de octubre de 2014"]
["Directiva presidencia l  04 de 2012  Eficiencia adminisrtrativa y lineamiento de la politica cero papel en la administración"]
["Resolución 1511 de 2010 10 Por la cual se establecen los Sistemas de Recolección Selectiva y Gestión Ambiental de Residuos de Bombillas y se adoptan otras disposiciones."]
["Resolución 1512 de 2010 10 Por la cual se establecen los Sistemas de Recolección Selectiva y Gestión Ambiental de Residuos de Computadores y/o Periféricos y se adoptan otras disposicioneS."]
["Resolución 840 de 2009 9 expedida por DIRECCION GENERAL DEL INSTITUTO COLOMBIANO DE BIENESTAR FAMILIAR. Por la cual se adopta la Política Ambiental del Instituto Colombiano de Bienestar Familiar - Cecilia de la Fuente de Lleras y se establecen responsabilidades en la implementación del Sistema de Gestión Ambiental (SGA)"]
{"$rows_left_out":26}
{"sheet":"ASP E IMP","index":3,"n_rows":528,"n_cols":35,"rows_kept":528,"cut":false,"hidden":false,"merged":[[23,4,25,4],[23,3,25,3],[23,2,25,2],[20,2,22,7],[13,10,13,12],[14,10,14,12],[15,10,15,12],[23,6,25,6],[5,5,5,11],[12,13,12,14],[14,13,14,14],[0,5,2,32],[0,2,2,4],[2,33,2,34],[4,2,4,34],[12,10,12,12],[24,15,25,15],[23,8,25,8],[23,10,23,12],[23,5,25,5],[23,7,25,7],[23,13,23,14],[23,15,23,16],[24,10,25,10],[24,11,24,12],[24,13,25,13],[24,14,25,14],[24,16,25,16],[23,9,25,9],[16,13,16,14],[18,13,18,14],[20,17,20,27],[20,8,22,16],[16,10,16,12],[17,10,17,12],[18,10,18,12],[21,27,25,27],[21,17,25,17],[21,18,25,18],[21,19,25,19],[21,21,25,21],[21,20,25,20],[21,22,25,22],[21,24,25,24],[21,26,25,26],[21,28,25,28],[21,23,25,23],[21,25,25,25],[21,29,25,29],[20,32,20,34],[21,34,25,34],[21,30,25,30],[21,31,25,31],[21,32,25,32],[21,33,25,33],[20,29,20,31]]}
[null,null,null,null,null,"PROCESO \nSERVICIOS ADMINISTRATIVOS\n\nMATRIZ DE IDENTIFICACION DE ASPECTOS Y VALORACION DE IMPACTOS, REQUISITOS LEGALES Y OTROS REQUISITOS AMBIENTALES",null,null,null,null,null,null,null,null,null,null,null,null,null,null,null,null,null,null,null,null,null,null,null,null,null,null,null,"F1.P22.SA ",46112]
[null,null,null,null,null,null,null,null,null,null,null,null,null,null,null,null,null,null,null,null,null,null,null,null,null,null,null,null,null,null,null,null,null,"Versión 6","Página 1 de 1"]
[null,null,null,null,null,null,null,null,null,null,null,null,null,null,null,null,null,null,null,null,null,null,null,null,null,null,null,null,null,null,null,null,null,"CLASIFICACIÓN DE LA INFORMACIÓN:\n PÚBLICA"]
[]
[]
[null,null,null,null,null,"\nMATRIZ DE VALORACIÓN DE ASPECTOS E IMPACTOS AMBIENTALES"]
[]
[]
[null,null,null,null,null,"ALCANCE",null,null,null,null,null,null,null,null,null,null,null,null,null,null,null,{"$f":"VLOOKUP(H9,'DATOS ASP'!D22:E23,2,FALSE)","v":{"$error":"#N/A"}}]
[null,null,null,null,null,null,null,null,null,null,null,null,null,null,null,null,null,null,null,null,null,1]
[null,null,null,null,null,{"$f":"IF(OR(H9=\"Regional\"),\"REGIONAL\",\"SEDE DE LA DIRECCION GENERAL\")","v":"SEDE DE LA DIRECCION GENERAL"},null,null,null,null,null,null,null,null,null,null,null,null,null,null,{"$f":"VLOOKUP(H11,REGIONAL,1,FALSE)","v":{"$error":"#N/A"}},{"$f":"VLOOKUP(H11,'DATOS ASP'!A36:A53,2,FALSE)","v":{"$error":"#N/A"}}]
[]
[null,null,null,null,null,"NOMBRE DE QUIEN ELABORO",null,null,null,null,"FECHA DE ELABORACIÓN"]
[]
[null,null,null,null,null,"NOMBRE DE QUIEN REVISA",null,null,null,null,"FECHA DE REVISIÓN"]
{"$rows_left_out":514}
{"sheet":"REP ASPEC IMPAC","index":4,"n_rows":373,"n_cols":18,"rows_kept":373,"cut":false,"hidden":false,"merged":[[0,0,2,1],[2,16,2,17],[0,2,2,15],[112,1,112,2],[15,11,16,16],[75,1,75,2],[9,6,9,9],[10,6,10,7],[11,6,11,7],[12,6,12,7],[35,1,35,2],[10,1,10,2],[11,1,11,2],[9,1,9,4],[12,1,12,2]]}
[null,null,"PROCESO \nSERVICIOS ADMINISTRATIVOS\n\nMATRIZ DE IDENTIFICACION DE ASPECTOS Y VALORACION DE IMPACTOS, REQUISITOS LEGALES Y OTROS REQUISITOS AMBIENTALES",null,null,null,null,null,null,null,null,null,null,null,null,null,"F1.P22.SA ",46112]
[null,null,null,null,null,null,null,null,null,null,null,null,null,null,null,null,"Versión 6","Página 1 de 1"]
[null,null,null,null,null,null,null,null,null,null,null,null,null,null,null,null,"CLASIFICACIÓN DE LA INFORMACIÓN:\n PÚBLICA"]
[]
[]
[]
[]
[]
[]
[null,"1. CARÁCTER DEL IMPACTO ",null,null,null,null,"2. ACTIVIDADES QUE DERIVAN SITUACIONES DE EMERGENCIA"]
[null,"Total de impactos identificados ",null,"Negativo","Positivo",null,"Total de Actividades",null,"Si ","No"]
[null,{"$f":"+COUNTA('ASP E IMP'!T27:T528)","v":0},null,{"$f":"+COUNTIF('ASP E IMP'!T27:T528,\"Positivo (+)\")","v":0},{"$f":"+COUNTIF('ASP E IMP'!T27:T528, \"Negativo (-)\")","v":0},null,{"$f":"+COUNTA('ASP E IMP'!I27:I528)","v":0},null,{"$f":"+COUNTIF('ASP E IMP'!AD27:AD528,\"SI\")","v":0},{"$f":"+COUNTIF('ASP E IMP'!AD27:AD528,\"NO\")","v":0}]
[null,{"$f":"+B12*1/B12","v":{"$error":"#DIV/0!"}},null,{"$f":"+(D12*B13)/B12","v":{"$error":"#DIV/0!"}},{"$f":"+(B13*E12)/B12","v":{"$error":"#DIV/0!"}},null,{"$f":"+G12*1/G12","v":{"$error":"#DIV/0!"}},null,{"$f":"+(G13*I12)/G12","v":{"$error":"#DIV/0!"}},{"$f":"+(G13*J12)/G12","v":{"$error":"#DIV/0!"}}]
[]
[]
{"$rows_left_out":359}
{"sheet":"DATOS ASP","index":5,"n_rows":337,"n_cols":36,"rows_kept":337,"cut":false,"hidden":true,"merged":[[34,3,34,6],[40,3,40,6],[63,15,63,21],[47,3,47,6],[63,3,63,6],[63,7,63,10],[61,18,61,20]]}
["TIPO DE SEDE","REGIONAL","Sede_de_la_Dirección_General","Antioquia","Atlantico","Bogotá","Bolivar","Boyacá","Caldas","Caquetá","Cauca","Cesar","Cordoba","Cundinamarca","Choco","Huila","La_Guajira","Magdalena","Meta","Nariño","N_Santander","Quindio","Risaralda","Santander","Sucre","Tolima","Valle","Arauca","Casanare","Putumayo","S_Andres","Amazonas","Guainia","Guaviare","Vaupes","Vichada"]
["Sede de la Dirección General","Antioquia","Sede de la Dirección General","CZ Integral No. 1 Nororiental","CZ Norte Centro Histórico","CZ Ciudad Bolivar","CZ Norte Histórico y del Caribe","CZ Tunja 1","CZ Manizales 1","CZ Florencia 1","CZ Popayan","CZ Valledupar 1","CZ No. 1 Monteria","CZ Soacha","CZ Quibdó","CZ Neiva","CZ Riohacha 1","CZ Santa Marta Sur","CZ No. 1 Villavicencio","CZ Pasto 1","CZ Cúcuta 1","CZ Armenia Sur","CZ Pereira","CZ Bucaramanga Norte","CZ Boston","CZ Ibagué Jordán","CZ Suroriental","CZ Arauca","CZ Yopal","CZ Mocoa","CZ Los Almendros","CZ Amazonas","CZ Guainia","CZ Guaviare","CZ Vaupes","CZ Vichada"]
["Regional","Atlantico",null,"CZ Integral No. 2 Noroccidental","CZ Sur Occidente","CZ Tunjuelito","CZ de la Virgen y Turistico","CZ Tunja 2","CZ Manizales 2","CZ Florencia 2","CZ Centro","CZ Valledupar 2","CZ Cereté","CZ Zipaquira","CZ Istmina","CZ Garzon","CZ Riohacha 2","CZ Santa Marta Norte","CZ No. 2 Villavicencio","CZ Pasto 2","CZ Cúcuta 2","CZ Armenia Norte","CZ La Virginia","CZ Bucaramanga Sur","CZ Norte","CZ Ibagué Galán","CZ Nororiental","CZ Saravena","CZ Paz de Ariporo","CZ Sibundoy","UL S Andres","UL Puerto Nariño",null,"UL_Guaviare",null,"UL_Vichada"]
[null,"Bogotá",null,"CZ Integral No. 4 Sur Oriental","CZ Baranoa","CZ Usme","CZ Industrial de la Bahía","CZ Sogamoso","CZ Occidente","CZ Puerto Rico","CZ Indigena","CZ Chiriguaná","CZ Planeta Rica","CZ Choconta","CZ Bahía Solano","CZ La Plata","CZ Fonseca","CZ Del Rio","CZ No. 3 Granada","CZ Tumaco","CZ Cúcuta 3","CZ Calarcá","CZ Dosquebradas","CZ Carlos Lleras Restrepo","CZ Sincelejo","CZ Ibagué Centro","CZ Ladera","CZ Tame","CZ Villanueva","CZ Puerto Asis","UL Providencia",null,null,"UL Calamar",null,"UL Primavera"]
[null,"Bolivar",null,"CZ No. 5 Aburra Norte","CZ Sabanalarga","CZ San Cristobal Sur","CZ Turbaco","CZ Duitama","CZ Oriente","CZ Belén de los Andaquies","CZ Sur","CZ Aguachica","CZ Tierralta","CZ Pacho","CZ Riosucio","CZ Pitalito","CZ Manaure","CZ Ciénaga","CZ No. 4 Acacias","CZ Ipiales","CZ Ocaña",null,"CZ Belen de Umbría","CZ Luis Carlos Galán Sarmiento","CZ La Mojana","CZ Líbano","CZ Centro",null,null,"CZ La Hormiga",null,null,null,"UL Retormno",null,"UL Rosalia"]
[null,"Boyacá",null,"CZ No. 6 Aburra Sur","CZ Sabanagrande","CZ Kennedy","CZ El Carmen de Bolivar","CZ Chiquinquira","CZ Norte",null,"CZ Norte","CZ Agustin Codazzi","CZ Montelíbano","CZ Villeta","CZ Tadó","CZ La Gaitana","CZ Maicao","CZ Fundación","CZ No. 5 Puerto López","CZ Túquerres","CZ Pamplona",null,"CZ Santa Rosa de Cabal","CZ Yariquies",null,"CZ Lérida","CZ Sur",null,null,null,null,null,null,"UL Miraflores",null,"UL Cumaribo"]
["UBICACIÓN","Caldas",null,"CZ No. 7 Bajo Cauca","CZ Hipódromo","CZ REVIVIR","CZ Magangué","CZ Garagoa","CZ Sur Oriente",null,"CZ Macizo Colombiano",null,"CZ Lórica","CZ Facatativa",null,null,"CZ Nazareth","CZ Plato",null,"CZ La Unión","CZ Tibú",null,null,"CZ La Floresta",null,"CZ Honda","CZ Jamundí"]
["Sede de la Dirección General","Caquetá",null,"CZ No. 8 La Meseta","CZ Sur Oriente","CZ Puente Aranda","CZ Mompox","CZ Puerto Boyacá","UL_Caldas",null,"CZ Costa Pacífica",null,"CZ Sahagún","CZ Fusagasuga",null,null,null,"CZ El Banco",null,"CZ Barbacoas",null,null,null,"CZ San Gil",null,"CZ Espinal","CZ Yumbo"]
["Regional","Cauca",null,"CZ No. 9 Magdalena Medio",null,"CZ Bosa","CZ Simiti","CZ Soata","Centro Local Chinchina",null,null,null,"CZ San Andrés de Sotavento","CZ Caqueza",null,null,null,"CZ Santa Ana",null,"CZ Remolino",null,null,null,"CZ Socorro",null,"CZ Chaparral","CZ Palmira"]
["Centro Zonal","Cesar",null,"CZ No. 10 Occidente",null,"CZ Rafael Uribe",null,"CZ El Cocuy",null,null,null,null,null,"CZ Gacheta",null,null,null,null,null,"UL Nariño",null,null,null,"CZ Vélez",null,"CZ Purificación","CZ Buga"]
["Unidad_Administrativa","Cordoba",null,"CZ No. 11 Occidente Medio",null,"CZ Santa Fe",null,"CZ Miraflores",null,null,null,null,null,"CZ Girardot",null,null,null,null,null,"UL El Charco",null,null,null,"CZ Málaga",null,"CZ Melgar","CZ Tulua"]
["Unidad Local","Cundinamarca",null,"CZ No. 12 Oriente",null,"CZ Fontibón",null,"CZ Moniquira",null,null,null,null,null,"CZ La Mesa",null,null,null,null,null,"UL La Cruz",null,null,null,null,null,null,"CZ Sevilla"]
[null,"Choco",null,"CZ No. 13 Porce Nus",null,"CZ Barrios Unidos",null,"CZ Otanche",null,null,null,null,null,"CZ Ubate",null,null,null,null,null,null,null,null,null,null,null,null,"CZ Roldanillo"]
[null,"Huila",null,"CZ No. 14 Suroeste",null,"CZ Engativá",null,null,null,null,null,null,null,"CZ San Juan de Rioseco",null,null,null,null,null,null,null,null,null,null,null,null,"CZ Cartago"]
[null,"La_Guajira",null,"CZ No. 15 Penderisco",null,"CZ Suba",null,null,null,null,null,null,null,null,null,null,null,null,null,null,null,null,null,null,null,null,"CZ Buenaventura"]
{"$rows_left_out":323}
{"sheet":"REQUISITOS LEGALES","index":6,"n_rows":6,"n_cols":14,"rows_kept":6,"cut":false,"hidden":false,"merged":[[4,9,4,13],[4,2,4,8],[0,0,2,2],[0,3,2,11],[2,12,2,13]]}
[null,null,null,"PROCESO \nSERVICIOS ADMINISTRATIVOS\n\nMATRIZ DE IDENTIFICACION DE ASPECTOS Y VALORACION DE IMPACTOS, REQUISITOS LEGALES Y OTROS REQUISITOS AMBIENTALES",null,null,null,null,null,null,null,null,"F1.P22.SA ",46112]
[null,null,null,null,null,null,null,null,null,null,null,null,"Versión 6","Página 1 de 1"]
[null,null,null,null,null,null,null,null,null,null,null,null,"CLASIFICACIÓN DE LA INFORMACIÓN:\n PÚBLICA"]
[]
[null,null,"REQUISITOS LEGALES",null,null,null,null,null,null,"PLAN DE ACCION "]
[null,null,"Aspecto Ambiental","Norma y título","Autoridad que Emite","ArtÍculos Aplicables","CUMPLE SI/NO","EVIDENCIA DE CUMPLIMIENTO","SEDES DE INCUMPLIMIENTO","JUSTIFICACION DEL INCUMPLIMIENTO","ACTIVIDADES","RESPONSABLE","FECHA  CUMPLIMIENTO","EVIDENCIA"]

{"sheet":"REP REQ LEG","index":7,"n_rows":8,"n_cols":10,"rows_kept":8,"cut":false,"hidden":false,"merged":[[6,9,6,18],[0,3,2,7],[0,2,2,2],[2,8,2,9]]}
[null,null,null,"PROCESO \nSERVICIOS ADMINISTRATIVOS\n\nMATRIZ DE IDENTIFICACION DE ASPECTOS Y VALORACION DE IMPACTOS, REQUISITOS LEGALES Y OTROS REQUISITOS AMBIENTALES",null,null,null,null,"F1.P22.SA ",46112]
[null,null,null,null,null,null,null,null,"Versión 6","Página 1 de 1"]
[null,null,null,null,null,null,null,null,"CLASIFICACIÓN DE LA INFORMACIÓN:\n PÚBLICA"]
[]
[null,null,null,null,null,null,null,null,"CUMPLIMIENTO","(Varios elementos)"]
[null,null,"TOTAL DE REQUISITOS","TOTAL DE REQUISITOS \"NO CUMPLIDOS\"","TOTAL DE REQUISITOS  \"CUMPLIDOS\"","% DE NO CUMPLIENTO","% DE CUMPLIENTO"]
[null,null,{"$f":"+COUNTA('REQUISITOS LEGALES'!F7:F194)","v":0},{"$f":"+COUNTIF('REQUISITOS LEGALES'!H7:H194,\"NO\")","v":0},{"$f":"+C7-D7","v":0},{"$f":"++D7/C7","v":{"$error":"#DIV/0!"}},{"$f":"+E7/C7","v":{"$error":"#DIV/0!"}},null,"REQUISITOS INCUMPLIDOS","REQUISITOS INCUMPLIDOS"]
[null,null,null,null,null,null,null,null,"Total general"]