{"text_format":"1","workbook":"xlsx","n_sheets":3,"sheets":["Instructivo","Formato","Listas"],"not_rendered":{"charts":0,"images":6,"macros":1,"external_links":7,"defined_names":110,"comments":0,"pivot_tables":0},"unopened":[],"bounds":{"document_bytes":16777216,"sheet_cells":100000,"rows_first":2000,"rows_last":500,"rows_between":2000,"halvings":0,"cell_chars":16384,"cell_head_chars":4096},"cells_cut":0,"cells_raw":0,"read":"whole","date_system":"1900"}

{"sheet":"Instructivo","index":0,"n_rows":26,"n_cols":5,"rows_kept":26,"cut":false,"hidden":false,"merged":[[25,1,25,4],[14,1,14,4],[15,2,15,4],[16,2,16,4],[19,2,19,4],[20,2,20,4],[21,2,21,4],[22,2,22,4],[23,2,23,4],[17,2,17,4],[18,1,18,4],[19,1,20,1],[21,1,23,1],[5,1,6,4],[7,1,12,4],[3,3,3,4],[1,2,3,2],[1,1,3,1]]}
[]
[null,null,"PROCESO GESTIÓN DE LA TECNOLOGÍA E INFORMACIÓN \nFORMATO DE GESTION DE USUARIOS SISTEMAS DE INFORMACION","F8.P2.GTI","2018-10-05"]
[null,null,null,"Versión 2","Página 1 de 1"]
[null,null,null,"Clasificación de la información: \nClasificada"]
[]
[null,"Señor usuario para habilitar los campos del formato debe dar click en la opción \"Habilitar edición\""]
[]
[]
[]
[]
[]
[]
[]
[]
[null,"Instructivo para diligenciar el Formato"]
[null,"Sección a Diligenciar","Definición"]
[null,"Generalidad:","Para iniciar con el diligenciamiento del formato debe seleccionar el sistema de informacion para el cual requiere el servicio. \n\n\n\n\n\n\n\n\nDebe diligenciar los campos sombreados"]
[null,"Servicio Solicitado","De acuerdo al Sistema de Información seleccionado, se activa la lista de servicios relacionados, debe seleccionar una opcion de acuerdo a lo que necesita tramitar"]
[null,"Diligenciamiento de algunos campos a tener en cuenta"]
[null,"Para el Sistema de Información SIM","Actividades a realizar en el SIM\nEspecificar,\n1. Si el usuario cumple con funciones de tecnico, profesional, Director Regional. Coordinador Planeación y Sistemas o coordinador CZ .\n2. Tipo de perfil: Supervisor, gestor, profesional dentro equipo tecnico interdisciplinario.\n3. Breve descripción de las acciones a realizar"]
[null,null,"Módulos:\n* Registrar todos los módulos requeridos, incluyendo los actuales. \n* Si se solicitan varios módulos, relacionarlos en orden de necesidad.\n1. Metas Sociales y Financieras (MSF) \n2. Atención al Ciudadano (AAC) \n3. Beneficiarios (BEN) \n4. Adopciones (ADO) \n5. Pruebas de Filiación (PGE) \n7. Seguimiento a planes, programas y proyectos (SPR) \n8. Capacitación (CAP) \n9. Administración Unidades de Servicio (AUS)"]
[null,"Para el Sistema de Información SEVEN ERP","Justificación:\nPor favor realice una pequeña justificación del porqué de la creación del usuario en el aplicativo"]
[null,null,"Autorizado por:\nDebe digitar los nombres y apellidos de la persona que autoriza la creación del usuario."]
[null,null,"Cargo de quien Auoriza:\nDebe diligenciar el cargo de la persona que autoriza la creación del usuario."]
[]
[null,"Antes de imprimir este documento… piense en el medio ambiente!  \nCualquier copia impresa de este documento se considera como COPIA NO CONTROLADA.\nLOS DATOS PROPORCIONADOS SERÁN TRATADOS DE ACUERDO A LA POLÌTICA DE TRATAMIENTO DE DATOS PERSONALES DEL ICBF Y A LA LEY 1581 DE 2012"]

{"sheet":"Formato","index":1,"n_rows":111,"n_cols":29,"rows_kept":111,"cut":false,"hidden":true,"merged":[[110,1,110,13],[3,12,3,13],[1,1,3,3],[6,1,6,4],[5,1,5,4],[6,5,6,12],[1,4,3,11]]}
[]
[null,null,null,null,"PROCESO GESTIÓN DE LA TECNOLOGÍA E INFORMACIÓN \nFORMATO DE GESTION DE USUARIOS SISTEMAS DE INFORMACION",null,null,null,null,null,null,null,"F8.P2.GTI","2018-10-05"]
[null,null,null,null,null,null,null,null,null,null,null,null,"Versión 2","Página 1 de 1"]
[null,null,null,null,null,null,null,null,null,null,null,null,"Clasificación de la información: \nClasificada"]
[]
[null,"ELIJA EL SISTEMA DE INFORMACION PARA EL CUAL SE REQUIERE EL SERVICIO"]
[null,null,null,null,null,"Diligencie las celdas sombreadas"]
[]
[]
[null,"Servicio Solicitado","Tipo Documento","Numero documento","Primer Nombre","Segundo Nombre","Primer Apellido","Segundo Apellido","Direccion","Telefono","Correo Electronico","Regional","Area / Centro Zonal",{"$f":"IF(B7=\"NMF\",\"Usuario NMF\",IF(B7=\"SEVEN_ERP\",\"Autorizado por\",\"Genero\"))","v":"Genero"},{"$f":"IF(B7=\"NMF\",\"Rol NMF\",\"\")","v":""},{"$f":"IF(B7=\"NMF\",\"Cargo\",IF(B7=\"SEVEN_ERP\",\"Cargo de quien Autoriza\",\"Fecha de Nacimiento\"))","v":"Fecha de Nacimiento"},{"$f":"IF(B7=\"SIM\",\"Usuario en SIM\",IF(B7=\"NMF\",\"Nombre de quien Autoriza\",IF(B7=\"SINAD\",\"Orden\",IF(B7=\"SEVEN_ERP\",\"Justificación\",\"\"))))","v":""},{"$f":"IF($B$7=\"SIM\",\"Descripcion de la solicitud\",IF($B$7=\"NMF\",\"Cargo de quien Autoriza\",IF($B$7=\"SINAD\",\"Nro. Equipo Actual\",\"\")))","v":""},{"$f":"IF(B7=\"SIM\",\"Perfil del Usuario\",IF(B7=\"SINAD\",\"Nro. Equipo Nuevo\",\"\"))","v":""},{"$f":"IF(B7=\"SIM\",\"Perfil Profesional\",IF(B7=\"SINAD\",\"Observaciones\",\"\"))","v":""},{"$f":"IF(B7=\"SIM\",\"Profesión\",IF(B7=\"NMF\",\"Cargo de quien autoriza\",\" \"))","v":" "},"Actividades a realizar en el SIM","Módulos","Pertenece al grupo Asistencial Apoyo a Grupo Psicosocial","Operador ICBF",null,null,"Regional_DA"]
[null,null,null,null,null,null,null,null,null,null,null,null,null,null,null,null,null,null,null,null,null,null,null,null,null,null,{"$f":"IFERROR(VLOOKUP(B7,Listas!U2:W4,2,0),\"\")","v":""},{"$f":"IFERROR(VLOOKUP(L11,Listas!$H$2:$I$35,2,0),\"\")","v":""},{"$f":"IFERROR(VLOOKUP(H11,Listas!$K$2:$L$21,2,0),\"\")","v":""}]
[null,null,null,null,null,null,null,null,null,null,null,null,null,null,null,null,null,null,null,null,null,null,null,null,null,null,{"$f":"IFERROR(VLOOKUP(H12,Listas!#REF!,2,0),\"\")","v":""},{"$f":"IFERROR(VLOOKUP(L12,Listas!$H$2:$I$35,2,0),\"\")","v":""},{"$f":"IFERROR(VLOOKUP(H12,Listas!$K$2:$L$21,2,0),\"\")","v":""}]
[null,null,null,null,null,null,null,null,null,null,null,null,null,null,null,null,null,null,null,null,null,null,null,null,null,null,{"$f":"IFERROR(VLOOKUP(H13,Listas!#REF!,2,0),\"\")","v":""},{"$f":"IFERROR(VLOOKUP(L13,Listas!$H$2:$I$35,2,0),\"\")","v":""},{"$f":"IFERROR(VLOOKUP(H13,Listas!$K$2:$L$21,2,0),\"\")","v":""}]
[null,null,null,null,null,null,null,null,null,null,null,null,null,null,null,null,null,null,null,null,null,null,null,null,null,null,{"$f":"IFERROR(VLOOKUP(H14,Listas!#REF!,2,0),\"\")","v":""},{"$f":"IFERROR(VLOOKUP(L14,Listas!$H$2:$I$35,2,0),\"\")","v":""},{"$f":"IFERROR(VLOOKUP(H14,Listas!$K$2:$L$21,2,0),\"\")","v":""}]
[null,null,null,null,null,null,null,null,null,null,null,null,null,null,null,null,null,null,null,null,null,null,null,null,null,null,{"$f":"IFERROR(VLOOKUP(H15,Listas!#REF!,2,0),\"\")","v":""},{"$f":"IFERROR(VLOOKUP(L15,Listas!$H$2:$I$35,2,0),\"\")","v":""},{"$f":"IFERROR(VLOOKUP(H15,Listas!$K$2:$L$21,2,0),\"\")","v":""}]
[null,null,null,null,null,null,null,null,null,null,null,null,null,null,null,null,null,null,null,null,null,null,null,null,null,null,{"$f":"IFERROR(VLOOKUP(H16,Listas!#REF!,2,0),\"\")","v":""},{"$f":"IFERROR(VLOOKUP(L16,Listas!$H$2:$I$35,2,0),\"\")","v":""},{"$f":"IFERROR(VLOOKUP(H16,Listas!$K$2:$L$21,2,0),\"\")","v":""}]
[null,null,null,null,null,null,null,null,null,null,null,null,null,null,null,null,null,null,null,null,null,null,null,null,null,null,{"$f":"IFERROR(VLOOKUP(H17,Listas!#REF!,2,0),\"\")","v":""},{"$f":"IFERROR(VLOOKUP(L17,Listas!$H$2:$I$35,2,0),\"\")","v":""},{"$f":"IFERROR(VLOOKUP(H17,Listas!$K$2:$L$21,2,0),\"\")","v":""}]
[null,null,null,null,null,null,null,null,null,null,null,null,null,null,null,null,null,null,null,null,null,null,null,null,null,null,{"$f":"IFERROR(VLOOKUP(H18,Listas!#REF!,2,0),\"\")","v":""},{"$f":"IFERROR(VLOOKUP(L18,Listas!$H$2:$I$35,2,0),\"\")","v":""},{"$f":"IFERROR(VLOOKUP(H18,Listas!$K$2:$L$21,2,0),\"\")","v":""}]
[null,null,null,null,null,null,null,null,null,null,null,null,null,null,null,null,null,null,null,null,null,null,null,null,null,null,{"$f":"IFERROR(VLOOKUP(H19,Listas!#REF!,2,0),\"\")","v":""},{"$f":"IFERROR(VLOOKUP(L19,Listas!$H$2:$I$35,2,0),\"\")","v":""},{"$f":"IFERROR(VLOOKUP(H19,Listas!$K$2:$L$21,2,0),\"\")","v":""}]
[null,null,null,null,null,null,null,null,null,null,null,null,null,null,null,null,null,null,null,null,null,null,null,null,null,null,{"$f":"IFERROR(VLOOKUP(H20,Listas!#REF!,2,0),\"\")","v":""},{"$f":"IFERROR(VLOOKUP(L20,Listas!$H$2:$I$35,2,0),\"\")","v":""},{"$f":"IFERROR(VLOOKUP(H20,Listas!$K$2:$L$21,2,0),\"\")","v":""}]
[null,null,null,null,null,null,null,null,null,null,null,null,null,null,null,null,null,null,null,null,null,null,null,null,null,null,{"$f":"IFERROR(VLOOKUP(H21,Listas!#REF!,2,0),\"\")","v":""},{"$f":"IFERROR(VLOOKUP(L21,Listas!$H$2:$I$35,2,0),\"\")","v":""},{"$f":"IFERROR(VLOOKUP(H21,Listas!$K$2:$L$21,2,0),\"\")","v":""}]
[null,null,null,null,null,null,null,null,null,null,null,null,null,null,null,null,null,null,null,null,null,null,null,null,null,null,{"$f":"IFERROR(VLOOKUP(H22,Listas!#REF!,2,0),\"\")","v":""},{"$f":"IFERROR(VLOOKUP(L22,Listas!$H$2:$I$35,2,0),\"\")","v":""},{"$f":"IFERROR(VLOOKUP(H22,Listas!$K$2:$L$21,2,0),\"\")","v":""}]
[null,null,null,null,null,null,null,null,null,null,null,null,null,null,null,null,null,null,null,null,null,null,null,null,null,null,{"$f":"IFERROR(VLOOKUP(H23,Listas!#REF!,2,0),\"\")","v":""},{"$f":"IFERROR(VLOOKUP(L23,Listas!$H$2:$I$35,2,0),\"\")","v":""},{"$f":"IFERROR(VLOOKUP(H23,Listas!$K$2:$L$21,2,0),\"\")","v":""}]
[null,null,null,null,null,null,null,null,null,null,null,null,null,null,null,null,null,null,null,null,null,null,null,null,null,null,{"$f":"IFERROR(VLOOKUP(H24,Listas!#REF!,2,0),\"\")","v":""},{"$f":"IFERROR(VLOOKUP(L24,Listas!$H$2:$I$35,2,0),\"\")","v":""},{"$f":"IFERROR(VLOOKUP(H24,Listas!$K$2:$L$21,2,0),\"\")","v":""}]
[null,null,null,null,null,null,null,null,null,null,null,null,null,null,null,null,null,null,null,null,null,null,null,null,null,null,{"$f":"IFERROR(VLOOKUP(H25,Listas!#REF!,2,0),\"\")","v":""},{"$f":"IFERROR(VLOOKUP(L25,Listas!$H$2:$I$35,2,0),\"\")","v":""},{"$f":"IFERROR(VLOOKUP(H25,Listas!$K$2:$L$21,2,0),\"\")","v":""}]
[null,null,null,null,null,null,null,null,null,null,null,null,null,null,null,null,null,null,null,null,null,null,null,null,null,null,{"$f":"IFERROR(VLOOKUP(H26,Listas!#REF!,2,0),\"\")","v":""},{"$f":"IFERROR(VLOOKUP(L26,Listas!$H$2:$I$35,2,0),\"\")","v":""},{"$f":"IFERROR(VLOOKUP(H26,Listas!$K$2:$L$21,2,0),\"\")","v":""}]
[null,null,null,null,null,null,null,null,null,null,null,null,null,null,null,null,null,null,null,null,null,null,null,null,null,null,{"$f":"IFERROR(VLOOKUP(H27,Listas!#REF!,2,0),\"\")","v":""},{"$f":"IFERROR(VLOOKUP(L27,Listas!$H$2:$I$35,2,0),\"\")","v":""},{"$f":"IFERROR(VLOOKUP(H27,Listas!$K$2:$L$21,2,0),\"\")","v":""}]
[null,null,null,null,null,null,null,null,null,null,null,null,null,null,null,null,null,null,null,null,null,null,null,null,null,null,{"$f":"IFERROR(VLOOKUP(H28,Listas!#REF!,2,0),\"\")","v":""},{"$f":"IFERROR(VLOOKUP(L28,Listas!$H$2:$I$35,2,0),\"\")","v":""},{"$f":"IFERROR(VLOOKUP(H28,Listas!$K$2:$L$21,2,0),\"\")","v":""}]
[null,null,null,null,null,null,null,null,null,null,null,null,null,null,null,null,null,null,null,null,null,null,null,null,null,null,{"$f":"IFERROR(VLOOKUP(H29,Listas!#REF!,2,0),\"\")","v":""},{"$f":"IFERROR(VLOOKUP(L29,Listas!$H$2:$I$35,2,0),\"\")","v":""},{"$f":"IFERROR(VLOOKUP(H29,Listas!$K$2:$L$21,2,0),\"\")","v":""}]
[null,null,null,null,null,null,null,null,null,null,null,null,null,null,null,null,null,null,null,null,null,null,null,null,null,null,{"$f":"IFERROR(VLOOKUP(H30,Listas!#REF!,2,0),\"\")","v":""},{"$f":"IFERROR(VLOOKUP(L30,Listas!$H$2:$I$35,2,0),\"\")","v":""},{"$f":"IFERROR(VLOOKUP(H30,Listas!$K$2:$L$21,2,0),\"\")","v":""}]
{"$rows_left_out":82}
{"sheet":"Listas","index":2,"n_rows":477,"n_cols":31,"rows_kept":477,"cut":false,"hidden":true,"merged":[]}
["StateID","OfficeID","GroupID","Regional","Area",null,"Regional","Sedes","Regional",null,null,null,"Cargos","Aplicaciones",null,"Servicio Solicitado SIM",null,"Servicio Solicitado NMF",null,"Servicio Solicitado SINAD",null,null,"Servicio Solicitado SEVEN ERP",null,"Profesiones",null,"SIM OP",null,"Tipo documento",null,"Rol"]
[1,10000,0,"Sede de la Direccion General","Direccion Administrativa",null,"Sede_de_la_Direccion_General","Sede de la Direccion General","Sede_de_la_Direccion_General","Planta ","Planta","Planta_cargo","Asesor","SIM","SIM","Crear Usuario","NMF","Crear Usuario","SINAD","Crear Usuario","SEVEN ERP","SEVEN_ERP","Crear Usuario",null,"Abogado",null,"SI","Registrar","C.C.",null,"ADMINISTRADORNMF"]
[1,10100,0,"Sede de la Direccion General","Direccion de Contratacion",null,"Regional_Amazonas","Regional Amazonas","Regional_Amazonas","Contrato","Planta","Planta_cargo","Auxiliar Administrativo","NMF","SIM","Activar Usuario","NMF","Modifiicar Usuario","SINAD","Modifiicar Usuario","SEVEN ERP","SEVEN_ERP","Modifiicar Usuario",null,"Administrador Aeronautico",null,"NO","Consultar","C.E.",null,"ADMINISTRADORNMF"]
[1,10101,0,"Sede de la Direccion General","Direccion de Familias y Comunidades",null,"Regional_Antioquia","Regional Antioquia","Regional_Antioquia",null,"Planta","Planta_cargo","Conductor Mecanico","SINAD","SIM","Desactivar Usuario","NMF","Activar Usuario","SINAD","Inactivar Usuario","SEVEN ERP","SEVEN_ERP","Inactivar Usuario",null,"Administrador De Empresas",null,null,null,"PAS",null,"APROPIACION"]
[1,10102,0,"Sede de la Direccion General","Direccion de Gestion Humana",null,"Regional_Arauca","Regional Arauca","Regional_Arauca",null,"Planta","Planta_cargo","Defensor de Familia","SEVEN_ERP","SIM","Adicionar Permisos","NMF","Inactivar Usuario",null,null,null,null,null,null,"Administrador De Empresas Agropecuarias",null,null,null,"T.I.",null,"PROGRAMACION"]
[1,10200,0,"Sede de la Direccion General","Direccion de Informacion y Tecnologia",null,"Regional_Atlantico","Regional Atlantico","Regional_Atlantico",null,"Planta","Planta_cargo","Director General",null,"SIM","Modificar Usuario",null,null,null,null,null,null,null,null,"Administrador De Empresas Turisticas Y Hoteleras",null,null,null,null,null,"PARAM NAC"]
[1,10300,0,"Sede de la Direccion General","Direccion de Logistica y Abastecimiento",null,"Regional_Bogota","Regional Bogota","Regional_Bogota",null,"Planta","Planta_cargo","Director Regional",null,"SIM","Modificar Sucursal",null,null,null,null,null,null,null,null,"Administrador De Instituciones De Servicio",null,null,null,null,null,"PARAMETRIZACION REGI"]
[1,10301,0,"Sede de la Direccion General","Direccion de Niñez y Adolescencia",null,"Regional_Bolivar","Regional Bolivar","Regional_Bolivar",null,"Planta","Planta_cargo","Director Tecnico",null,"SIM","Quitar Permisos",null,null,null,null,null,null,null,null,"Administrador De Negocios",null,null,null,null,null,"MODIFICACIONES"]
[1,10302,0,"Sede de la Direccion General","Direccion de Nutricion",null,"Regional_Boyaca","Regional Boyaca","Regional_Boyaca",null,"Planta","Planta_cargo","Jefe De Oficina",null,null,null,null,null,null,null,null,null,null,null,"Administrador De Negocios Internacionales",null,null,null,null,null,"CONTADOR_REGIONAL"]
[1,10303,0,"Sede de la Direccion General","Direccion de Planeacion y Control de Gestion",null,"Regional_Caldas","Regional Caldas","Regional_Caldas",null,"Planta","Planta_cargo","Jefe De Oficina Asesora",null,null,null,null,null,null,null,null,null,null,null,"Administrador De Sistemas Informaticos",null,null,null,null,null,"CONTADOR_NACIONAL"]
[1,10304,0,"Sede de la Direccion General","Direccion de Primera Infancia",null,"Regional_Caqueta","Regional Caqueta","Regional_Caqueta",null,"Planta","Planta_cargo","Profesional Especializado",null,null,null,null,null,null,null,null,null,null,null,"Administrador Del Medio Ambiente",null,null,null,null,null,"ADM_PARAMETRI"]
[1,10400,0,"Sede de la Direccion General","Direccion de Proteccion",null,"Regional_Casanare","Regional Casanare","Regional_Casanare",null,"Planta","Planta_cargo","Profesional Universitario",null,null,null,null,null,null,null,null,null,null,null,"Administrador Del Medio Ambiente Y De Los Recursos Nturales",null,null,null,null,null,"ASESOR CONTABLE"]
[1,10401,0,"Sede de la Direccion General","Direccion de Servicios y Atencion",null,"Regional_Cauca","Regional Cauca","Regional_Cauca",null,"Planta","Planta_cargo","Secretario",null,null,null,null,null,null,null,null,null,null,null,"Administrador En Salud",null,null,null,null,null,"ADMIN_BANCOS"]
[1,10402,0,"Sede de la Direccion General","Direccion de Sistema Nacional de Bienestar Familiar",null,"Regional_Cesar","Regional Cesar","Regional_Cesar",null,"Planta","Planta_cargo","Secretario Ejecutivo",null,null,null,null,null,null,null,null,null,null,null,"Administrador Maritimo",null,null,null,null,null,"CONSULTA_BANCOS"]
[1,10403,0,"Sede de la Direccion General","Direccion Financiera",null,"Regional_Choco","Regional Choco","Regional_Choco",null,"Planta","Planta_cargo","Secretario General",null,null,null,null,null,null,null,null,null,null,null,"Administrador Policial",null,null,null,null,null,"CONSULTA"]
[1,10404,0,"Sede de la Direccion General","Direccion General",null,"Regional_Cordoba","Regional Cordoba","Regional_Cordoba",null,"Planta","Planta_cargo","Subdirector General",null,null,null,null,null,null,null,null,null,null,null,"Administrador Publico",null,null,null,null,null,"ADMIN PRESUPUESTO"]
[1,10405,0,"Sede de la Direccion General","Grupo de Administracion de Carrera Administrativa",null,"Regional_Cundinamarca","Regional Cundinamarca","Regional_Cundinamarca",null,"Planta","Planta_cargo","Subdirector Tecnico",null,null,null,null,null,null,null,null,null,null,null,"Administrador Turistico Y Hotelero",null,null,null,null,null,"SUBDIREC. PLANEACION"]
[null,null,null,"Sede de la Direccion General","Grupo de Almacen e Inventarios",null,"Regional_Guainia","Regional Guainia","Regional_Guainia",null,"Planta","Planta_cargo","Tecnico Administrativo",null,null,null,null,null,null,null,null,null,null,null,"Agronomo(A)",null,null,null,null,null,"PROF. PLANEACION"]
[1,10500,0,"Sede de la Direccion General","Grupo de Apoyo Logistico",null,"Regional_Guajira","Regional Guajira","Regional_Guajira",null,"Ente de Control","Ente_Control_cargo","Ente de control",null,null,null,null,null,null,null,null,null,null,null,"Antropologo",null,null,null,null,null,"ASESOR PRESUPUESTO"]
[1,10501,0,"Sede de la Direccion General","Grupo de Asesoria Juridica",null,"Regional_Guaviare","Regional Guaviare","Regional_Guaviare",null,"Contratista","contratista_cargo","Contratista",null,null,null,null,null,null,null,null,null,null,null,"Arquitecto(A)",null,null,null,null,null,"GERENTE DE RECURSO"]
[1,10502,0,"Sede de la Direccion General","G. Asistencia Tecnica del Sistema de Aseguramiento de la Calidad",null,"Regional_Huila","Regional Huila","Regional_Huila",null,"Estudiante","Estudiante_cargo","Estudiante",null,null,null,null,null,null,null,null,null,null,null,"Auxiliar De Trabajo Social",null,null,null,null,null,"PROFESIONAL AREA"]
[1,10503,0,"Sede de la Direccion General","Grupo de Auditorias de Calidad",null,"Regional_Magdalena","Regional Magdalena","Regional_Magdalena",null,null,null,null,null,null,null,null,null,null,null,null,null,null,null,"Bacteriologo(A)",null,null,null,null,null,"ANALISTA PPTO REG."]
[1,10600,0,"Sede de la Direccion General","Grupo de Comunicacion Externa",null,"Regional_Meta","Regional Meta","Regional_Meta",null,null,null,null,null,null,null,null,null,null,null,null,null,null,null,"Bibliotecologo(A)",null,null,null,null,null,"SOLI CDP REGI"]
[1,11000,0,"Sede de la Direccion General","Grupo de Comunicacion Interna",null,"Regional_Nariño","Regional Nariño","Regional_Nariño",null,null,null,null,null,null,null,null,null,null,null,null,null,null,null,"Biologo(A)",null,null,null,null,null,"SEVEN"]
[1,12000,0,"Sede de la Direccion General","Grupo de Contabilidad",null,"Regional_Norte_de_Santander","Regional Norte de Santander","Regional_Norte_de_Santander",null,null,null,null,null,null,null,null,null,null,null,null,null,null,null,"Biologo(A) Maritima",null,null,null,null,null,"CONTADOR NIVEL NACI"]
[1,12100,0,"Sede de la Direccion General","Grupo de Control Constitucional y Estrategias Juridicas",null,"Regional_Putumayo","Regional Putumayo","Regional_Putumayo",null,null,null,null,null,null,null,null,null,null,null,null,null,null,null,"Carpintero",null,null,null,null,null,"ASESOR_CONT_NN"]
[1,12101,0,"Sede de la Direccion General","Grupo de Coordinacion de Autoridades Administrativas",null,"Regional_Quindio","Regional Quindio","Regional_Quindio",null,null,null,null,null,null,null,null,null,null,null,null,null,null,null,"Comunicador Social",null,null,null,null,null,"CONTADOR REGIONAL"]
[1,12102,0,"Sede de la Direccion General","Grupo de Desarrollo del Talento Humano",null,"Regional_Risaralda","Regional Risaralda","Regional_Risaralda",null,null,null,null,null,null,null,null,null,null,null,null,null,null,null,"Comunicador Social Y Periodismo",null,null,null,null,null,"APOYO CONTABILIDAD R"]
[1,12103,0,"Sede de la Direccion General","Grupo de Estadistica y Gestion de Informacion",null,"Regional_San_Andres","Regional San Andres","Regional_San_Andres",null,null,null,null,null,null,null,null,null,null,null,null,null,null,null,"Comunicdor Y Relaciones Corporativas",null,null,null,null,null,"TESORERO NIVEL_NAL"]
[1,12104,0,"Sede de la Direccion General","Grupo de Familia",null,"Regional_Santander","Regional Santander","Regional_Santander",null,null,null,null,null,null,null,null,null,null,null,null,null,null,null,"Constructor",null,null,null,null,null,"ASESOR TESOR NN"]
{"$rows_left_out":447}