{"text_format":"1","workbook":"xlsx","n_sheets":3,"sheets":["Recaudo","Jurídica","Diferencia"],"not_rendered":{"charts":0,"images":2,"macros":0,"external_links":0,"defined_names":7,"comments":0,"pivot_tables":1},"unopened":[],"bounds":{"document_bytes":16777216,"sheet_cells":100000,"rows_first":2000,"rows_last":500,"rows_between":2000,"halvings":0,"cell_chars":16384,"cell_head_chars":4096},"cells_cut":0,"cells_raw":0,"read":"whole","date_system":"1900"}

{"sheet":"Recaudo","index":0,"n_rows":80,"n_cols":7,"rows_kept":80,"cut":false,"hidden":false,"merged":[]}
["Nit","Saldo","Nit","Saldo Recaudo","Resolución","Naturaleza de la Obligación de Cartera","Razón Social"]
[null,null,{"$f":"LEFT(SUBSTITUTE(IFERROR(LEFT(A2,SEARCH(\"-\",A2)-1),A2),\" \",\"\"),LEN(A2))*1","v":{"$error":"#VALUE!"}},{"$f":"LEFT(SUBSTITUTE(IFERROR(LEFT(B2,SEARCH(\"-\",B2)-1),B2),\"o\",\"0\"),LEN(B2))*1","v":{"$error":"#VALUE!"}}]
[null,null,{"$f":"LEFT(SUBSTITUTE(IFERROR(LEFT(A3,SEARCH(\"-\",A3)-1),A3),\" \",\"\"),LEN(A3))*1","v":{"$error":"#VALUE!"}},{"$f":"LEFT(SUBSTITUTE(IFERROR(LEFT(B3,SEARCH(\"-\",B3)-1),B3),\"o\",\"0\"),LEN(B3))*1","v":{"$error":"#VALUE!"}}]
[null,null,{"$error":"#VALUE!"},{"$error":"#VALUE!"}]
[null,null,{"$error":"#VALUE!"},{"$error":"#VALUE!"}]
[null,null,{"$error":"#VALUE!"},{"$error":"#VALUE!"}]
[null,null,{"$error":"#VALUE!"},{"$error":"#VALUE!"}]
[null,null,{"$error":"#VALUE!"},{"$error":"#VALUE!"}]
[null,null,{"$error":"#VALUE!"},{"$error":"#VALUE!"}]
[null,null,{"$error":"#VALUE!"},{"$error":"#VALUE!"}]
[null,null,{"$error":"#VALUE!"},{"$error":"#VALUE!"}]
[null,null,{"$error":"#VALUE!"},{"$error":"#VALUE!"}]
[null,null,{"$error":"#VALUE!"},{"$error":"#VALUE!"}]
[null,null,{"$error":"#VALUE!"},{"$error":"#VALUE!"}]
[null,null,{"$error":"#VALUE!"},{"$error":"#VALUE!"}]
[null,null,{"$error":"#VALUE!"},{"$error":"#VALUE!"}]
[null,null,{"$error":"#VALUE!"},{"$error":"#VALUE!"}]
[null,null,{"$error":"#VALUE!"},{"$error":"#VALUE!"}]
[null,null,{"$error":"#VALUE!"},{"$error":"#VALUE!"}]
[null,null,{"$error":"#VALUE!"},{"$error":"#VALUE!"}]
[null,null,{"$error":"#VALUE!"},{"$error":"#VALUE!"}]
[null,null,{"$error":"#VALUE!"},{"$error":"#VALUE!"}]
[null,null,{"$error":"#VALUE!"},{"$error":"#VALUE!"}]
[null,null,{"$error":"#VALUE!"},{"$error":"#VALUE!"}]
[null,null,{"$error":"#VALUE!"},{"$error":"#VALUE!"}]
[null,null,{"$error":"#VALUE!"},{"$error":"#VALUE!"}]
[null,null,{"$error":"#VALUE!"},{"$error":"#VALUE!"}]
[null,null,{"$error":"#VALUE!"},{"$error":"#VALUE!"}]
[null,null,{"$error":"#VALUE!"},{"$error":"#VALUE!"}]
[null,null,{"$error":"#VALUE!"},{"$error":"#VALUE!"}]
[null,null,{"$error":"#VALUE!"},{"$error":"#VALUE!"}]
[null,null,{"$error":"#VALUE!"},{"$error":"#VALUE!"}]
[null,null,{"$error":"#VALUE!"},{"$error":"#VALUE!"}]
[null,null,{"$error":"#VALUE!"},{"$error":"#VALUE!"}]
[null,null,{"$error":"#VALUE!"},{"$error":"#VALUE!"}]
[null,null,{"$error":"#VALUE!"},{"$error":"#VALUE!"}]
[null,null,{"$error":"#VALUE!"},{"$error":"#VALUE!"}]
[null,null,{"$error":"#VALUE!"},{"$error":"#VALUE!"}]
[null,null,{"$error":"#VALUE!"},{"$error":"#VALUE!"}]
[null,null,{"$error":"#VALUE!"},{"$error":"#VALUE!"}]
{"$rows_left_out":41}
{"sheet":"Jurídica","index":1,"n_rows":80,"n_cols":5,"rows_kept":80,"cut":false,"hidden":false,"merged":[]}
["Nit","Saldo","Nit","Saldo Jurídica","Razón Social"]
[null,null,{"$f":"LEFT(SUBSTITUTE(IFERROR(LEFT(A2,SEARCH(\"-\",A2)-1),A2),\" \",\"\"),LEN(A2))*1","v":{"$error":"#VALUE!"}},{"$f":"LEFT(SUBSTITUTE(IFERROR(LEFT(B2,SEARCH(\"-\",B2)-1),B2),\"o\",\"0\"),LEN(B2))*1","v":{"$error":"#VALUE!"}}]
[null,null,{"$f":"LEFT(SUBSTITUTE(IFERROR(LEFT(A3,SEARCH(\"-\",A3)-1),A3),\" \",\"\"),LEN(A3))*1","v":{"$error":"#VALUE!"}},{"$f":"LEFT(SUBSTITUTE(IFERROR(LEFT(B3,SEARCH(\"-\",B3)-1),B3),\"o\",\"0\"),LEN(B3))*1","v":{"$error":"#VALUE!"}}]
[null,null,{"$f":"LEFT(SUBSTITUTE(IFERROR(LEFT(A4,SEARCH(\"-\",A4)-1),A4),\" \",\"\"),LEN(A4))*1","v":{"$error":"#VALUE!"}},{"$error":"#VALUE!"}]
[null,null,{"$error":"#VALUE!"},{"$error":"#VALUE!"}]
[null,null,{"$f":"LEFT(SUBSTITUTE(IFERROR(LEFT(A6,SEARCH(\"-\",A6)-1),A6),\" \",\"\"),LEN(A6))*1","v":{"$error":"#VALUE!"}},{"$error":"#VALUE!"}]
[null,null,{"$error":"#VALUE!"},{"$error":"#VALUE!"}]
[null,null,{"$error":"#VALUE!"},{"$f":"LEFT(SUBSTITUTE(IFERROR(LEFT(B8,SEARCH(\"-\",B8)-1),B8),\"o\",\"0\"),LEN(B8))*1","v":{"$error":"#VALUE!"}}]
[null,null,{"$error":"#VALUE!"},{"$error":"#VALUE!"}]
[null,null,{"$error":"#VALUE!"},{"$error":"#VALUE!"}]
[null,null,{"$error":"#VALUE!"},{"$error":"#VALUE!"}]
[null,null,{"$error":"#VALUE!"},{"$error":"#VALUE!"}]
[null,null,{"$error":"#VALUE!"},{"$error":"#VALUE!"}]
[null,null,{"$error":"#VALUE!"},{"$error":"#VALUE!"}]
[null,null,{"$error":"#VALUE!"},{"$error":"#VALUE!"}]
[null,null,{"$error":"#VALUE!"},{"$error":"#VALUE!"}]
[null,null,{"$error":"#VALUE!"},{"$error":"#VALUE!"}]
[null,null,{"$error":"#VALUE!"},{"$error":"#VALUE!"}]
[null,null,{"$error":"#VALUE!"},{"$error":"#VALUE!"}]
[null,null,{"$error":"#VALUE!"},{"$error":"#VALUE!"}]
[null,null,{"$error":"#VALUE!"},{"$error":"#VALUE!"}]
[null,null,{"$error":"#VALUE!"},{"$error":"#VALUE!"}]
[null,null,{"$error":"#VALUE!"},{"$error":"#VALUE!"}]
[null,null,{"$error":"#VALUE!"},{"$error":"#VALUE!"}]
[null,null,{"$error":"#VALUE!"},{"$error":"#VALUE!"}]
[null,null,{"$error":"#VALUE!"},{"$error":"#VALUE!"}]
[null,null,{"$error":"#VALUE!"},{"$error":"#VALUE!"}]
[null,null,{"$error":"#VALUE!"},{"$error":"#VALUE!"}]
[null,null,{"$error":"#VALUE!"},{"$error":"#VALUE!"}]
[null,null,{"$error":"#VALUE!"},{"$error":"#VALUE!"}]
[null,null,{"$error":"#VALUE!"},{"$error":"#VALUE!"}]
[null,null,{"$error":"#VALUE!"},{"$error":"#VALUE!"}]
[null,null,{"$error":"#VALUE!"},{"$error":"#VALUE!"}]
[null,null,{"$error":"#VALUE!"},{"$error":"#VALUE!"}]
[null,null,{"$error":"#VALUE!"},{"$error":"#VALUE!"}]
[null,null,{"$error":"#VALUE!"},{"$error":"#VALUE!"}]
[null,null,{"$error":"#VALUE!"},{"$error":"#VALUE!"}]
[null,null,{"$error":"#VALUE!"},{"$error":"#VALUE!"}]
[null,null,{"$error":"#VALUE!"},{"$error":"#VALUE!"}]
[null,null,{"$error":"#VALUE!"},{"$error":"#VALUE!"}]
{"$rows_left_out":41}
{"sheet":"Diferencia","index":2,"n_rows":80,"n_cols":10,"rows_kept":80,"cut":false,"hidden":false,"merged":[]}
["Página1","(Todas)"]
[]
["Suma de Valor","Columna"]
["NIT","Saldo Recaudo","Saldo Jurídica","Total general","Diferencia","Resolucíon","Concepto de Cartera en Recaudo","Razón Social Recaudo","Razón Social Jurídica","Observaciones"]
["#¡VALOR!",{"$error":"#VALUE!"},{"$error":"#VALUE!"},{"$error":"#VALUE!"},{"$f":"+B5-C5","v":{"$error":"#VALUE!"}},{"$f":"VLOOKUP(A5,Recaudo!$C$2:$E$80,3,FALSE)","v":{"$error":"#N/A"}},{"$f":"VLOOKUP(A5,Recaudo!$C$2:$F$80,4,FALSE)","v":{"$error":"#N/A"}},{"$f":"VLOOKUP(A5,Recaudo!$C$2:$G$80,5,FALSE)","v":{"$error":"#N/A"}},{"$f":"VLOOKUP(A5,Jurídica!$C$2:$E$80,3,FALSE)","v":{"$error":"#N/A"}}]
["Total general",{"$error":"#VALUE!"},{"$error":"#VALUE!"},{"$error":"#VALUE!"},{"$f":"+B6-C6","v":{"$error":"#VALUE!"}},{"$f":"VLOOKUP(A6,Recaudo!$C$2:$E$80,3,FALSE)","v":{"$error":"#N/A"}},{"$f":"VLOOKUP(A6,Recaudo!$C$2:$F$80,4,FALSE)","v":{"$error":"#N/A"}},{"$f":"VLOOKUP(A6,Recaudo!$C$2:$G$80,5,FALSE)","v":{"$error":"#N/A"}},{"$f":"VLOOKUP(A6,Jurídica!$C$2:$E$80,3,FALSE)","v":{"$error":"#N/A"}}]
[null,null,null,null,0,{"$f":"VLOOKUP(A7,Recaudo!$C$2:$E$80,3,FALSE)","v":{"$error":"#N/A"}},{"$f":"VLOOKUP(A7,Recaudo!$C$2:$F$80,4,FALSE)","v":{"$error":"#N/A"}},{"$f":"VLOOKUP(A7,Recaudo!$C$2:$G$80,5,FALSE)","v":{"$error":"#N/A"}},{"$f":"VLOOKUP(A7,Jurídica!$C$2:$E$80,3,FALSE)","v":{"$error":"#N/A"}}]
[null,null,null,null,0,{"$f":"VLOOKUP(A8,Recaudo!$C$2:$E$80,3,FALSE)","v":{"$error":"#N/A"}},{"$f":"VLOOKUP(A8,Recaudo!$C$2:$F$80,4,FALSE)","v":{"$error":"#N/A"}},{"$f":"VLOOKUP(A8,Recaudo!$C$2:$G$80,5,FALSE)","v":{"$error":"#N/A"}},{"$f":"VLOOKUP(A8,Jurídica!$C$2:$E$80,3,FALSE)","v":{"$error":"#N/A"}}]
[null,null,null,null,0,{"$f":"VLOOKUP(A9,Recaudo!$C$2:$E$80,3,FALSE)","v":{"$error":"#N/A"}},{"$f":"VLOOKUP(A9,Recaudo!$C$2:$F$80,4,FALSE)","v":{"$error":"#N/A"}},{"$f":"VLOOKUP(A9,Recaudo!$C$2:$G$80,5,FALSE)","v":{"$error":"#N/A"}},{"$f":"VLOOKUP(A9,Jurídica!$C$2:$E$80,3,FALSE)","v":{"$error":"#N/A"}}]
[null,null,null,null,0,{"$f":"VLOOKUP(A10,Recaudo!$C$2:$E$80,3,FALSE)","v":{"$error":"#N/A"}},{"$f":"VLOOKUP(A10,Recaudo!$C$2:$F$80,4,FALSE)","v":{"$error":"#N/A"}},{"$f":"VLOOKUP(A10,Recaudo!$C$2:$G$80,5,FALSE)","v":{"$error":"#N/A"}},{"$f":"VLOOKUP(A10,Jurídica!$C$2:$E$80,3,FALSE)","v":{"$error":"#N/A"}}]
[null,null,null,null,0,{"$f":"VLOOKUP(A11,Recaudo!$C$2:$E$80,3,FALSE)","v":{"$error":"#N/A"}},{"$f":"VLOOKUP(A11,Recaudo!$C$2:$F$80,4,FALSE)","v":{"$error":"#N/A"}},{"$f":"VLOOKUP(A11,Recaudo!$C$2:$G$80,5,FALSE)","v":{"$error":"#N/A"}},{"$f":"VLOOKUP(A11,Jurídica!$C$2:$E$80,3,FALSE)","v":{"$error":"#N/A"}}]
[null,null,null,null,{"$f":"+B12-C12","v":0},{"$f":"VLOOKUP(A12,Recaudo!$C$2:$E$80,3,FALSE)","v":{"$error":"#N/A"}},{"$f":"VLOOKUP(A12,Recaudo!$C$2:$F$80,4,FALSE)","v":{"$error":"#N/A"}},{"$f":"VLOOKUP(A12,Recaudo!$C$2:$G$80,5,FALSE)","v":{"$error":"#N/A"}},{"$f":"VLOOKUP(A12,Jurídica!$C$2:$E$80,3,FALSE)","v":{"$error":"#N/A"}}]
[null,null,null,null,0,{"$f":"VLOOKUP(A13,Recaudo!$C$2:$E$80,3,FALSE)","v":{"$error":"#N/A"}},{"$f":"VLOOKUP(A13,Recaudo!$C$2:$F$80,4,FALSE)","v":{"$error":"#N/A"}},{"$f":"VLOOKUP(A13,Recaudo!$C$2:$G$80,5,FALSE)","v":{"$error":"#N/A"}},{"$f":"VLOOKUP(A13,Jurídica!$C$2:$E$80,3,FALSE)","v":{"$error":"#N/A"}}]
[null,null,null,null,0,{"$f":"VLOOKUP(A14,Recaudo!$C$2:$E$80,3,FALSE)","v":{"$error":"#N/A"}},{"$f":"VLOOKUP(A14,Recaudo!$C$2:$F$80,4,FALSE)","v":{"$error":"#N/A"}},{"$f":"VLOOKUP(A14,Recaudo!$C$2:$G$80,5,FALSE)","v":{"$error":"#N/A"}},{"$f":"VLOOKUP(A14,Jurídica!$C$2:$E$80,3,FALSE)","v":{"$error":"#N/A"}}]
[null,null,null,null,0,{"$f":"VLOOKUP(A15,Recaudo!$C$2:$E$80,3,FALSE)","v":{"$error":"#N/A"}},{"$f":"VLOOKUP(A15,Recaudo!$C$2:$F$80,4,FALSE)","v":{"$error":"#N/A"}},{"$f":"VLOOKUP(A15,Recaudo!$C$2:$G$80,5,FALSE)","v":{"$error":"#N/A"}},{"$f":"VLOOKUP(A15,Jurídica!$C$2:$E$80,3,FALSE)","v":{"$error":"#N/A"}}]
[null,null,null,null,0,{"$f":"VLOOKUP(A16,Recaudo!$C$2:$E$80,3,FALSE)","v":{"$error":"#N/A"}},{"$f":"VLOOKUP(A16,Recaudo!$C$2:$F$80,4,FALSE)","v":{"$error":"#N/A"}},{"$f":"VLOOKUP(A16,Recaudo!$C$2:$G$80,5,FALSE)","v":{"$error":"#N/A"}},{"$f":"VLOOKUP(A16,Jurídica!$C$2:$E$80,3,FALSE)","v":{"$error":"#N/A"}}]
[null,null,null,null,0,{"$f":"VLOOKUP(A17,Recaudo!$C$2:$E$80,3,FALSE)","v":{"$error":"#N/A"}},{"$f":"VLOOKUP(A17,Recaudo!$C$2:$F$80,4,FALSE)","v":{"$error":"#N/A"}},{"$f":"VLOOKUP(A17,Recaudo!$C$2:$G$80,5,FALSE)","v":{"$error":"#N/A"}},{"$f":"VLOOKUP(A17,Jurídica!$C$2:$E$80,3,FALSE)","v":{"$error":"#N/A"}}]
[null,null,null,null,0,{"$f":"VLOOKUP(A18,Recaudo!$C$2:$E$80,3,FALSE)","v":{"$error":"#N/A"}},{"$f":"VLOOKUP(A18,Recaudo!$C$2:$F$80,4,FALSE)","v":{"$error":"#N/A"}},{"$f":"VLOOKUP(A18,Recaudo!$C$2:$G$80,5,FALSE)","v":{"$error":"#N/A"}},{"$f":"VLOOKUP(A18,Jurídica!$C$2:$E$80,3,FALSE)","v":{"$error":"#N/A"}}]
[null,null,null,null,0,{"$f":"VLOOKUP(A19,Recaudo!$C$2:$E$80,3,FALSE)","v":{"$error":"#N/A"}},{"$f":"VLOOKUP(A19,Recaudo!$C$2:$F$80,4,FALSE)","v":{"$error":"#N/A"}},{"$f":"VLOOKUP(A19,Recaudo!$C$2:$G$80,5,FALSE)","v":{"$error":"#N/A"}},{"$f":"VLOOKUP(A19,Jurídica!$C$2:$E$80,3,FALSE)","v":{"$error":"#N/A"}}]
[null,null,null,null,0,{"$f":"VLOOKUP(A20,Recaudo!$C$2:$E$80,3,FALSE)","v":{"$error":"#N/A"}},{"$f":"VLOOKUP(A20,Recaudo!$C$2:$F$80,4,FALSE)","v":{"$error":"#N/A"}},{"$f":"VLOOKUP(A20,Recaudo!$C$2:$G$80,5,FALSE)","v":{"$error":"#N/A"}},{"$f":"VLOOKUP(A20,Jurídica!$C$2:$E$80,3,FALSE)","v":{"$error":"#N/A"}}]
[null,null,null,null,0,{"$f":"VLOOKUP(A21,Recaudo!$C$2:$E$80,3,FALSE)","v":{"$error":"#N/A"}},{"$f":"VLOOKUP(A21,Recaudo!$C$2:$F$80,4,FALSE)","v":{"$error":"#N/A"}},{"$f":"VLOOKUP(A21,Recaudo!$C$2:$G$80,5,FALSE)","v":{"$error":"#N/A"}},{"$f":"VLOOKUP(A21,Jurídica!$C$2:$E$80,3,FALSE)","v":{"$error":"#N/A"}}]
[null,null,null,null,0,{"$f":"VLOOKUP(A22,Recaudo!$C$2:$E$80,3,FALSE)","v":{"$error":"#N/A"}},{"$f":"VLOOKUP(A22,Recaudo!$C$2:$F$80,4,FALSE)","v":{"$error":"#N/A"}},{"$f":"VLOOKUP(A22,Recaudo!$C$2:$G$80,5,FALSE)","v":{"$error":"#N/A"}},{"$f":"VLOOKUP(A22,Jurídica!$C$2:$E$80,3,FALSE)","v":{"$error":"#N/A"}}]
[null,null,null,null,0,{"$f":"VLOOKUP(A23,Recaudo!$C$2:$E$80,3,FALSE)","v":{"$error":"#N/A"}},{"$f":"VLOOKUP(A23,Recaudo!$C$2:$F$80,4,FALSE)","v":{"$error":"#N/A"}},{"$f":"VLOOKUP(A23,Recaudo!$C$2:$G$80,5,FALSE)","v":{"$error":"#N/A"}},{"$f":"VLOOKUP(A23,Jurídica!$C$2:$E$80,3,FALSE)","v":{"$error":"#N/A"}}]
[null,null,null,null,0,{"$f":"VLOOKUP(A24,Recaudo!$C$2:$E$80,3,FALSE)","v":{"$error":"#N/A"}},{"$f":"VLOOKUP(A24,Recaudo!$C$2:$F$80,4,FALSE)","v":{"$error":"#N/A"}},{"$f":"VLOOKUP(A24,Recaudo!$C$2:$G$80,5,FALSE)","v":{"$error":"#N/A"}},{"$f":"VLOOKUP(A24,Jurídica!$C$2:$E$80,3,FALSE)","v":{"$error":"#N/A"}}]
[null,null,null,null,0,{"$f":"VLOOKUP(A25,Recaudo!$C$2:$E$80,3,FALSE)","v":{"$error":"#N/A"}},{"$f":"VLOOKUP(A25,Recaudo!$C$2:$F$80,4,FALSE)","v":{"$error":"#N/A"}},{"$f":"VLOOKUP(A25,Recaudo!$C$2:$G$80,5,FALSE)","v":{"$error":"#N/A"}},{"$f":"VLOOKUP(A25,Jurídica!$C$2:$E$80,3,FALSE)","v":{"$error":"#N/A"}}]
[null,null,null,null,0,{"$f":"VLOOKUP(A26,Recaudo!$C$2:$E$80,3,FALSE)","v":{"$error":"#N/A"}},{"$f":"VLOOKUP(A26,Recaudo!$C$2:$F$80,4,FALSE)","v":{"$error":"#N/A"}},{"$f":"VLOOKUP(A26,Recaudo!$C$2:$G$80,5,FALSE)","v":{"$error":"#N/A"}},{"$f":"VLOOKUP(A26,Jurídica!$C$2:$E$80,3,FALSE)","v":{"$error":"#N/A"}}]
[null,null,null,null,0,{"$f":"VLOOKUP(A27,Recaudo!$C$2:$E$80,3,FALSE)","v":{"$error":"#N/A"}},{"$f":"VLOOKUP(A27,Recaudo!$C$2:$F$80,4,FALSE)","v":{"$error":"#N/A"}},{"$f":"VLOOKUP(A27,Recaudo!$C$2:$G$80,5,FALSE)","v":{"$error":"#N/A"}},{"$f":"VLOOKUP(A27,Jurídica!$C$2:$E$80,3,FALSE)","v":{"$error":"#N/A"}}]
[null,null,null,null,0,{"$f":"VLOOKUP(A28,Recaudo!$C$2:$E$80,3,FALSE)","v":{"$error":"#N/A"}},{"$f":"VLOOKUP(A28,Recaudo!$C$2:$F$80,4,FALSE)","v":{"$error":"#N/A"}},{"$f":"VLOOKUP(A28,Recaudo!$C$2:$G$80,5,FALSE)","v":{"$error":"#N/A"}},{"$f":"VLOOKUP(A28,Jurídica!$C$2:$E$80,3,FALSE)","v":{"$error":"#N/A"}}]
[null,null,null,null,0,{"$f":"VLOOKUP(A29,Recaudo!$C$2:$E$80,3,FALSE)","v":{"$error":"#N/A"}},{"$f":"VLOOKUP(A29,Recaudo!$C$2:$F$80,4,FALSE)","v":{"$error":"#N/A"}},{"$f":"VLOOKUP(A29,Recaudo!$C$2:$G$80,5,FALSE)","v":{"$error":"#N/A"}},{"$f":"VLOOKUP(A29,Jurídica!$C$2:$E$80,3,FALSE)","v":{"$error":"#N/A"}}]
[null,null,null,null,0,{"$f":"VLOOKUP(A30,Recaudo!$C$2:$E$80,3,FALSE)","v":{"$error":"#N/A"}},{"$f":"VLOOKUP(A30,Recaudo!$C$2:$F$80,4,FALSE)","v":{"$error":"#N/A"}},{"$f":"VLOOKUP(A30,Recaudo!$C$2:$G$80,5,FALSE)","v":{"$error":"#N/A"}},{"$f":"VLOOKUP(A30,Jurídica!$C$2:$E$80,3,FALSE)","v":{"$error":"#N/A"}}]
[null,null,null,null,0,{"$f":"VLOOKUP(A31,Recaudo!$C$2:$E$80,3,FALSE)","v":{"$error":"#N/A"}},{"$f":"VLOOKUP(A31,Recaudo!$C$2:$F$80,4,FALSE)","v":{"$error":"#N/A"}},{"$f":"VLOOKUP(A31,Recaudo!$C$2:$G$80,5,FALSE)","v":{"$error":"#N/A"}},{"$f":"VLOOKUP(A31,Jurídica!$C$2:$E$80,3,FALSE)","v":{"$error":"#N/A"}}]
[null,null,null,null,0,{"$f":"VLOOKUP(A32,Recaudo!$C$2:$E$80,3,FALSE)","v":{"$error":"#N/A"}},{"$f":"VLOOKUP(A32,Recaudo!$C$2:$F$80,4,FALSE)","v":{"$error":"#N/A"}},{"$f":"VLOOKUP(A32,Recaudo!$C$2:$G$80,5,FALSE)","v":{"$error":"#N/A"}},{"$f":"VLOOKUP(A32,Jurídica!$C$2:$E$80,3,FALSE)","v":{"$error":"#N/A"}}]
[null,null,null,null,0,{"$f":"VLOOKUP(A33,Recaudo!$C$2:$E$80,3,FALSE)","v":{"$error":"#N/A"}},{"$f":"VLOOKUP(A33,Recaudo!$C$2:$F$80,4,FALSE)","v":{"$error":"#N/A"}},{"$f":"VLOOKUP(A33,Recaudo!$C$2:$G$80,5,FALSE)","v":{"$error":"#N/A"}},{"$f":"VLOOKUP(A33,Jurídica!$C$2:$E$80,3,FALSE)","v":{"$error":"#N/A"}}]
[null,null,null,null,0,{"$f":"VLOOKUP(A34,Recaudo!$C$2:$E$80,3,FALSE)","v":{"$error":"#N/A"}},{"$f":"VLOOKUP(A34,Recaudo!$C$2:$F$80,4,FALSE)","v":{"$error":"#N/A"}},{"$f":"VLOOKUP(A34,Recaudo!$C$2:$G$80,5,FALSE)","v":{"$error":"#N/A"}},{"$f":"VLOOKUP(A34,Jurídica!$C$2:$E$80,3,FALSE)","v":{"$error":"#N/A"}}]
[null,null,null,null,0,{"$f":"VLOOKUP(A35,Recaudo!$C$2:$E$80,3,FALSE)","v":{"$error":"#N/A"}},{"$f":"VLOOKUP(A35,Recaudo!$C$2:$F$80,4,FALSE)","v":{"$error":"#N/A"}},{"$f":"VLOOKUP(A35,Recaudo!$C$2:$G$80,5,FALSE)","v":{"$error":"#N/A"}},{"$f":"VLOOKUP(A35,Jurídica!$C$2:$E$80,3,FALSE)","v":{"$error":"#N/A"}}]
[null,null,null,null,0,{"$f":"VLOOKUP(A36,Recaudo!$C$2:$E$80,3,FALSE)","v":{"$error":"#N/A"}},{"$f":"VLOOKUP(A36,Recaudo!$C$2:$F$80,4,FALSE)","v":{"$error":"#N/A"}},{"$f":"VLOOKUP(A36,Recaudo!$C$2:$G$80,5,FALSE)","v":{"$error":"#N/A"}},{"$f":"VLOOKUP(A36,Jurídica!$C$2:$E$80,3,FALSE)","v":{"$error":"#N/A"}}]
[null,null,null,null,0,{"$f":"VLOOKUP(A37,Recaudo!$C$2:$E$80,3,FALSE)","v":{"$error":"#N/A"}},{"$f":"VLOOKUP(A37,Recaudo!$C$2:$F$80,4,FALSE)","v":{"$error":"#N/A"}},{"$f":"VLOOKUP(A37,Recaudo!$C$2:$G$80,5,FALSE)","v":{"$error":"#N/A"}},{"$f":"VLOOKUP(A37,Jurídica!$C$2:$E$80,3,FALSE)","v":{"$error":"#N/A"}}]
[null,null,null,null,0,{"$f":"VLOOKUP(A38,Recaudo!$C$2:$E$80,3,FALSE)","v":{"$error":"#N/A"}},{"$f":"VLOOKUP(A38,Recaudo!$C$2:$F$80,4,FALSE)","v":{"$error":"#N/A"}},{"$f":"VLOOKUP(A38,Recaudo!$C$2:$G$80,5,FALSE)","v":{"$error":"#N/A"}},{"$f":"VLOOKUP(A38,Jurídica!$C$2:$E$80,3,FALSE)","v":{"$error":"#N/A"}}]
[null,null,null,null,0,{"$f":"VLOOKUP(A39,Recaudo!$C$2:$E$80,3,FALSE)","v":{"$error":"#N/A"}},{"$f":"VLOOKUP(A39,Recaudo!$C$2:$F$80,4,FALSE)","v":{"$error":"#N/A"}},{"$f":"VLOOKUP(A39,Recaudo!$C$2:$G$80,5,FALSE)","v":{"$error":"#N/A"}},{"$f":"VLOOKUP(A39,Jurídica!$C$2:$E$80,3,FALSE)","v":{"$error":"#N/A"}}]
[null,null,null,null,0,{"$f":"VLOOKUP(A40,Recaudo!$C$2:$E$80,3,FALSE)","v":{"$error":"#N/A"}},{"$f":"VLOOKUP(A40,Recaudo!$C$2:$F$80,4,FALSE)","v":{"$error":"#N/A"}},{"$f":"VLOOKUP(A40,Recaudo!$C$2:$G$80,5,FALSE)","v":{"$error":"#N/A"}},{"$f":"VLOOKUP(A40,Jurídica!$C$2:$E$80,3,FALSE)","v":{"$error":"#N/A"}}]
{"$rows_left_out":40}