{"text_format":"1","workbook":"xlsx","n_sheets":12,"sheets":["Inicio","Listas desplegab","Modulo I","Base Dat Mod I","Modulo II","Base Dat Mod II","Modulo III","Base Dat Mod III","Consulta Mod I y III","Consulta Mod II","Graficos Mod I y III","Graficos Mod II"],"not_rendered":{"charts":3,"images":39,"macros":1,"external_links":0,"defined_names":7,"comments":0,"pivot_tables":3},"unopened":[],"bounds":{"document_bytes":16777216,"sheet_cells":100000,"rows_first":2000,"rows_last":500,"rows_between":2000,"halvings":0,"cell_chars":16384,"cell_head_chars":4096},"cells_cut":0,"cells_raw":0,"read":"whole","date_system":"1900"}

{"sheet":"Inicio","index":0,"n_rows":27,"n_cols":20,"rows_kept":27,"cut":false,"hidden":false,"merged":[[5,3,6,9],[26,3,26,9],[1,3,3,3],[1,4,1,7],[2,4,3,7],[3,8,3,9]]}
[]
[null,null,null,null,"PROCESO PROMOCIÓN Y PREVENCIÓN",null,null,null,"F1.MO12.PP ","2017-02-17"]
[null,null,null,null,"FICHA DE CARACTERIZACIÓN SOCIO-FAMILIAR",null,null,null,"Versión 3","Pagina 1 de 1"]
[null,null,null,null,null,null,null,null,"Clasificación de la Información Pública"]
[null,null,null,null,null,null,null,null,null,null,null,null,null,null,null,null,null,null,null,"ATENCIÓN A NIÑOS HASTA LOS 3 AÑOS EN ESTABLECIMIENTOS DE RECLUSIÓN A MUJERES INTEGRAL"]
[null,null,null,null,null,null,null,null,null,null,null,null,null,null,null,null,null,null,null,"CDI CON ARRIENDO - INSTITUCIONAL INTEGRAL"]
[null,null,null,null,null,null,null,null,null,null,null,null,null,null,null,null,null,null,null,"CDI SIN ARRIENDO -  INSTITUCIONAL INTEGRAL"]
[null,null,null,null,null,null,null,null,null,null,null,null,null,null,null,null,null,null,null,"DESARROLLO INFANTIL EN MEDIO FAMILIAR - FAMILIAR INTEGRAL"]
[null,null,null,null,null,null,null,null,null,null,null,null,null,null,null,null,null,null,null,"HCB  AGRUPADOS -INSTITUCIONAL TRADICIONAL"]
[null,null,null,null,null,null,null,null,null,null,null,null,null,null,null,null,null,null,null,"HCB FAMI-FAMILIAR TRADICIONAL"]
{"$rows_left_out":18}
{"sheet":"Listas desplegab","index":1,"n_rows":102,"n_cols":18,"rows_kept":102,"cut":false,"hidden":true,"merged":[[9,0,9,2]]}
["Etnico","Decisión","Rangos de edad","No de hijos","Semanas de gestación","Estado Civil de la madre gestante","Edad","Nivel escolaridad","Tipo de vivienda","Tipo de tenencia vivienda","No de personas, nucleo familiar","Meses","Tratamiento del agua","Inodoro","Permanencia salida unidad","Otra decision","Tipo de documentacion Niña /Niño","Tipo de documentacion Madre"]
["Negro","SI","0 a 6 meses",1,1,"Soltera","Menor a 1 año","Ninguno","Casa","Propia",1,1,"Ninguno","Exclusivo para el nucleo familiar","Padre","SI","Registro Civil","Tarjeta de Identidad"]
["Afrocolombiano","NO","6 a 12 meses",2,2,"Casada",1,"Primaria","Cambuche","Familiar",2,2,"La hierven","Compartido con otros nucleos","Madre","NO","Tarjeta de Identidad","Cedula de Ciudadania"]
["Indigena",null,"1 año y 1 día a 2 años",3,3,"Separada",2,"Secundaria","Apartamento","En arriendo o subarriendo",3,3,"La purifican con cloro",null,"Padrasto/ Madrasta","No aplica","Sin documento","Sin documento"]
["Rrom/Gitano",null,"2 años y 1 día a 3 años",4,4,"Unión Marital de hecho",3,"Técnico","Vivienda Indigena","Ocupante de hecho o poseedor",4,4,"Utilizan filtro",null,"Hermano(a)"]
["Raizal del archipielago de San Andres,Providencia y Santa Catalina",null,"3 años y 1 día a 4 años",5,5,"Viuda",4,"Tecnológico","Habitación","En concesión",5,5,"La decantan",null,"Tio(a)"]
["Palenquero",null,"4 años y 1 día a 5 años, 11 meses y 29 días",6,6,null,5,"Universitario","Albergue","Titulación comunitaria",6,6,"Pastillas purificadoras",null,"Primo(a)",null,null,"Esposo"]
["No se autoreconoce en ninguno de los anteriores",null,null,7,7,null,6,"Postgrado","Finca",null,7,7,"Otra",null,"Pariente",null,"No aplica","Pareja"]
[null,null,null,8,8,null,7,null,"Inquilinato",null,8,8,null,null,"Empleada/Niñera",null,"Madre","Madre"]
["Modulo 1",null,null,9,9,null,8,null,null,null,9,9,null,null,"Padrino/Madrina",null,"Padre","Padre"]
{"$rows_left_out":93}
{"sheet":"Modulo I","index":2,"n_rows":113,"n_cols":14,"rows_kept":113,"cut":false,"hidden":false,"merged":[[93,5,93,7],[100,6,100,8],[48,6,48,8],[33,6,33,8],[95,5,98,5],[67,4,67,5],[77,4,77,5],[42,2,42,4],[36,6,36,8],[38,6,38,8],[38,2,38,4],[43,2,43,4],[58,2,58,5],[47,2,47,4],[48,2,48,4],[56,4,56,6],[83,6,83,8],[35,2,35,4],[36,2,36,4],[37,2,37,4],[54,2,54,5],[51,4,51,8],[52,4,52,8],[39,2,39,4],[40,2,40,4],[41,2,41,4],[33,2,33,4],[32,2,32,4],[25,2,25,3],[45,1,45,8],[43,6,43,8],[41,6,41,8],[34,6,34,8],[34,2,34,4],[1,1,1,8],[4,5,4,6],[6,1,6,8],[12,1,12,8],[30,1,30,8],[13,2,13,3],[22,6,22,8],[2,1,2,8],[19,5,19,7],[21,2,21,4],[22,2,22,4],[23,2,23,4],[116,1,119,8],[108,2,108,6],[61,2,61,5],[87,2,87,5],[94,2,94,6],[102,2,102,5],[100,2,100,4],[101,2,101,4],[83,2,83,4],[85,1,85,8],[70,2,70,5],[80,2,80,5],[103,4,106,5],[82,2,82,4],[71,2,71,5],[88,5,91,5]]}
[]
[]
[]
[]
[null,null,null,null,null,"Fecha de diligenciamiento Inicial ",null,{"$f":"TODAY()","v":"2017-02-20"}]
[]
[null,"INFORMACIÓN DE LA UNIDAD DE SERVICIO"]
[]
[null,null,"Nombre de la Unidad de Servicio-UDS (a la que asiste la niña o el niño)*"]
[null,null,"Codigo de la UDS en Cuentame*"]
{"$rows_left_out":104}
{"sheet":"Base Dat Mod I","index":3,"n_rows":8,"n_cols":67,"rows_kept":8,"cut":false,"hidden":false,"merged":[[0,0,4,66],[6,42,6,47],[5,42,5,47],[6,48,6,49],[6,33,6,34],[6,28,6,32],[6,36,6,41],[5,35,5,41],[6,16,6,27],[6,13,6,15],[6,50,6,53],[6,55,6,58],[6,60,6,63],[6,64,6,65],[5,50,5,66]]}
[]
[]
[]
[]
[]
[null,null,null,null,null,null,null,null,null,null,null,null,null,null,null,null,null,null,null,null,null,null,null,null,null,null,null,null,null,null,null,null,null,null,null,"Información para niñas y niños menores de 6 meses",null,null,null,null,null,null,"Información para niñas y niños entre 6 meses  y 1 año",null,null,null,null,null,null,null,"DISCAPACIDAD"]
[null,null,null,null,null,null,null,null,null,null,null,null,null,"Datos de contacto del Adulto Responsable o Acudiente",null,null,"Salud",null,null,null,null,null,null,null,null,null,null,null,"NUTRICIÓN Y MEDIDAS ANTROPOMETRICAS",null,null,null,null,"La niña o el niño tiene alguna dieta especial, restricción alimentaria o alergia alimentaria ",null,null,"Si la respuesta anterior es NO, ¿Qué tipo de alimentación recibe la niña o niño?",null,null,null,null,null,"¿Cuáles alimentos predominan en su alimentación?",null,null,null,null,null,"Información para niñas y niños mayores de 1 año",null,"TIPIFICACIÓN DE LA DISCAPACIDAD",null,null,null,null,"GRADO DE LIMITACIÓN EN LA EJECUCIÓN DE ACTIVIDADES, DESDE LA INDEPENDENCIA FUNCIONAL",null,null,null,null,"SI EL USUARIO RECIBE ALGUNA ATENCIÓN COMPLEMENTARIA EN OTRA ENTIDAD, INDIQUE LO SIGUIENTE",null,null,null,"¿LA PERSONA ENCARGADA PRINCIPALMENTE DEL CUIDADO DE LA NIÑA O NIÑO, REALIZA ALGÚN OTRO TIPO DE ACTIVIDAD?"]
["NUIP","Fecha de diligenciamiento Inicial ","Nombre de la Unidad de Servicio-UDS (a la que asiste la niña o el niño)","Codigo de la UDS en Cuentame","Servicio Prestado en la UDS","Primer Nombre","Segundo Nombre","Primer Apellido","Segundo Apellido","Tipo de Documento de Identidad","Grupo étnico con el que se autoreconoce la niña o el niño*","Si el Nucleo familiar del beneficiario se reconoce como miembro de un grupo étnico, Indique a que comunidad, resguardo o territorio colectivo pertenece","¿El beneficiario habla la lengua nativa del grupo ectnico al que pertenece?","Nombres y apellidos (Acudiente)","Parentesco (Acudiente)","Numero de contacto en caso de emergencia (Acudiente)","Se encuentra afiliado al Sistema de Seguridad Social","En caso de no estar afiliado al Sistema de Seguridad Social ¿Cuál es la razon?","Nombre de la Entidad Promotora de Salud a la que se encuentra afiliado","¿La niña o niño cuenta con el carnet de vacunación actualizado?","En caso de que no contar con el carnet de vacunación al dia según la edad de la niña o el niño, ¿Cuál es la razón?","Si la niña o el niño es mayor d e un (1) año, ¿Ha asistido a controles de salud oral?","En caso de no haber asistido a controles de salud oral, ¿Cuál es el motivo por el cual no ha asistido a los controles?","La niña o niño menor de cuatro (4) años ¿Ha recibido valoracion oftalmológica?","La niña o niño menor de cinco(5) años ¿Ha recibido valoracion auditiva?","Si la niña o el niño ha asistido a consultas medicas distintas a las de crecimiento y desarrollo (urgencias o consulta externa), indique el motivo de la  consulta","¿La niña o niño es alérgico a algún medicamento?","Si la respuesta anterior es SI, indique el medicamento al cual es alergico","La niña o niño cuenta con el carnet actualizado de crecimiento y desarrollo","Si la niña o niño asiste a controles de crecimiento y desarrollo, indique la fecha del último control","Rango de edad","Peso al nacer de la niña o el niño","Talla al nacer de de la niña o el niño","Dieta especial( SI / NO)","Si la respuesta anterior es SI, indique la dieta,restriccioón o alergia alimentaria ","¿ Esta siendo alimentado con leche materna de forma exclusiva?\n(<6meses)","Leche materna (<6meses)","Leche de formula (<6meses)","Leche de vaca (<6meses)","Alimentación familiar (<6meses)","Leche de otro mamifero  (<6meses)","Otro ¿Cuál? (<6meses)","Leche materna (>6meses\n<1año)","Leche de formula (>6meses\n<1año)","Leche de vaca (>6meses <1año)","Alimentación familiar (>6meses\n<1año)","Leche de otro mamifero  (>6meses\n<1año)","Otro ¿Cuál? (>6meses \n<1año)"," ¿ha recibido e el ultimo año antiparasitarios, por parte de algún servicio de salud?","En caso de haber recibido antiparasitarios, indique la última fecha en la que fue tomada por la niña o el niño","Movilidad/Física","Sensorial","Mental","Multiple","Diagnostico de la discapacidad","Independiente","Independiente con apoyo","Independencia restringida","Dependencia","APOYO REQUERIDO (DESCRIBA EL APOYO REQUERIDO POR EL USUARIO)","Atención,\n¿Cuál?","Horario","Entidad","Frecuencia","Actividad alterna persona encargada \n(SI / NO)","¿Cuál?","Entidad que diagnosticó la discapacidad"]

{"sheet":"Modulo II","index":4,"n_rows":57,"n_cols":20,"rows_kept":57,"cut":false,"hidden":false,"merged":[[48,2,48,4],[31,4,31,7],[39,4,39,5],[43,6,43,8],[28,1,28,8],[29,2,29,3],[41,2,41,4],[43,2,43,4],[4,5,4,6],[6,1,6,8],[46,2,46,4],[47,2,47,4],[20,2,20,4],[23,2,23,3],[17,5,17,7],[20,6,20,8],[19,2,19,4],[59,1,62,8],[54,2,54,4],[55,2,55,4],[21,2,21,4],[56,2,56,4],[42,2,42,4],[50,2,50,4],[52,2,52,4],[53,2,53,4],[33,2,33,5],[45,2,45,5],[44,1,44,8],[49,2,49,4],[53,6,53,8],[50,6,50,8],[21,6,21,8]]}
[]
[]
[]
[]
[null,null,null,null,null,"Fecha de diligenciamiento Inicial ",null,{"$f":"TODAY()","v":"2017-02-20"}]
[]
[null,"INFORMACIÓN DE LA USUARIA"]
[]
[null,null,"Nombre de la Unidad de Servicio-UDS (a la que asiste la usuaria)*"]
[null,null,"Codigo de la UDS en Cuentame*"]
{"$rows_left_out":48}
{"sheet":"Base Dat Mod II","index":5,"n_rows":11,"n_cols":37,"rows_kept":11,"cut":false,"hidden":false,"merged":[[0,0,4,26],[9,13,9,15],[9,18,9,23],[9,27,9,31]]}
[]
[]
[]
[]
[]
[]
[]
[]
[]
[null,null,null,null,null,null,null,null,null,null,null,null,null,"Datos de contacto en caso de emergencia",null,null,null,null,"ACTUALMENTE TIENE DENTRO DE SUS HABITOS EL USO Y/O CONSUMO:",null,null,null,null,null,null,null,null,"DURANTE EL PERIODO DE GESTACIÓN USTED HA RECIBIDO CAPACITACIÓN EN:"]
{"$rows_left_out":2}
{"sheet":"Modulo III","index":6,"n_rows":180,"n_cols":24,"rows_kept":180,"cut":false,"hidden":false,"merged":[[179,4,179,5],[123,2,123,4],[129,2,129,4],[86,2,86,4],[87,2,87,4],[96,2,96,4],[102,2,102,4],[118,2,118,5],[103,2,103,5],[116,1,116,8],[95,4,95,5],[100,4,100,5],[114,4,114,5],[169,2,169,5],[175,2,175,5],[131,2,131,6],[162,2,162,4],[148,2,148,5],[154,2,154,5],[161,4,161,5],[168,4,168,5],[174,4,174,5],[75,2,75,5],[85,2,85,4],[1,1,1,8],[4,5,4,6],[6,1,6,8],[57,2,57,4],[58,2,58,4],[59,2,59,4],[55,1,55,8],[49,2,49,3],[60,2,60,4],[61,2,61,5],[10,2,10,3],[9,1,9,8],[45,1,45,8],[74,2,74,5],[41,2,41,4],[66,4,66,5],[43,2,43,4],[2,1,2,8],[30,2,30,3],[20,2,20,3],[67,2,67,5],[8,5,8,7],[13,4,13,7],[16,4,16,7],[17,4,17,7],[23,4,23,7],[27,4,27,7],[34,4,34,7],[38,4,38,7]]}
[]
[]
[]
[]
[null,null,null,null,null,"Fecha de diligenciamiento Inicial ",null,{"$f":"TODAY()","v":"2017-02-20"}]
[]
[null,"COMPOSICIÓN Y ESTRUCTURA FAMILIAR",null,null,null,null,null,null,null,null,null,null,null,null,null,null,null,null,null,null,"No aplica","No aplica","No aplica","No aplica"]
[null,null,null,{"$f":"IFERROR(VLOOKUP(D9,'Base Dat Mod III'!$A$8:$A$999,1,TRUE),\"N/A\")","v":"N/A"},null,"Verificar duplicidad de documento",null,null,null,null,null,null,null,null,null,null,null,null,null,null,1,"Ninguno","SI","Con empleo"]
[null,null,"Diligenciar el documento de identidad del beneficiario (Cédula-Tarjeta de identidad-NUIP)*",null,null,{"$f":"IF(D9=D8,\"EXISTE DUPLICIDAD DE LA INFORMACIÓN\",IF(D9=\"\",\"PENDIENTE\",\"NUEVO NUIP\"))","v":"PENDIENTE"},null,null,null,null,null,null,null,null,null,null,null,null,null,null,2,"Primaria","NO","Sin empleo"]
[null,"MIEMBROS QUE COMPONEN EL NUCLEO FAMILIAR DEL  BENEFICIARIO Y QUE CONVIVEN CON LA NIÑA/NIÑO",null,null,null,null,null,null,null,null,null,null,null,null,null,null,null,null,null,null,3,"Secundaria"]
{"$rows_left_out":171}
{"sheet":"Base Dat Mod III","index":7,"n_rows":8,"n_cols":134,"rows_kept":8,"cut":false,"hidden":false,"merged":[[5,2,5,28],[5,29,5,33],[6,31,6,32],[0,0,4,133],[6,119,6,124],[6,125,6,129],[6,130,6,133],[5,83,5,133],[5,34,5,82],[6,92,6,106],[6,107,6,111],[6,112,6,118],[6,67,6,70],[6,71,6,82],[6,83,6,86],[6,87,6,90],[6,38,6,42],[6,43,6,48],[6,59,6,66],[6,18,6,26],[6,2,6,9],[6,10,6,17]]}
[]
[]
[]
[]
[]
[null,null,"COMPOSICIÓN Y ESTRUCTURA FAMILIAR",null,null,null,null,null,null,null,null,null,null,null,null,null,null,null,null,null,null,null,null,null,null,null,null,null,null,"CARACTERISTICAS DE LA VIVIENDA DEL BENEFICIARIO",null,null,null,null,"CONDICIONES DE HABITABILIDAD",null,null,null,null,null,null,null,null,null,null,null,null,null,null,null,null,null,null,null,null,null,null,null,null,null,null,null,null,null,null,null,null,null,null,null,null,null,null,null,null,null,null,null,null,null,null,null,null,"RELACIONES FAMILIARES"]
[null,null,"MADRE",null,null,null,null,null,null,null,"PADRE",null,null,null,null,null,null,null,"ACUDIENTE (diligenciar si es distinto a padre o madre)",null,null,null,null,null,null,null,null,null,null,null,null,"TIEMPO DE PERMANENCIA DEL NUCLEO FAMILIAR EN EL BARRIO O CORREGIMIENTO",null,null,null,null,null,null,"En el nucleo familiar del beneficiario las niñas o niños menores de cinco (5) años duermen en (Verificación a traves de visita domiciliaria)",null,null,null,null,"EL NUCLEO FAMILIAR DEL BENEFICIARIO TIENE ACCESO A LOS SIGUIENTES SERVICIOS DOMICILIARIOS:",null,null,null,null,null,null,null,null,null,null,null,null,null,null,null,"¿CUAL ES EL TRATAMIENTO QUE LE DAN A LAS BASURAS?",null,null,null,null,null,null,null,"¿CON QUE TIPO DE SANITARIO CUENTA EL HOGAR?",null,null,null,"Cerca de la vivienda cuenta",null,null,null,null,null,null,null,null,null,null,null,"EL NUCLEO FAMILIAR COMPARTE SUS DIFICULTADES CON",null,null,null,"EL NUCLEO FAMILIAR COMPARTE SUS ACONTECIMIENTOS ESPECIALES CON",null,null,null,null,"¿CUÁLES DE ESTAS ACTIVIDADES REALIZA EL NUCLEO FAMILIAR DE LAS NIÑAS/NIÑOS MENORES DE CINCO (5) AÑOS DURANTE LA SEMANA PARA FORTALECER EL DIALOGO, VINCULO FAMILIARES Y LAZOS AFECTIVOS? (VERIFICAR CON VISITA DOMICILIARIA)",null,null,null,null,null,null,null,null,null,null,null,null,null,null,"LA DISTRIBUCIÓN DE ROLES Y ACTIVIDADES DEL CUIDADO DE LAS NIÑAS Y LOS NIÑOS MENORES DE CINCO (5) AÑOS, EN EL NUCLEO FAMILAR SE REALIZA",null,null,null,null,"¿CUÁL ES EL MOTIVO MAS FRECUENTE DE DISGUSTO ENTRE LOS ADULTOS DEL NUCLEO FAMILIAR",null,null,null,null,null,null,"¿COMO SE SOLUCIONAN LOS PROBLEMAS DENTRO DEL NUCLEO FAMILIAR?",null,null,null,null,null,"LOS ADULTOS QUE CONFORMAN EL NUCLEO FAMILIAR PERMITEN QUE LAS NIÑAS O LOS NIÑOS PARTICIPEN EN ALGUNA DE LAS SIGUIENTES ACTIVIDADES DEL HOGAR",null,null,null,null,"¿QUE TIPO DE RECONOCIMIENTOS O INCENTIVOS SE LE DAN A LAS NIÑAS O LOS NIÑOS MENORES DE CINCO (5) AÑOS POR SUS LOGROS?"]
["NUIP","Fecha de diligenciamiento Inicial ","Edad","Nivel de escolaridad","Ocupación","Sabe leer","Sabe escribir","Situación laboral","Condiciones especiales","Aporta al sustento economico","Edad","Nivel de escolaridad","Ocupación","Sabe leer","Sabe escribir","Situación laboral","Condiciones especiales","Aporta al sustento economico","Parentesco","Edad","Nivel de escolaridad","Ocupación","Sabe leer","Sabe escribir","Situación laboral","Condicione especiales","Aporta al sustento economico","¿La niña o el niño tienen hermanos(as)? Si es así, ¿Cuántos?","El embarazo del niño o niña usuario, fue planeado ?","Tipo de Vivienda","Tipo de tenencia de la vivienda","Años","Reconoce los riesgos que puedan afectar su vivienda\n(Naturales, actividades hechas por humanos, sociales)","Numero de personas que conforman el nucleo familar y conviven en la misma vivienda","¿ Las niñas y niños duermen con adultos en la misma habitación?","¿ Las niñas o niños duermen con adultos en la misma cama?","¿La vivienda cuenta con espacios independientes para dormitorio, cocina y baños?","¿La vivienda cuenta con espacios aseados? (Verificación a traves de visita domiciliaria)","Hamaca","Cama","Colchoneta","Estera","Otro, ¿Cuál? ","Energia","Acueducto","Alcantarillado","Gas natural","Telefonía fija","Telefonía celular","Acueducto","Aguatero","Pozo-Aljibe","Agua Lluvia","Rio, Quebrada, Manantial","Agua embotellada o en bolsa","Pila Pública","Carro Tanque","¿El nucleo familiar recibe el servicio de agua con regularidad, es decir todos los días?","¿El agua que se usa para consumo en el hogar, se le realiza algún tratamiento? ¿Cuál?","La recoge personal del servicio de aseo","La tiran al rio o fuente hídrica","La entierran","La recoge un servicio informal","La queman","La tiran al patio o aun lote","Reutilizan los desperdicios organicos para producir abono","Otro ¿ Cual ?","Inodoro conectado al alcantarillado","Inodoro conectado a pozo séptico","Letrina","Otro, ¿cual?","¿El sanitario es de uso exclusivo para la familia o es compartido con otras familias?","Vias de acceso","Sedes educativas","Bibliotecas publicas y privadas","Centro de salud / Hospital","Chagra","Transporte publico","Ludotecas","Parques con estructura para la recreación de las niñas y los niños.","Rio","Lugares Sagrados","Otro, ¿Cuál?","Familiares","Comunidad","Amigos","No los comparten","Familiares","Comunidad","Amigos","No los comparten","¿Con quién permanece la niña o el niño una vez salen de la unidad de servicio?","Visita al parque","Lecturas ","Juegos (de mesa, rondas, etc…)","Fiestas infantiles","Ven televisión","Desarrollo de manualidades o actividades que motiven el aprendizaje","Desarrollo de artesanias y/o actividades diarias propias de su tradición y cultura","Desarrollo de actividades comunitarias (festejos familiares, rituales) ","Actividades musicales y folclóricas","Paseos familiares","Mingas ( Aplica para comunidades indigenas)","Preparación de alimentos","Rutinas de Aseo e higiene personal","Labores domesticas","Oficios relacionados con el trabajo de los padres","Labores exclusivas de la Madre","Labores exclusivas del Padre","Se delega a otros miembros de la familia","Se le delega a hermanos mayores","El Padre y Madre/ Padastro y Madrastra, comparten labores y responsabilidades","Problemas económicos","Manejo de autoridad","Falta de comunicación","Permitir que otras personas ajenas al núcleo familiar opinen sobre la dinámica familiar","Menjo de tiempo y reponsabilidades","Abandono","Otro, ¿cual?","Dialogando","Con agresión física","Indiferencia","Con agresión verbal","Otras personas ajenas al nucleo familiar se involucran para dar solución","No se solucionan","Recoger sus juguetes","Organización de espacios de la vivienda","Otras rutinas de aseo e higiene","Cuidado de mascotas","Otro, ¿cual?","Le da un regalo","Lo dejan salir a jugar","Lo felicitan verbalmente","Otro, ¿cual?"]

{"sheet":"Consulta Mod I y III","index":8,"n_rows":174,"n_cols":9,"rows_kept":174,"cut":false,"hidden":false,"merged":[[125,5,125,8],[142,5,142,8],[148,5,148,8],[156,5,156,7],[163,5,163,8],[169,5,169,8],[98,5,98,7],[99,5,99,8],[52,5,52,8],[112,5,112,8],[117,5,117,7],[123,5,123,7],[111,5,111,8],[70,5,70,8],[71,5,71,8],[81,5,81,7],[82,5,82,7],[83,5,83,7],[92,5,92,7],[53,5,53,7],[54,5,54,7],[55,5,55,7],[56,5,56,7],[57,5,57,8],[63,5,63,8],[10,5,10,8],[11,5,11,6],[20,5,20,6],[30,5,30,6],[41,5,41,7],[43,5,43,7],[47,5,47,6],[44,5,44,8],[98,0,98,2],[99,0,99,2],[100,0,100,3],[101,2,104,3],[106,0,106,3],[45,0,45,3],[85,0,85,3],[46,0,46,2],[47,0,47,2],[50,2,50,3],[51,2,51,3],[53,0,53,3],[84,0,84,3],[70,0,70,3],[79,0,79,3],[81,0,81,2],[82,0,82,2],[49,2,49,3],[92,0,92,3],[55,2,55,3],[57,0,57,3],[60,0,60,3],[69,0,69,3],[43,0,43,2],[31,0,31,3],[15,0,15,3],[10,0,10,3],[8,0,8,3],[9,1,9,2],[37,0,37,2],[38,0,38,2],[39,0,39,2],[40,0,40,2],[41,0,41,2],[42,0,42,2],[26,0,26,1],[32,0,32,2],[33,0,33,2],[34,0,34,2],[1,0,4,8],[8,5,8,8],[9,6,9,7],[35,0,35,2],[36,0,36,2],[6,0,6,2],[22,0,22,2],[23,0,23,2],[24,0,24,2]]}
[]
[]
[]
[]
[]
[]
["Diligenciar el NUIP",null,null,123]
[]
["MODULO I",null,null,null,null,"MODULO III"]
[null,"Fecha de diligenciamiento Inicial ",null,{"$f":"VLOOKUP($D$7,'Base Dat Mod I'!$A$8:$BO$999,2,0)","v":{"$error":"#N/A"}},null,null,"Fecha de diligenciamiento Inicial ",null,{"$f":"VLOOKUP(D7,'Base Dat Mod III'!A8:ED998,2,0)","v":{"$error":"#N/A"}}]
{"$rows_left_out":165}
{"sheet":"Consulta Mod II","index":9,"n_rows":57,"n_cols":5,"rows_kept":57,"cut":false,"hidden":false,"merged":[[33,1,33,4],[29,1,29,4],[1,1,4,4],[41,1,41,3],[42,1,42,3],[6,1,6,3],[8,1,8,4],[9,1,9,3],[10,1,10,4],[31,3,31,4],[20,1,20,3],[21,1,21,3],[22,1,22,3],[24,1,24,2],[39,3,39,4],[53,1,53,3],[54,1,54,3],[55,1,55,3],[56,1,56,3],[52,1,52,3],[43,1,43,3],[50,1,50,3],[45,1,45,4],[46,1,46,3],[47,1,47,3],[48,1,48,3],[49,1,49,3]]}
[]
[]
[]
[]
[]
[]
[null,"Diligenciar el documento de identidad"]
[]
[null,"MODULO II"]
[null,"Fecha de diligenciamiento Inicial ",null,null,{"$f":"VLOOKUP($E$7,'Base Dat Mod II'!$A$11:$AK$993,2,0)","v":{"$error":"#N/A"}}]
{"$rows_left_out":48}
{"sheet":"Graficos Mod I y III","index":10,"n_rows":15,"n_cols":11,"rows_kept":15,"cut":false,"hidden":false,"merged":[[8,0,8,7],[8,9,8,16]]}
[]
[]
[]
[]
[]
[]
[]
[]
["Modulo I",null,null,null,null,null,null,null,null,"Modulo III"]
[]
{"$rows_left_out":6}
{"sheet":"Graficos Mod II","index":11,"n_rows":18,"n_cols":3,"rows_kept":18,"cut":false,"hidden":false,"merged":[]}
[]
[]
[]
[]
[]
[]
[]
[]
[]
[]
{"$rows_left_out":8}